[package - 144i386-default][deskutils/taskwarrior] Failed for taskwarrior-3.5.0 in build
- Go to: [ bottom of page ] [ top of archives ] [ this month ]
Date: Tue, 15 Sep 2026 02:54:36 UTC
You are receiving this mail as a port that you maintain
is failing to build on the FreeBSD package build server.
Please investigate the failure and submit a PR to fix
build.
Maintainer: skreuzer@FreeBSD.org
Log URL: https://pkg-status.freebsd.org/beefy18/data/144i386-default/ab9b0dae6a5e/logs/taskwarrior-3.5.0.log
Build URL: https://pkg-status.freebsd.org/beefy18/build.html?mastername=144i386-default&build=ab9b0dae6a5e
Log:
=>> Building deskutils/taskwarrior
build started at Tue Sep 15 02:43:09 UTC 2026
port directory: /usr/ports/deskutils/taskwarrior
package name: taskwarrior-3.5.0
building for: FreeBSD 144i386-default-job-11 14.4-RELEASE-p9 FreeBSD 14.4-RELEASE-p9 i386
maintained by: skreuzer@FreeBSD.org
Makefile datestamp: -rw-r--r-- 1 root wheel 2179 Sep 15 01:01 /usr/ports/deskutils/taskwarrior/Makefile
Ports top last git commit: ab9b0dae6a5e47f58aee3fe0f123e558c869ee25
Ports top unclean checkout: no
Port dir last git commit: ac8fe94b91845eb013bea2cc38522aaf434b1f88
Port dir unclean checkout: no
Poudriere version: poudriere-git-3.4.8-3-gd92fb7c0
Host OSVERSION: 1600022
Jail OSVERSION: 1404000
Job Id: 11
---Begin Environment---
SHELL=/bin/sh
BLOCKSIZE=K
MAIL=/var/mail/root
MM_CHARSET=UTF-8
LANG=C.UTF-8
OSVERSION=1404000
STATUS=1
HOME=/root
PATH=/sbin:/bin:/usr/sbin:/usr/bin:/usr/local/sbin:/usr/local/bin:/root/bin
MAKE_OBJDIR_CHECK_WRITABLE=0
UNAME_m=i386
UNAME_p=i386
UNAME_r=14.4-RELEASE-p9
LOCALBASE=/usr/local
UNAME_v=FreeBSD 14.4-RELEASE-p9
USER=root
POUDRIERE_NAME=poudriere-git
LIBEXECPREFIX=/usr/local/libexec/poudriere
POUDRIERE_VERSION=3.4.8-3-gd92fb7c0
MASTERMNT=/usr/local/poudriere/data/.m/144i386-default/ref
LC_COLLATE=C
POUDRIERE_BUILD_TYPE=bulk
PACKAGE_BUILDING=yes
SAVED_TERM=
OUTPUT_REDIRECTED_STDERR=4
OUTPUT_REDIRECTED=1
PWD=/usr/local/poudriere/data/.m/144i386-default/11/.p
OUTPUT_REDIRECTED_STDOUT=3
P_PORTS_FEATURES=FLAVORS SUBPACKAGES SELECTED_OPTIONS
MASTERNAME=144i386-default
SCRIPTPREFIX=/usr/local/share/poudriere
SCRIPTNAME=bulk.sh
OLDPWD=/usr/local/poudriere/data/.m/144i386-default/ref/.p/pool
POUDRIERE_PKGNAME=poudriere-git-3.4.8-3-gd92fb7c0
SCRIPTPATH=/usr/local/share/poudriere/bulk.sh
POUDRIEREPATH=/usr/local/bin/poudriere
---End Environment---
---Begin Poudriere Port Flags/Env---
PORT_FLAGS=
PKGENV=
FLAVOR=
MAKE_ARGS=
---End Poudriere Port Flags/Env---
---Begin OPTIONS List---
---End OPTIONS List---
--MAINTAINER--
skreuzer@FreeBSD.org
--End MAINTAINER--
--CONFIGURE_ARGS--
--End CONFIGURE_ARGS--
--CONFIGURE_ENV--
CARGO_HOME=/wrkdirs/usr/ports/deskutils/taskwarrior/work/cargo-home CARGO_BUILD_JOBS=3 CARGO_TARGET_DIR=/wrkdirs/usr/ports/deskutils/taskwarrior/work/target RUSTC=/usr/local/bin/rustc RUSTDOC=/usr/local/bin/rustdoc RUSTFLAGS=" -C linker=cc " RUST_BACKTRACE=1 CARGO_PROFILE_RELEASE_LTO="true" CARGO_PROFILE_RELEASE_PANIC="abort" CARGO_PROFILE_RELEASE_CODEGEN_UNITS=1 PKG_CONFIG=pkgconf PYTHON="/usr/local/bin/python3.12" XDG_DATA_HOME=/wrkdirs/usr/ports/deskutils/taskwarrior/work XDG_CONFIG_HOME=/wrkdirs/usr/ports/deskutils/taskwarrior/work XDG_CACHE_HOME=/wrkdirs/usr/ports/deskutils/taskwarrior/work/.cache HOME=/wrkdirs/usr/ports/deskutils/taskwarrior/work TMPDIR="/wrkdirs/usr/ports/deskutils/taskwarrior/work" PATH=/wrkdirs/usr/ports/deskutils/taskwarrior/work/.bin:/sbin:/bin:/usr/sbin:/usr/bin:/usr/local/sbin:/usr/local/bin:/root/bin PKG_CONFIG_LIBDIR=/wrkdirs/usr/ports/deskutils/taskwarrior/work/.pkgconfig:/usr/local/libdata/pkgconfig:/usr/local/share/pkgconfig:/usr/
libdata/pkgconfig SHELL=/bin/sh CONFIG_SHELL=/bin/sh
--End CONFIGURE_ENV--
--MAKE_ENV--
CARGO_HOME=/wrkdirs/usr/ports/deskutils/taskwarrior/work/cargo-home CARGO_BUILD_JOBS=3 CARGO_TARGET_DIR=/wrkdirs/usr/ports/deskutils/taskwarrior/work/target RUSTC=/usr/local/bin/rustc RUSTDOC=/usr/local/bin/rustdoc RUSTFLAGS=" -C linker=cc " RUST_BACKTRACE=1 CARGO_PROFILE_RELEASE_LTO="true" CARGO_PROFILE_RELEASE_PANIC="abort" CARGO_PROFILE_RELEASE_CODEGEN_UNITS=1 NINJA_STATUS="[%p %s/%t] " XDG_DATA_HOME=/wrkdirs/usr/ports/deskutils/taskwarrior/work XDG_CONFIG_HOME=/wrkdirs/usr/ports/deskutils/taskwarrior/work XDG_CACHE_HOME=/wrkdirs/usr/ports/deskutils/taskwarrior/work/.cache HOME=/wrkdirs/usr/ports/deskutils/taskwarrior/work TMPDIR="/wrkdirs/usr/ports/deskutils/taskwarrior/work" PATH=/wrkdirs/usr/ports/deskutils/taskwarrior/work/.bin:/sbin:/bin:/usr/sbin:/usr/bin:/usr/local/sbin:/usr/local/bin:/root/bin PKG_CONFIG_LIBDIR=/wrkdirs/usr/ports/deskutils/taskwarrior/work/.pkgconfig:/usr/local/libdata/pkgconfig:/usr/local/share/pkgconfig:/usr/libdata/pkgconfig MK_DEBUG_
FILES=no MK_KERNEL_SYMBOLS=no SHELL=/bin/sh NO_LINT=YES DESTDIR=/wrkdirs/usr/ports/deskutils/taskwarrior/work/stage PREFIX=/usr/local LOCALBASE=/usr/local CC="cc" CFLAGS="-O2 -pipe -fstack-protector-strong -fno-strict-aliasing " CPP="cpp" CPPFLAGS="" LDFLAGS=" " LIBS="" CXX="c++" CXXFLAGS="-O2 -pipe -fstack-protector-strong -fno-strict-aliasing " BSD_INSTALL_PROGRAM="install -s -m 555" BSD_INSTALL_LIB="install -s -m 0644" BSD_INSTALL_SCRIPT="install -m 555" BSD_INSTALL_DATA="install -m 0644" BSD_INSTALL_MAN="install -m 444"
--End MAKE_ENV--
--PLIST_SUB--
CMAKE_BUILD_TYPE="release" PYTHON_INCLUDEDIR=include/python3.12 PYTHON_LIBDIR=lib/python3.12 PYTHON_PLATFORM=freebsd14 PYTHON_SITELIBDIR=lib/python3.12/site-packages PYTHON_SUFFIX=312 PYTHON_BASESUFFIX=312 PYTHON_TAG=.cpython-312 PYTHON_SOABI=.cpython-312 PYTHON_VER=3.12 PYTHON_BASEVER=3.12 PYTHON_VERSION=python3.12 PYTHON2="@comment " PYTHON3="" OSREL=14.4 PREFIX=%D LOCALBASE=/usr/local RESETPREFIX=/usr/local LIB32DIR=lib DOCSDIR="share/doc/taskwarrior" EXAMPLESDIR="share/examples/taskwarrior" DATADIR="share/taskwarrior" WWWDIR="www/taskwarrior" ETCDIR="etc/taskwarrior"
--End PLIST_SUB--
--SUB_LIST--
PYTHON_INCLUDEDIR=/usr/local/include/python3.12 PYTHON_LIBDIR=/usr/local/lib/python3.12 PYTHON_PLATFORM=freebsd14 PYTHON_SITELIBDIR=/usr/local/lib/python3.12/site-packages PYTHON_SUFFIX=312 PYTHON_BASESUFFIX=312 PYTHON_TAG=.cpython-312 PYTHON_SOABI=.cpython-312 PYTHON_VER=3.12 PYTHON_BASEVER=3.12 PYTHON_VERSION=python3.12 PYTHON2="@comment " PYTHON3="" PREFIX=/usr/local LOCALBASE=/usr/local DATADIR=/usr/local/share/taskwarrior DOCSDIR=/usr/local/share/doc/taskwarrior EXAMPLESDIR=/usr/local/share/examples/taskwarrior WWWDIR=/usr/local/www/taskwarrior ETCDIR=/usr/local/etc/taskwarrior
--End SUB_LIST--
---Begin make.conf---
USE_PACKAGE_DEPENDS=yes
BATCH=yes
WRKDIRPREFIX=/wrkdirs
PORTSDIR=/usr/ports
PACKAGES=/packages
DISTDIR=/distfiles
PACKAGE_BUILDING=yes
PACKAGE_BUILDING_FLAVORS=yes
MACHINE=i386
MACHINE_ARCH=i386
ARCH=${MACHINE_ARCH}
#### ####
# XXX: We really need this but cannot use it while 'make checksum' does not
# try the next mirror on checksum failure. It currently retries the same
# failed mirror and then fails rather then trying another. It *does*
# try the next if the size is mismatched though.
#MASTER_SITE_FREEBSD=yes
# Build ALLOW_MAKE_JOBS_PACKAGES with 3 jobs
MAKE_JOBS_NUMBER=3
#### Misc Poudriere ####
.include "/etc/make.conf.ports_env"
GID=0
UID=0
---End make.conf---
--Resource limits--
cpu time (seconds, -t) unlimited
file size (512-blocks, -f) unlimited
data seg size (kbytes, -d) 524288
stack size (kbytes, -s) 65536
core file size (512-blocks, -c) unlimited
max memory size (kbytes, -m) unlimited
locked memory (kbytes, -l) unlimited
max user processes (-u) 89999
open files (-n) 8192
virtual mem size (kbytes, -v) unlimited
swap limit (kbytes, -w) unlimited
socket buffer size (bytes, -b) unlimited
pseudo-terminals (-p) unlimited
kqueues (-k) unlimited
umtx shared locks (-o) unlimited
pipebuf (-y) unlimited
--End resource limits--
=======================<phase: check-sanity >============================
===== env: NO_DEPENDS=yes USER=root UID=0 GID=0
===> License MIT accepted by the user
===========================================================================
=======================<phase: pkg-depends >============================
===== env: USE_PACKAGE_DEPENDS_ONLY=1 USER=root UID=0 GID=0
===> taskwarrior-3.5.0 depends on file: /usr/local/sbin/pkg - not found
===> Installing existing package /packages/All/pkg-2.8.4.pkg
[144i386-default-job-11] Installing pkg-2.8.4...
[144i386-default-job-11] Extracting pkg-2.8.4: .......... done
===> taskwarrior-3.5.0 depends on file: /usr/local/sbin/pkg - found
===> Returning to build of taskwarrior-3.5.0
===========================================================================
=======================<phase: fetch-depends >============================
===== env: USE_PACKAGE_DEPENDS_ONLY=1 USER=root UID=0 GID=0
===========================================================================
=======================<phase: fetch >============================
===== env: NO_DEPENDS=yes USER=root UID=0 GID=0
===> License MIT accepted by the user
=> rust/crates/adler2-2.0.1.crate doesn't seem to exist in /portdistfiles.
=> Attempting to fetch https://static.crates.io/crates/adler2/adler2-2.0.1.crate?dummy=/rust/crates/adler2-2.0.1.crate
rust/crates/adler2-2.0.1.crate 13 kB 8340 kBps 00s
=> rust/crates/aho-corasick-1.1.4.crate doesn't seem to exist in /portdistfiles.
=> Attempting to fetch https://static.crates.io/crates/aho-corasick/aho-corasick-1.1.4.crate?dummy=/rust/crates/aho-corasick-1.1.4.crate
rust/crates/aho-corasick-1.1.4.crate 179 kB 6155 kBps 00s
=> rust/crates/allocator-api2-0.2.21.crate doesn't seem to exist in /portdistfiles.
=> Attempting to fetch https://static.crates.io/crates/allocator-api2/allocator-api2-0.2.21.crate?dummy=/rust/crates/allocator-api2-0.2.21.crate
rust/crates/allocator-api2-0.2.21.crate 62 kB 5639 kBps 00s
=> rust/crates/android_system_properties-0.1.5.crate doesn't seem to exist in /portdistfiles.
=> Attempting to fetch https://static.crates.io/crates/android_system_properties/android_system_properties-0.1.5.crate?dummy=/rust/crates/android_system_properties-0.1.5.crate
rust/crates/android_system_properties-0.1.5.crate 5243 B 43 MBps 00s
=> rust/crates/async-stream-0.3.6.crate doesn't seem to exist in /portdistfiles.
=> Attempting to fetch https://static.crates.io/crates/async-stream/async-stream-0.3.6.crate?dummy=/rust/crates/async-stream-0.3.6.crate
rust/crates/async-stream-0.3.6.crate 13 kB 14 MBps 00s
=> rust/crates/async-stream-impl-0.3.6.crate doesn't seem to exist in /portdistfiles.
=> Attempting to fetch https://static.crates.io/crates/async-stream-impl/async-stream-impl-0.3.6.crate?dummy=/rust/crates/async-stream-impl-0.3.6.crate
rust/crates/async-stream-impl-0.3.6.crate 4312 B 36 MBps 00s
=> rust/crates/async-trait-0.1.89.crate doesn't seem to exist in /portdistfiles.
=> Attempting to fetch https://static.crates.io/crates/async-trait/async-trait-0.1.89.crate?dummy=/rust/crates/async-trait-0.1.89.crate
rust/crates/async-trait-0.1.89.crate 31 kB 6892 kBps 00s
=> rust/crates/atomic-waker-1.1.2.crate doesn't seem to exist in /portdistfiles.
=> Attempting to fetch https://static.crates.io/crates/atomic-waker/atomic-waker-1.1.2.crate?dummy=/rust/crates/atomic-waker-1.1.2.crate
rust/crates/atomic-waker-1.1.2.crate 12 kB 11 MBps 00s
=> rust/crates/base64-0.21.7.crate doesn't seem to exist in /portdistfiles.
=> Attempting to fetch https://static.crates.io/crates/base64/base64-0.21.7.crate?dummy=/rust/crates/base64-0.21.7.crate
rust/crates/base64-0.21.7.crate 80 kB 7842 kBps 00s
=> rust/crates/base64-0.22.1.crate doesn't seem to exist in /portdistfiles.
=> Attempting to fetch https://static.crates.io/crates/base64/base64-0.22.1.crate?dummy=/rust/crates/base64-0.22.1.crate
rust/crates/base64-0.22.1.crate 79 kB 4087 kBps 00s
=> rust/crates/base64ct-1.8.3.crate doesn't seem to exist in /portdistfiles.
=> Attempting to fetch https://static.crates.io/crates/base64ct/base64ct-1.8.3.crate?dummy=/rust/crates/base64ct-1.8.3.crate
rust/crates/base64ct-1.8.3.crate 31 kB 4895 kBps 00s
=> rust/crates/block-buffer-0.10.4.crate doesn't seem to exist in /portdistfiles.
=> Attempting to fetch https://static.crates.io/crates/block-buffer/block-buffer-0.10.4.crate?dummy=/rust/crates/block-buffer-0.10.4.crate
rust/crates/block-buffer-0.10.4.crate 10 kB 2578 kBps 00s
=> rust/crates/bs58-0.5.1.crate doesn't seem to exist in /portdistfiles.
=> Attempting to fetch https://static.crates.io/crates/bs58/bs58-0.5.1.crate?dummy=/rust/crates/bs58-0.5.1.crate
rust/crates/bs58-0.5.1.crate 27 kB 8689 kBps 00s
=> rust/crates/byteorder-1.5.0.crate doesn't seem to exist in /portdistfiles.
=> Attempting to fetch https://static.crates.io/crates/byteorder/byteorder-1.5.0.crate?dummy=/rust/crates/byteorder-1.5.0.crate
rust/crates/byteorder-1.5.0.crate 22 kB 18 MBps 00s
=> rust/crates/bytes-1.11.1.crate doesn't seem to exist in /portdistfiles.
=> Attempting to fetch https://static.crates.io/crates/bytes/bytes-1.11.1.crate?dummy=/rust/crates/bytes-1.11.1.crate
rust/crates/bytes-1.11.1.crate 76 kB 6314 kBps 00s
=> rust/crates/cfg_aliases-0.2.1.crate doesn't seem to exist in /portdistfiles.
=> Attempting to fetch https://static.crates.io/crates/cfg_aliases/cfg_aliases-0.2.1.crate?dummy=/rust/crates/cfg_aliases-0.2.1.crate
rust/crates/cfg_aliases-0.2.1.crate 6355 B 61 MBps 00s
<snip>
Compiling serde_derive v1.0.228
Compiling rustls v0.23.40
Compiling try-lock v0.2.5
Compiling tower-service v0.3.3
Compiling zmij v1.0.21
Compiling want v0.3.1
Compiling rustls-webpki v0.103.13
Compiling url v2.5.8
Compiling aws-smithy-eventstream v0.60.20
Compiling futures-channel v0.3.32
Compiling subtle v2.6.1
Compiling unicase v2.9.0
Compiling semver v1.0.28
Compiling atomic-waker v1.1.2
Compiling cpufeatures v0.3.0
Compiling serde_json v1.0.149
Compiling rustc_version v0.4.1
Compiling hyper v1.9.0
Compiling mime_guess v2.0.5
Compiling aws-smithy-http v0.63.6
Compiling sync_wrapper v1.0.2
Compiling ipnet v2.12.0
Compiling openssl-probe v0.2.1
Compiling hex v0.4.3
Compiling tower-layer v0.3.3
Compiling getrandom v0.4.2
Compiling bitflags v2.11.1
Compiling tower v0.5.3
Compiling rustls-native-certs v0.8.3
Compiling hyper-util v0.1.20
Compiling tokio-rustls v0.26.4
Compiling aws-types v1.3.15
Compiling sha2 v0.11.0
Compiling crypto-common v0.1.7
Compiling block-buffer v0.10.4
Compiling webpki-roots v1.0.7
Compiling aws-credential-types v1.2.14
Compiling foldhash v0.2.0
Compiling thiserror v1.0.69
Compiling thiserror v2.0.18
Compiling futures-sink v0.3.32
Compiling mime v0.3.17
Compiling tokio-util v0.7.18
Compiling hyper-rustls v0.27.9
Compiling digest v0.10.7
Compiling tower-http v0.6.10
Compiling serde_urlencoded v0.7.1
Compiling hmac v0.13.0
Compiling aws-smithy-observability v0.2.6
Compiling thiserror-impl v2.0.18
Compiling thiserror-impl v1.0.69
Compiling encoding_rs v0.8.35
Compiling rustversion v1.0.22
Compiling strsim v0.11.1
Compiling fastrand v2.4.1
Compiling equivalent v1.0.2
Compiling hashbrown v0.17.1
Compiling ident_case v1.0.1
Compiling allocator-api2 v0.2.21
Compiling log v0.4.29
Compiling base64ct v1.8.3
Compiling urlencoding v2.1.3
Compiling pem-rfc7468 v0.7.0
Compiling indexmap v2.14.0
Compiling reqwest v0.12.28
Compiling hashbrown v0.16.1
Compiling darling_core v0.23.0
Compiling aws-smithy-runtime v1.11.1
Compiling aws-sigv4 v1.4.3
Compiling uuid v1.23.1
Compiling num-bigint v0.4.6
Compiling async-trait v0.1.89
Compiling link-cplusplus v1.0.12
Compiling syn v3.0.3
Compiling scratch v1.0.9
Compiling xmlparser v0.13.6
Compiling pkg-config v0.3.33
Compiling const-oid v0.9.6
Compiling vcpkg v0.2.15
Compiling anyhow v1.0.103
Compiling crc-catalog v2.5.0
Compiling crc v3.3.0
Compiling der v0.7.10
Compiling libsqlite3-sys v0.37.0
Compiling aws-smithy-xml v0.60.15
Compiling simple_asn1 v0.6.4
Compiling aws-runtime v1.7.3
Compiling darling_macro v0.23.0
Compiling pem v3.0.6
Compiling aho-corasick v1.1.4
Compiling aws-smithy-json v0.62.5
Compiling unicode-width v0.2.2
Compiling termcolor v1.4.1
Compiling cxxbridge-flags v1.0.199
Compiling regex-lite v0.1.9
Compiling spin v0.10.0
Compiling regex-syntax v0.8.10
Compiling crc-fast v1.9.0
Compiling cxx v1.0.199
Compiling codespan-reporting v0.13.1
Compiling regex-automata v0.4.14
Compiling jsonwebtoken v9.3.1
Compiling darling v0.23.0
Compiling spki v0.7.3
Compiling google-cloud-token v0.1.2
Compiling google-cloud-metadata v0.5.1
Compiling aws-smithy-query v0.60.15
Compiling sha1 v0.11.0
Compiling md-5 v0.11.0
Compiling async-stream-impl v0.3.6
Compiling simd-adler32 v0.3.9
Compiling home v0.5.12
Compiling adler2 v2.0.1
Compiling cpufeatures v0.2.17
Compiling base64 v0.21.7
Compiling google-cloud-auth v0.17.2
Compiling sha2 v0.10.9
Compiling miniz_oxide v0.8.9
Compiling async-stream v0.3.6
Compiling aws-smithy-checksums v0.64.7
Compiling aws-sdk-sts v1.103.0
Compiling reqwest-middleware v0.4.2
Compiling cxx-build v1.0.199
Compiling pkcs8 v0.10.2
Compiling serde_with_macros v3.21.0
Compiling regex v1.12.3
Compiling hashlink v0.11.0
Compiling lru v0.16.4
Compiling fallible-iterator v0.3.0
Compiling fallible-streaming-iterator v0.1.9
Compiling heck v0.5.0
Compiling iana-time-zone v0.1.65
Compiling chrono v0.4.44
Compiling strum_macros v0.28.0
Compiling aws-sdk-s3 v1.132.0
Compiling google-cloud-storage v0.24.0
Compiling rusqlite v0.39.0
Compiling serde_with v3.21.0
Compiling taskchampion-lib v0.1.0 (/wrkdirs/usr/ports/deskutils/taskwarrior/work/taskwarrior-3.5.0/src/taskchampion-cpp)
Compiling aws-config v1.8.16
Compiling flate2 v1.1.9
Compiling cxxbridge-macro v1.0.199
Compiling glob v0.3.3
Compiling byteorder v1.5.0
Compiling strum v0.28.0
Compiling taskchampion v3.1.0
Finished `release` profile [optimized] target(s) in 10m 41s
[ 0% 3/135] /usr/bin/c++ -I/wrkdirs/usr/ports/deskutils/taskwarrior/work/taskwarrior-3.5.0 -I/wrkdirs/usr/ports/deskutils/taskwarrior/work/taskwarrior-3.5.0/src -I/wrkdirs/usr/ports/deskutils/taskwarrior/work/taskwarrior-3.5.0/src/commands -I/wrkdirs/usr/ports/deskutils/taskwarrior/work/taskwarrior-3.5.0/src/columns -I/wrkdirs/usr/ports/deskutils/taskwarrior/work/taskwarrior-3.5.0/src/libshared/src -Wall -Wextra -Wsign-compare -Wreturn-type -O2 -pipe -fstack-protector-strong -fno-strict-aliasing -Wno-return-type-c-linkage -O2 -pipe -fstack-protector-strong -fno-strict-aliasing -DNDEBUG -std=c++17 -MD -MT src/CMakeFiles/libshared.dir/libshared/src/Color.cpp.o -MF src/CMakeFiles/libshared.dir/libshared/src/Color.cpp.o.d -o src/CMakeFiles/libshared.dir/libshared/src/Color.cpp.o -c /wrkdirs/usr/ports/deskutils/taskwarrior/work/taskwarrior-3.5.0/src/libshared/src/Color.cpp
/wrkdirs/usr/ports/deskutils/taskwarrior/work/taskwarrior-3.5.0/src/libshared/src/Color.cpp:261:27: warning: shift count >= width of type [-Wshift-count-overflow]
261 | bg_value |= color << 32;
| ^ ~~
/wrkdirs/usr/ports/deskutils/taskwarrior/work/taskwarrior-3.5.0/src/libshared/src/Color.cpp:475:57: warning: shift count >= width of type [-Wshift-count-overflow]
475 | _value |= ((unsigned long int)(index2truecolor(bg)) << 32);
| ^ ~~
/wrkdirs/usr/ports/deskutils/taskwarrior/work/taskwarrior-3.5.0/src/libshared/src/Color.cpp:592:32: warning: shift count >= width of type [-Wshift-count-overflow]
592 | result += format((_value >> 48) & 0xFF) + ';';
| ^ ~~
/wrkdirs/usr/ports/deskutils/taskwarrior/work/taskwarrior-3.5.0/src/libshared/src/Color.cpp:593:32: warning: shift count >= width of type [-Wshift-count-overflow]
593 | result += format((_value >> 40) & 0xFF) + ';';
| ^ ~~
/wrkdirs/usr/ports/deskutils/taskwarrior/work/taskwarrior-3.5.0/src/libshared/src/Color.cpp:594:32: warning: shift count >= width of type [-Wshift-count-overflow]
594 | result += format((_value >> 32) & 0xFF);
| ^ ~~
/wrkdirs/usr/ports/deskutils/taskwarrior/work/taskwarrior-3.5.0/src/libshared/src/Color.cpp:674:32: warning: shift count >= width of type [-Wshift-count-overflow]
674 | result += format((_value >> 48) & 0xFF) + ';';
| ^ ~~
/wrkdirs/usr/ports/deskutils/taskwarrior/work/taskwarrior-3.5.0/src/libshared/src/Color.cpp:675:32: warning: shift count >= width of type [-Wshift-count-overflow]
675 | result += format((_value >> 40) & 0xFF) + ';';
| ^ ~~
/wrkdirs/usr/ports/deskutils/taskwarrior/work/taskwarrior-3.5.0/src/libshared/src/Color.cpp:676:32: warning: shift count >= width of type [-Wshift-count-overflow]
676 | result += format((_value >> 32) & 0xFF);
| ^ ~~
8 warnings generated.
[ 2% 5/135] /usr/bin/c++ -I/wrkdirs/usr/ports/deskutils/taskwarrior/work/taskwarrior-3.5.0 -I/wrkdirs/usr/ports/deskutils/taskwarrior/work/taskwarrior-3.5.0/src -I/wrkdirs/usr/ports/deskutils/taskwarrior/work/taskwarrior-3.5.0/src/commands -I/wrkdirs/usr/ports/deskutils/taskwarrior/work/taskwarrior-3.5.0/src/columns -I/wrkdirs/usr/ports/deskutils/taskwarrior/work/taskwarrior-3.5.0/src/libshared/src -Wall -Wextra -Wsign-compare -Wreturn-type -O2 -pipe -fstack-protector-strong -fno-strict-aliasing -Wno-return-type-c-linkage -O2 -pipe -fstack-protector-strong -fno-strict-aliasing -DNDEBUG -std=c++17 -MD -MT src/CMakeFiles/libshared.dir/libshared/src/Datetime.cpp.o -MF src/CMakeFiles/libshared.dir/libshared/src/Datetime.cpp.o.d -o src/CMakeFiles/libshared.dir/libshared/src/Datetime.cpp.o -c /wrkdirs/usr/ports/deskutils/taskwarrior/work/taskwarrior-3.5.0/src/libshared/src/Datetime.cpp
FAILED: [code=1] src/CMakeFiles/libshared.dir/libshared/src/Datetime.cpp.o
/usr/bin/c++ -I/wrkdirs/usr/ports/deskutils/taskwarrior/work/taskwarrior-3.5.0 -I/wrkdirs/usr/ports/deskutils/taskwarrior/work/taskwarrior-3.5.0/src -I/wrkdirs/usr/ports/deskutils/taskwarrior/work/taskwarrior-3.5.0/src/commands -I/wrkdirs/usr/ports/deskutils/taskwarrior/work/taskwarrior-3.5.0/src/columns -I/wrkdirs/usr/ports/deskutils/taskwarrior/work/taskwarrior-3.5.0/src/libshared/src -Wall -Wextra -Wsign-compare -Wreturn-type -O2 -pipe -fstack-protector-strong -fno-strict-aliasing -Wno-return-type-c-linkage -O2 -pipe -fstack-protector-strong -fno-strict-aliasing -DNDEBUG -std=c++17 -MD -MT src/CMakeFiles/libshared.dir/libshared/src/Datetime.cpp.o -MF src/CMakeFiles/libshared.dir/libshared/src/Datetime.cpp.o.d -o src/CMakeFiles/libshared.dir/libshared/src/Datetime.cpp.o -c /wrkdirs/usr/ports/deskutils/taskwarrior/work/taskwarrior-3.5.0/src/libshared/src/Datetime.cpp
/wrkdirs/usr/ports/deskutils/taskwarrior/work/taskwarrior-3.5.0/src/libshared/src/Datetime.cpp:3821:12: error: non-constant-expression cannot be narrowed from type 'int64_t' (aka 'long long') to 'time_t' (aka 'int') in initializer list [-Wc++11-narrowing]
3821 | return { _date + delta };
| ^~~~~~~~~~~~~
/wrkdirs/usr/ports/deskutils/taskwarrior/work/taskwarrior-3.5.0/src/libshared/src/Datetime.cpp:3821:12: note: insert an explicit cast to silence this issue
3821 | return { _date + delta };
| ^~~~~~~~~~~~~
| static_cast<time_t>( )
/wrkdirs/usr/ports/deskutils/taskwarrior/work/taskwarrior-3.5.0/src/libshared/src/Datetime.cpp:3827:12: error: non-constant-expression cannot be narrowed from type 'int64_t' (aka 'long long') to 'time_t' (aka 'int') in initializer list [-Wc++11-narrowing]
3827 | return { _date - delta };
| ^~~~~~~~~~~~~
/wrkdirs/usr/ports/deskutils/taskwarrior/work/taskwarrior-3.5.0/src/libshared/src/Datetime.cpp:3827:12: note: insert an explicit cast to silence this issue
3827 | return { _date - delta };
| ^~~~~~~~~~~~~
| static_cast<time_t>( )
2 errors generated.
[ 2% 5/135] /usr/bin/c++ -I/wrkdirs/usr/ports/deskutils/taskwarrior/work/taskwarrior-3.5.0 -I/wrkdirs/usr/ports/deskutils/taskwarrior/work/taskwarrior-3.5.0/src -I/wrkdirs/usr/ports/deskutils/taskwarrior/work/taskwarrior-3.5.0/src/commands -I/wrkdirs/usr/ports/deskutils/taskwarrior/work/taskwarrior-3.5.0/src/columns -I/wrkdirs/usr/ports/deskutils/taskwarrior/work/taskwarrior-3.5.0/src/libshared/src -Wall -Wextra -Wsign-compare -Wreturn-type -O2 -pipe -fstack-protector-strong -fno-strict-aliasing -Wno-return-type-c-linkage -O2 -pipe -fstack-protector-strong -fno-strict-aliasing -DNDEBUG -std=c++17 -MD -MT src/CMakeFiles/libshared.dir/libshared/src/Duration.cpp.o -MF src/CMakeFiles/libshared.dir/libshared/src/Duration.cpp.o.d -o src/CMakeFiles/libshared.dir/libshared/src/Duration.cpp.o -c /wrkdirs/usr/ports/deskutils/taskwarrior/work/taskwarrior-3.5.0/src/libshared/src/Duration.cpp
ninja: build stopped: subcommand failed.
===> Compilation failed unexpectedly.
Try to set MAKE_JOBS_UNSAFE=yes and rebuild before reporting the failure to
the maintainer.
*** Error code 1
Stop.
make: stopped making "build" in /usr/ports/deskutils/taskwarrior