[package - main-amd64-default][devel/bazel5] Failed for bazel5-5.4.1_2 in build
- Go to: [ bottom of page ] [ top of archives ] [ this month ]
Date: Sat, 05 Sep 2026 01:27:58 UTC
You are receiving this mail as a port that you maintain
is failing to build on the FreeBSD package build server.
Please investigate the failure and submit a PR to fix
build.
Maintainer: vishwin@FreeBSD.org
Log URL: https://pkg-status.freebsd.org/beefy24/data/main-amd64-default/p2311e6d81e23_s6e1436d748/logs/bazel5-5.4.1_2.log
Build URL: https://pkg-status.freebsd.org/beefy24/build.html?mastername=main-amd64-default&build=p2311e6d81e23_s6e1436d748
Log:
=>> Building devel/bazel5
build started at Sat Sep 5 01:22:37 UTC 2026
port directory: /usr/ports/devel/bazel5
package name: bazel5-5.4.1_2
building for: FreeBSD main-amd64-default-job-30 16.0-CURRENT FreeBSD 16.0-CURRENT 1600022 amd64
maintained by: vishwin@FreeBSD.org
Makefile datestamp: -rw-r--r-- 1 root wheel 3877 Apr 4 01:01 /usr/ports/devel/bazel5/Makefile
Ports top last git commit: 2311e6d81e23fd9fa8d7a6fb14e403978fa3afdd
Ports top unclean checkout: no
Port dir last git commit: 86813e9ccf597695e26c8104e678f913689f1e93
Port dir unclean checkout: no
Poudriere version: poudriere-git-3.4.8-2-g2e891d4a
Host OSVERSION: 1600019
Jail OSVERSION: 1600022
Job Id: 30
!!! Jail is newer than host. (Jail: 1600022, Host: 1600019) !!!
!!! This is not supported. !!!
!!! Host kernel must be same or newer than jail. !!!
!!! Expect build failures. !!!
---Begin Environment---
SHELL=/bin/sh
OSVERSION=1600022
UNAME_v=FreeBSD 16.0-CURRENT 1600022
UNAME_r=16.0-CURRENT
BLOCKSIZE=K
MAIL=/var/mail/root
MM_CHARSET=UTF-8
LANG=C.UTF-8
STATUS=1
HOME=/root
PATH=/sbin:/bin:/usr/sbin:/usr/bin:/usr/local/sbin:/usr/local/bin:/root/bin
MAKE_OBJDIR_CHECK_WRITABLE=0
LOCALBASE=/usr/local
USER=root
POUDRIERE_NAME=poudriere-git
LIBEXECPREFIX=/usr/local/libexec/poudriere
POUDRIERE_VERSION=3.4.8-2-g2e891d4a
MASTERMNT=/usr/local/poudriere/data/.m/main-amd64-default/ref
LC_COLLATE=C
POUDRIERE_BUILD_TYPE=bulk
PACKAGE_BUILDING=yes
SAVED_TERM=
OUTPUT_REDIRECTED_STDERR=4
OUTPUT_REDIRECTED=1
PWD=/usr/local/poudriere/data/.m/main-amd64-default/30/.p
OUTPUT_REDIRECTED_STDOUT=3
P_PORTS_FEATURES=FLAVORS SUBPACKAGES SELECTED_OPTIONS
MASTERNAME=main-amd64-default
SCRIPTPREFIX=/usr/local/share/poudriere
SCRIPTNAME=bulk.sh
OLDPWD=/usr/local/poudriere/data/.m/main-amd64-default/ref/.p/pool
POUDRIERE_PKGNAME=poudriere-git-3.4.8-2-g2e891d4a
SCRIPTPATH=/usr/local/share/poudriere/bulk.sh
POUDRIEREPATH=/usr/local/bin/poudriere
---End Environment---
---Begin Poudriere Port Flags/Env---
PORT_FLAGS=
PKGENV=
FLAVOR=
MAKE_ARGS=
---End Poudriere Port Flags/Env---
---Begin OPTIONS List---
---End OPTIONS List---
--MAINTAINER--
vishwin@FreeBSD.org
--End MAINTAINER--
--CONFIGURE_ARGS--
--End CONFIGURE_ARGS--
--CONFIGURE_ENV--
PYTHON="/usr/local/bin/python3.12" XDG_DATA_HOME=/wrkdirs/usr/ports/devel/bazel5/work XDG_CONFIG_HOME=/wrkdirs/usr/ports/devel/bazel5/work XDG_CACHE_HOME=/wrkdirs/usr/ports/devel/bazel5/work/.cache HOME=/wrkdirs/usr/ports/devel/bazel5/work TMPDIR="/tmp" PATH=/wrkdirs/usr/ports/devel/bazel5/work/.bin:/sbin:/bin:/usr/sbin:/usr/bin:/usr/local/sbin:/usr/local/bin:/root/bin PKG_CONFIG_LIBDIR=/wrkdirs/usr/ports/devel/bazel5/work/.pkgconfig:/usr/local/libdata/pkgconfig:/usr/local/share/pkgconfig:/usr/libdata/pkgconfig SHELL=/bin/sh CONFIG_SHELL=/bin/sh
--End CONFIGURE_ENV--
--MAKE_ENV--
XDG_DATA_HOME=/wrkdirs/usr/ports/devel/bazel5/work XDG_CONFIG_HOME=/wrkdirs/usr/ports/devel/bazel5/work XDG_CACHE_HOME=/wrkdirs/usr/ports/devel/bazel5/work/.cache HOME=/wrkdirs/usr/ports/devel/bazel5/work TMPDIR="/tmp" PATH=/wrkdirs/usr/ports/devel/bazel5/work/.bin:/sbin:/bin:/usr/sbin:/usr/bin:/usr/local/sbin:/usr/local/bin:/root/bin PKG_CONFIG_LIBDIR=/wrkdirs/usr/ports/devel/bazel5/work/.pkgconfig:/usr/local/libdata/pkgconfig:/usr/local/share/pkgconfig:/usr/libdata/pkgconfig MK_DEBUG_FILES=no MK_KERNEL_SYMBOLS=no SHELL=/bin/sh NO_LINT=YES PREFIX=/usr/local LOCALBASE=/usr/local CC="cc" CFLAGS="-O2 -pipe -fstack-protector-strong -fno-strict-aliasing " CPP="cpp" CPPFLAGS="" LDFLAGS=" " LIBS="" CXX="c++" CXXFLAGS="-O2 -pipe -fstack-protector-strong -fno-strict-aliasing " BSD_INSTALL_PROGRAM="install -m 555" BSD_INSTALL_LIB="install -m 0644" BSD_INSTALL_SCRIPT="install -m 555" BSD_INSTALL_DATA="install -m 0644" BSD_INSTALL_MAN="install -m 444"
--End MAKE_ENV--
--PLIST_SUB--
JAVASHAREDIR="share/java" JAVAJARDIR="share/java/classes" PYTHON_INCLUDEDIR=include/python3.12 PYTHON_LIBDIR=lib/python3.12 PYTHON_PLATFORM=freebsd16 PYTHON_SITELIBDIR=lib/python3.12/site-packages PYTHON_SUFFIX=312 PYTHON_BASESUFFIX=312 PYTHON_TAG=.cpython-312 PYTHON_SOABI=.cpython-312 PYTHON_VER=3.12 PYTHON_BASEVER=3.12 PYTHON_VERSION=python3.12 PYTHON2="@comment " PYTHON3="" OSREL=16.0 PREFIX=%D LOCALBASE=/usr/local RESETPREFIX=/usr/local LIB32DIR=lib DOCSDIR="share/doc/bazel" EXAMPLESDIR="share/examples/bazel" DATADIR="share/bazel" WWWDIR="www/bazel" ETCDIR="etc/bazel"
--End PLIST_SUB--
--SUB_LIST--
JAVASHAREDIR="/usr/local/share/java" JAVAJARDIR="/usr/local/share/java/classes" JAVALIBDIR="/usr/local/share/java/classes" JAVA_VERSION="11" JAVA_VENDOR="openjdk" PYTHON_INCLUDEDIR=/usr/local/include/python3.12 PYTHON_LIBDIR=/usr/local/lib/python3.12 PYTHON_PLATFORM=freebsd16 PYTHON_SITELIBDIR=/usr/local/lib/python3.12/site-packages PYTHON_SUFFIX=312 PYTHON_BASESUFFIX=312 PYTHON_TAG=.cpython-312 PYTHON_SOABI=.cpython-312 PYTHON_VER=3.12 PYTHON_BASEVER=3.12 PYTHON_VERSION=python3.12 PYTHON2="@comment " PYTHON3="" PREFIX=/usr/local LOCALBASE=/usr/local DATADIR=/usr/local/share/bazel DOCSDIR=/usr/local/share/doc/bazel EXAMPLESDIR=/usr/local/share/examples/bazel WWWDIR=/usr/local/www/bazel ETCDIR=/usr/local/etc/bazel
--End SUB_LIST--
---Begin make.conf---
USE_PACKAGE_DEPENDS=yes
BATCH=yes
WRKDIRPREFIX=/wrkdirs
PORTSDIR=/usr/ports
PACKAGES=/packages
DISTDIR=/distfiles
PACKAGE_BUILDING=yes
PACKAGE_BUILDING_FLAVORS=yes
#### ####
# XXX: We really need this but cannot use it while 'make checksum' does not
# try the next mirror on checksum failure. It currently retries the same
# failed mirror and then fails rather then trying another. It *does*
# try the next if the size is mismatched though.
#MASTER_SITE_FREEBSD=yes
# Build ALLOW_MAKE_JOBS_PACKAGES with 3 jobs
MAKE_JOBS_NUMBER=3
#### Misc Poudriere ####
.include "/etc/make.conf.ports_env"
GID=0
UID=0
---End make.conf---
--Resource limits--
cpu time (seconds, -t) unlimited
file size (512-blocks, -f) unlimited
data seg size (kbytes, -d) 33554432
stack size (kbytes, -s) 524288
core file size (512-blocks, -c) unlimited
max memory size (kbytes, -m) unlimited
locked memory (kbytes, -l) unlimited
max user processes (-u) 89999
open files (-n) 8192
virtual mem size (kbytes, -v) unlimited
swap limit (kbytes, -w) unlimited
socket buffer size (bytes, -b) unlimited
pseudo-terminals (-p) unlimited
kqueues (-k) unlimited
umtx shared locks (-o) unlimited
pipebuf (kbytes, -y) unlimited
virtual machines (-V) unlimited
--End resource limits--
=======================<phase: check-sanity >============================
===== env: NO_DEPENDS=yes USER=root UID=0 GID=0
===> License APACHE20 accepted by the user
===========================================================================
=======================<phase: pkg-depends >============================
===== env: USE_PACKAGE_DEPENDS_ONLY=1 USER=root UID=0 GID=0
===> bazel5-5.4.1_2 depends on file: /usr/local/sbin/pkg - not found
===> Installing existing package /packages/All/pkg-2.8.4.pkg
[main-amd64-default-job-30] Installing pkg-2.8.4...
[main-amd64-default-job-30] Extracting pkg-2.8.4: .......... done
===> bazel5-5.4.1_2 depends on file: /usr/local/sbin/pkg - found
===> Returning to build of bazel5-5.4.1_2
===========================================================================
=======================<phase: fetch-depends >============================
===== env: USE_PACKAGE_DEPENDS_ONLY=1 USER=root UID=0 GID=0
===========================================================================
=======================<phase: fetch >============================
===== env: NO_DEPENDS=yes USER=root UID=0 GID=0
===> License APACHE20 accepted by the user
===> Fetching all distfiles required by bazel5-5.4.1_2 for building
===========================================================================
=======================<phase: checksum >============================
===== env: NO_DEPENDS=yes USER=root UID=0 GID=0
===> License APACHE20 accepted by the user
===> Fetching all distfiles required by bazel5-5.4.1_2 for building
=> SHA256 Checksum OK for bazel-5.4.1-dist.zip.
===========================================================================
=======================<phase: extract-depends>============================
===== env: USE_PACKAGE_DEPENDS_ONLY=1 USER=root UID=0 GID=0
===========================================================================
=======================<phase: extract >============================
===== env: NO_DEPENDS=yes USER=root UID=0 GID=0
===> License APACHE20 accepted by the user
===> Fetching all distfiles required by bazel5-5.4.1_2 for building
===> Extracting for bazel5-5.4.1_2
=> SHA256 Checksum OK for bazel-5.4.1-dist.zip.
===========================================================================
=======================<phase: patch-depends >============================
===== env: USE_PACKAGE_DEPENDS_ONLY=1 USER=root UID=0 GID=0
===========================================================================
=======================<phase: patch >============================
===== env: NO_DEPENDS=yes USER=root UID=0 GID=0
===> Patching for bazel5-5.4.1_2
===> Applying FreeBSD patches for bazel5-5.4.1_2 from /usr/ports/devel/bazel5/files
===========================================================================
=======================<phase: build-depends >============================
===== env: USE_PACKAGE_DEPENDS_ONLY=1 USER=root UID=0 GID=0
===> bazel5-5.4.1_2 depends on executable: bash - not found
===> Installing existing package /packages/All/bash-5.3.15.pkg
[main-amd64-default-job-30] Installing bash-5.3.15...
[main-amd64-default-job-30] `-- Installing gettext-runtime-1.0_1...
[main-amd64-default-job-30] | `-- Installing indexinfo-0.3.1_1...
[main-amd64-default-job-30] | `-- Extracting indexinfo-0.3.1_1: .... done
[main-amd64-default-job-30] `-- Extracting gettext-runtime-1.0_1: .......... done
[main-amd64-default-job-30] Extracting bash-5.3.15: .......... done
===> bazel5-5.4.1_2 depends on executable: bash - found
===> Returning to build of bazel5-5.4.1_2
===> bazel5-5.4.1_2 depends on executable: zip - not found
===> Installing existing package /packages/All/zip-3.0_6.pkg
[main-amd64-default-job-30] Installing zip-3.0_6...
[main-amd64-default-job-30] Extracting zip-3.0_6: .......... done
<snip>
[32mINFO: [0mFrom Compiling src/main/native/common/zstd_common.c:
warning: unknown warning option '-Wno-maybe-uninitialized'; did you mean '-Wno-uninitialized'? [-Wunknown-warning-option]
1 warning generated.
[32mINFO: [0mFrom Compiling src/main/native/compress/zstd_compress_sequences.c:
warning: unknown warning option '-Wno-maybe-uninitialized'; did you mean '-Wno-uninitialized'? [-Wunknown-warning-option]
1 warning generated.
[32mINFO: [0mFrom Compiling src/main/native/common/pool.c:
warning: unknown warning option '-Wno-maybe-uninitialized'; did you mean '-Wno-uninitialized'? [-Wunknown-warning-option]
1 warning generated.
[32mINFO: [0mFrom Compiling src/main/native/compress/zstd_compress_superblock.c:
warning: unknown warning option '-Wno-maybe-uninitialized'; did you mean '-Wno-uninitialized'? [-Wunknown-warning-option]
external/zstd-jni/src/main/native/compress/zstd_compress_superblock.c:134:12: warning: variable 'litLengthSum' set but not used [-Wunused-but-set-variable]
134 | size_t litLengthSum = 0;
| ^
2 warnings generated.
[32mINFO: [0mFrom Compiling src/main/native/jni_directbuffercompress_zstd.c:
warning: unknown warning option '-Wno-maybe-uninitialized'; did you mean '-Wno-uninitialized'? [-Wunknown-warning-option]
1 warning generated.
[32mINFO: [0mFrom Compiling src/main/native/common/error_private.c:
warning: unknown warning option '-Wno-maybe-uninitialized'; did you mean '-Wno-uninitialized'? [-Wunknown-warning-option]
1 warning generated.
[32mINFO: [0mFrom Compiling src/main/native/common/xxhash.c:
warning: unknown warning option '-Wno-maybe-uninitialized'; did you mean '-Wno-uninitialized'? [-Wunknown-warning-option]
1 warning generated.
[32mINFO: [0mFrom Compiling src/main/native/common/entropy_common.c:
warning: unknown warning option '-Wno-maybe-uninitialized'; did you mean '-Wno-uninitialized'? [-Wunknown-warning-option]
1 warning generated.
[32mINFO: [0mFrom Compiling src/main/native/compress/zstdmt_compress.c:
warning: unknown warning option '-Wno-maybe-uninitialized'; did you mean '-Wno-uninitialized'? [-Wunknown-warning-option]
1 warning generated.
[32mINFO: [0mFrom Compiling src/main/native/decompress/zstd_decompress.c:
warning: unknown warning option '-Wno-maybe-uninitialized'; did you mean '-Wno-uninitialized'? [-Wunknown-warning-option]
1 warning generated.
[32mINFO: [0mFrom Compiling src/main/native/legacy/zstd_v06.c:
warning: unknown warning option '-Wno-maybe-uninitialized'; did you mean '-Wno-uninitialized'? [-Wunknown-warning-option]
1 warning generated.
[32mINFO: [0mFrom Compiling src/main/native/common/fse_decompress.c:
warning: unknown warning option '-Wno-maybe-uninitialized'; did you mean '-Wno-uninitialized'? [-Wunknown-warning-option]
1 warning generated.
[32mINFO: [0mFrom Compiling src/main/native/compress/zstd_ldm.c:
warning: unknown warning option '-Wno-maybe-uninitialized'; did you mean '-Wno-uninitialized'? [-Wunknown-warning-option]
1 warning generated.
[32mINFO: [0mFrom Compiling src/main/native/legacy/zstd_v05.c:
warning: unknown warning option '-Wno-maybe-uninitialized'; did you mean '-Wno-uninitialized'? [-Wunknown-warning-option]
1 warning generated.
[32m[616 / 2,557][0m Compiling src/google/protobuf/compiler/js/js_generator.cc [for host]; 24s local ... (96 actions, 95 running)
[32mINFO: [0mFrom Compiling src/main/native/legacy/zstd_v07.c:
warning: unknown warning option '-Wno-maybe-uninitialized'; did you mean '-Wno-uninitialized'? [-Wunknown-warning-option]
1 warning generated.
[32mINFO: [0mFrom Compiling src/main/native/decompress/zstd_decompress_block.c:
warning: unknown warning option '-Wno-maybe-uninitialized'; did you mean '-Wno-uninitialized'? [-Wunknown-warning-option]
1 warning generated.
[32mINFO: [0mFrom Compiling src/main/native/decompress/huf_decompress.c:
warning: unknown warning option '-Wno-maybe-uninitialized'; did you mean '-Wno-uninitialized'? [-Wunknown-warning-option]
1 warning generated.
[32mINFO: [0mFrom Compiling src/main/native/compress/zstd_fast.c:
warning: unknown warning option '-Wno-maybe-uninitialized'; did you mean '-Wno-uninitialized'? [-Wunknown-warning-option]
1 warning generated.
[32mINFO: [0mFrom Compiling src/main/native/legacy/zstd_v04.c:
warning: unknown warning option '-Wno-maybe-uninitialized'; did you mean '-Wno-uninitialized'? [-Wunknown-warning-option]
1 warning generated.
[32mINFO: [0mFrom Compiling src/main/native/dictBuilder/divsufsort.c:
warning: unknown warning option '-Wno-maybe-uninitialized'; did you mean '-Wno-uninitialized'? [-Wunknown-warning-option]
1 warning generated.
WARNING: An illegal reflective access operation has occurred
WARNING: Illegal reflective access by com.google.devtools.build.lib.unsafe.StringUnsafe (file:/wrkdirs/usr/ports/devel/bazel5/work/bazel_tmp/bazel_MWL3BFHh/archive/libblaze.jar) to constructor java.lang.String(byte[],byte)
WARNING: Please consider reporting this to the maintainers of com.google.devtools.build.lib.unsafe.StringUnsafe
WARNING: Use --illegal-access=warn to enable warnings of further illegal reflective access operations
WARNING: All illegal access operations will be denied in a future release
[32mINFO: [0mFrom Compiling src/main/native/compress/zstd_double_fast.c:
warning: unknown warning option '-Wno-maybe-uninitialized'; did you mean '-Wno-uninitialized'? [-Wunknown-warning-option]
1 warning generated.
[32mINFO: [0mFrom Compiling absl/hash/internal/low_level_hash.cc:
external/com_google_absl/absl/hash/internal/low_level_hash.cc:43:38: warning: argument 'salt' of type 'const uint64_t[]' (aka 'const unsigned long[]') with mismatched bound [-Warray-parameter]
43 | const uint64_t salt[]) {
| ^
external/com_google_absl/absl/hash/internal/low_level_hash.h:44:38: note: previously declared as 'const uint64_t[5]' (aka 'const unsigned long[5]') here
44 | const uint64_t salt[5]);
| ^
1 warning generated.
[32mINFO: [0mFrom Compiling src/main/native/compress/zstd_compress.c:
warning: unknown warning option '-Wno-maybe-uninitialized'; did you mean '-Wno-uninitialized'? [-Wunknown-warning-option]
1 warning generated.
[32m[757 / 2,763][0m Compiling src/google/protobuf/compiler/js/js_generator.cc [for host]; 30s local ... (96 actions, 95 running)
[32m[922 / 3,138][0m Compiling src/google/protobuf/descriptor.cc [for host]; 33s local ... (96 actions, 95 running)
[32m[1,083 / 3,147][0m Compiling src/google/protobuf/descriptor.cc [for host]; 40s local ... (23 actions running)
[32mINFO: [0mFrom Compiling src/main/native/compress/zstd_opt.c:
warning: unknown warning option '-Wno-maybe-uninitialized'; did you mean '-Wno-uninitialized'? [-Wunknown-warning-option]
1 warning generated.
[32m[1,098 / 3,147][0m Compiling src/google/protobuf/descriptor.cc [for host]; 48s local ... (10 actions running)
[32mINFO: [0mFrom Action external/googleapis/google_bytestream_bytestream_java_grpc_srcs.jar:
google/bytestream/bytestream.proto:19:1: warning: Import google/api/annotations.proto is unused.
[32mINFO: [0mFrom Compiling src/main/native/compress/zstd_lazy.c:
warning: unknown warning option '-Wno-maybe-uninitialized'; did you mean '-Wno-uninitialized'? [-Wunknown-warning-option]
1 warning generated.
[32m[1,120 / 3,147][0m Compiling src/google/protobuf/descriptor.cc; 45s local ... (5 actions, 4 running)
[32mINFO: [0mFrom Generating Java (Immutable) proto_library //src/main/protobuf:execution_statistics_proto:
[libprotobuf WARNING external/com_google_protobuf/src/google/protobuf/compiler/java/java_file.cc:247] The optimize_for = LITE_RUNTIME option is no longer supported by protobuf Java code generator and is ignored--protoc will always generate full runtime code for Java. To use Java Lite runtime, users should use the Java Lite plugin instead. See:
https://github.com/protocolbuffers/protobuf/blob/master/java/lite.md
[32mINFO: [0mFrom Generating Java (Immutable) proto_library @googleapis//:google_bytestream_bytestream_proto:
google/bytestream/bytestream.proto:19:1: warning: Import google/api/annotations.proto is unused.
[32mINFO: [0mFrom Generating Java (Immutable) proto_library @googleapis//:google_devtools_build_v1_build_status_proto:
google/devtools/build/v1/build_status.proto:20:1: warning: Import google/api/annotations.proto is unused.
[32mINFO: [0mFrom Generating Java (Immutable) proto_library @googleapis//:google_devtools_build_v1_build_events_proto:
google/devtools/build/v1/build_events.proto:20:1: warning: Import google/api/annotations.proto is unused.
[32mINFO: [0mFrom Generating Java (Immutable) proto_library @googleapis//:google_api_auth_proto:
google/api/auth.proto:19:1: warning: Import google/api/annotations.proto is unused.
[32m[1,560 / 3,147][0m JavacBootstrap src/java_tools/buildjar/java/com/google/devtools/build/buildjar/libstarlark-deps.jar; 53s local ... (67 actions, 66 running)
[32mINFO: [0mFrom Compiling src/core/ext/filters/client_channel/lb_policy/weighted_target/weighted_target.cc:
external/com_github_grpc_grpc/src/core/ext/filters/client_channel/lb_policy/weighted_target/weighted_target.cc:326:10: warning: variable 'num_transient_failures' set but not used [-Wunused-but-set-variable]
326 | size_t num_transient_failures = 0;
| ^
1 warning generated.
[32m[1,644 / 3,147][0m JavacBootstrap src/java_tools/buildjar/java/com/google/devtools/build/buildjar/libstarlark-deps.jar; 66s local ... (3 actions, 2 running)
[32mINFO: [0mFrom JavacBootstrap src/java_tools/buildjar/java/com/google/devtools/build/buildjar/libstarlark-deps.jar:
warning: Implicitly compiled files were not subject to annotation processing.
Use -proc:none to disable annotation processing or -implicit to specify a policy for implicit compilation.
Note: Some input files use or override a deprecated API.
Note: Recompile with -Xlint:deprecation for details.
1 warning
[32mINFO: [0mFrom JavacBootstrap src/java_tools/buildjar/java/com/google/devtools/build/buildjar/libbootstrap_VanillaJavaBuilder.jar:
warning: Implicitly compiled files were not subject to annotation processing.
Use -proc:none to disable annotation processing or -implicit to specify a policy for implicit compilation.
Note: src/java_tools/buildjar/java/com/google/devtools/build/buildjar/VanillaJavaBuilder.java uses or overrides a deprecated API.
Note: Recompile with -Xlint:deprecation for details.
1 warning
[32m[1,651 / 3,147][0m [Prepa] Deployjar src/java_tools/buildjar/java/com/google/devtools/build/buildjar/bootstrap_VanillaJavaBuilder_deploy.jar
[32mINFO: [0mFrom Building external/zstd-jni/libzstd-jni-class.jar (20 source files):
external/zstd-jni/src/main/java/com/github/luben/zstd/ZstdInputStream.java:46: warning: deprecated item is not annotated with @Deprecated
external/zstd-jni/src/main/java/com/github/luben/zstd/ZstdOutputStream.java:21: warning: deprecated item is not annotated with @Deprecated
external/zstd-jni/src/main/java/com/github/luben/zstd/ZstdOutputStream.java:32: warning: deprecated item is not annotated with @Deprecated
external/zstd-jni/src/main/java/com/github/luben/zstd/ZstdOutputStream.java:86: warning: deprecated item is not annotated with @Deprecated
[32mINFO: [0mFrom Building external/com_google_protobuf/java/util/libutil.jar (8 source files):
warning: -parameters is not supported for target value 1.7. Use 1.8 or later.
[32m[1,955 / 3,147][0m Building src/main/java/com/google/devtools/build/lib/skyframe/serialization/libserialization.jar (59 source files) and running annotation processors (SerializationConstantProcessor); 3s local ... (19 actions, 18 running)
[32mINFO: [0mFrom Building src/main/java/com/google/devtools/build/lib/buildeventservice/client/libclient.jar (2 source files):
src/main/java/com/google/devtools/build/lib/buildeventservice/client/BuildEventServiceGrpcClient.java: warning: unknown enum constant com.google.j2objc.annotations.ReflectionSupport$Level.FULL
reason: class file for com.google.j2objc.annotations.ReflectionSupport$Level not found
[32mINFO: [0mFrom Building src/main/java/com/google/devtools/build/lib/collect/nestedset/libnestedset.jar (8 source files) and running annotation processors (AutoCodecProcessor, SerializationConstantProcessor, StarlarkMethodProcessor, AutoAnnotationProcessor, AutoValueProcessor):
src/main/java/com/google/devtools/build/lib/collect/nestedset/NestedSetStore.java: warning: unknown enum constant com.google.j2objc.annotations.ReflectionSupport$Level.FULL
reason: class file for com.google.j2objc.annotations.ReflectionSupport$Level not found
[32m[2,115 / 3,147][0m Building src/main/java/com/google/devtools/build/lib/vfs/libvfs.jar (28 source files) and running annotation processors (AutoCodecProcessor, OptionProcessor); 2s local ... (2 actions, 1 running)
[32mINFO: [0mFrom Building src/main/java/com/google/devtools/build/lib/vfs/libvfs.jar (28 source files) and running annotation processors (AutoCodecProcessor, OptionProcessor):
src/main/java/com/google/devtools/build/lib/vfs/UnixGlob.java: warning: unknown enum constant com.google.j2objc.annotations.ReflectionSupport$Level.FULL
reason: class file for com.google.j2objc.annotations.ReflectionSupport$Level not found
[32mINFO: [0mFrom Building src/main/java/com/google/devtools/build/lib/util/io/libio.jar (17 source files):
src/main/java/com/google/devtools/build/lib/util/io/AsynchronousFileOutputStream.java: warning: unknown enum constant com.google.j2objc.annotations.ReflectionSupport$Level.FULL
reason: class file for com.google.j2objc.annotations.ReflectionSupport$Level not found
[32mINFO: [0mFrom Building src/main/java/com/google/devtools/build/lib/buildeventstream/transports/libtransports.jar (5 source files) and running annotation processors (OptionProcessor):
src/main/java/com/google/devtools/build/lib/buildeventstream/transports/FileTransport.java: warning: unknown enum constant com.google.j2objc.annotations.ReflectionSupport$Level.FULL
reason: class file for com.google.j2objc.annotations.ReflectionSupport$Level not found
[32m[2,352 / 3,147][0m Building src/main/java/com/google/devtools/build/lib/analysis/libconfig/transitions/null_transition.jar (1 source file) and running annotation processors (AutoCodecProcessor, SerializationConstantProcessor, AutoAnnotationProcessor, AutoValueProcessor); 1s local ... (2 actions, 1 running)
[32mINFO: [0mFrom Building src/main/java/com/google/devtools/build/lib/packages/libpackages.jar (115 source files) and running annotation processors (AutoCodecProcessor, OptionProcessor, StarlarkMethodProcessor, AutoAnnotationProcessor, AutoValueProcessor):
src/main/java/com/google/devtools/build/lib/packages/GlobCache.java: warning: unknown enum constant com.google.j2objc.annotations.ReflectionSupport$Level.FULL
reason: class file for com.google.j2objc.annotations.ReflectionSupport$Level not found
[32mINFO: [0mFrom Building src/main/java/com/google/devtools/build/lib/skyframe/libaction_execution_state.jar (1 source file):
src/main/java/com/google/devtools/build/lib/skyframe/ActionExecutionState.java: warning: unknown enum constant com.google.j2objc.annotations.ReflectionSupport$Level.FULL
reason: class file for com.google.j2objc.annotations.ReflectionSupport$Level not found
[32m[2,820 / 3,147][0m Building src/main/java/com/google/devtools/build/lib/skyframe/libtoolchain_context_key.jar (1 source file) and running annotation processors (AutoAnnotationProcessor, AutoValueProcessor); 1s local ... (15 actions, 14 running)
[32mINFO: [0mFrom Building src/main/java/com/google/devtools/build/lib/remote/util/libutil.jar (7 source files):
warning: unknown enum constant com.google.j2objc.annotations.ReflectionSupport$Level.FULL
reason: class file for com.google.j2objc.annotations.ReflectionSupport$Level not found
[32mINFO: [0mFrom Building src/main/java/com/google/devtools/build/lib/remote/http/libhttp.jar (10 source files):
src/main/java/com/google/devtools/build/lib/remote/http/HttpCacheClient.java: warning: unknown enum constant com.google.j2objc.annotations.ReflectionSupport$Level.FULL
reason: class file for com.google.j2objc.annotations.ReflectionSupport$Level not found
[32mINFO: [0mFrom Building src/main/java/com/google/devtools/build/lib/analysis/libanalysis_cluster.jar (109 source files) and running annotation processors (StarlarkConfigurationFieldProcessor, AutoCodecProcessor, SerializationConstantProcessor, OptionProcessor, StarlarkMethodProcessor, AutoAnnotationProcessor, AutoValueProcessor):
src/main/java/com/google/devtools/build/lib/analysis/test/TestStrategy.java: warning: unknown enum constant com.google.j2objc.annotations.ReflectionSupport$Level.FULL
reason: class file for com.google.j2objc.annotations.ReflectionSupport$Level not found
[32m[3,036 / 3,147][0m Building src/main/java/com/google/devtools/build/lib/rules/java/libjava-compilation.jar (45 source files) and running annotation processors (StarlarkConfigurationFieldProcessor, AutoCodecProcessor, OptionProcessor, StarlarkMethodProcessor, AutoAnnotationProcessor, AutoValueProcessor); 5s local ... (5 actions, 4 running)
[32mINFO: [0mFrom Building src/main/java/com/google/devtools/build/lib/dynamic/libdynamic.jar (4 source files) and running annotation processors (OptionProcessor, AutoAnnotationProcessor, AutoValueProcessor):
src/main/java/com/google/devtools/build/lib/dynamic/DynamicSpawnStrategy.java: warning: unknown enum constant com.google.j2objc.annotations.ReflectionSupport$Level.FULL
reason: class file for com.google.j2objc.annotations.ReflectionSupport$Level not found
[32mINFO: [0mFrom Building src/main/java/com/google/devtools/build/lib/buildeventservice/libbuildeventservice.jar (7 source files) and running annotation processors (OptionProcessor, AutoAnnotationProcessor, AutoValueProcessor):
src/main/java/com/google/devtools/build/lib/buildeventservice/BuildEventServiceUploader.java: warning: unknown enum constant com.google.j2objc.annotations.ReflectionSupport$Level.FULL
reason: class file for com.google.j2objc.annotations.ReflectionSupport$Level not found
[32mINFO: [0mFrom Building src/main/java/com/google/devtools/build/lib/sandbox/libsandbox.jar (30 source files) and running annotation processors (OptionProcessor, AutoAnnotationProcessor, AutoValueProcessor):
src/main/java/com/google/devtools/build/lib/sandbox/RealSandboxfs02Process.java: warning: unknown enum constant com.google.j2objc.annotations.ReflectionSupport$Level.FULL
reason: class file for com.google.j2objc.annotations.ReflectionSupport$Level not found
[32mINFO: [0mFrom Building src/main/java/com/google/devtools/build/lib/remote/libremote.jar (29 source files) and running annotation processors (OptionProcessor, AutoAnnotationProcessor, AutoValueProcessor):
src/main/java/com/google/devtools/build/lib/remote/RemoteCache.java: warning: unknown enum constant com.google.j2objc.annotations.ReflectionSupport$Level.FULL
reason: class file for com.google.j2objc.annotations.ReflectionSupport$Level not found
[31m[1mERROR: [0m/wrkdirs/usr/ports/devel/bazel5/work/bazel5-5.4.1_2/src/BUILD:12:9: Executing genrule //src:install_base_key-file_nojdk failed: (Exit 1): bash failed: error executing command
(cd /wrkdirs/usr/ports/devel/bazel5/work/bazel_tmp/bazel_MWL3BFHh/out/execroot/io_bazel && \
exec env - \
PATH=/usr/local/bin:/sbin:/bin:/usr/sbin:/usr/bin:/usr/local/sbin:/usr/local/bin:/root/bin \
/usr/local/bin/bash -c 'source external/bazel_tools/tools/genrule/genrule-setup.sh; set -e -o pipefail && /sbin/md5 bazel-out/freebsd-opt/bin/src/main/java/com/google/devtools/build/lib/bazel/BazelServer_deploy.jar bazel-out/freebsd-opt/bin/src/main/java/net/starlark/java/eval/libcpu_profiler.so bazel-out/freebsd-opt/bin/src/main/cpp/client bazel-out/freebsd-opt/bin/src/main/tools/build-runfiles bazel-out/freebsd-opt/bin/src/main/tools/process-wrapper bazel-out/freebsd-opt/bin/src/main/tools/linux-sandbox bazel-out/freebsd-opt/bin/tools/osx/xcode-locator bazel-out/freebsd-opt/bin/src/platforms.zip bazel-out/freebsd-opt/bin/src/main/tools/daemonize bazel-out/freebsd-opt/bin/src/embedded_tools_nojdk.zip | /sbin/md5 | head -c 32 > bazel-out/freebsd-opt/bin/src/install_base_key_nojdk')
# Configuration: 3cf242b8696f184fc19f3802c6bb45f43a77ee075b167e7f96b23e8d1c5ee97f
# Execution platform: //:default_host_platform
md5: Unable to initialize casper: Invalid argument (Invallid pdflags at fork 0x4)
Target //src:bazel_nojdk failed to build
[32mINFO: [0mElapsed time: 249.819s, Critical Path: 218.08s
[32mINFO: [0m3145 processes: 60 internal, 3085 local.
[31m[1mFAILED:[0m Build did NOT complete successfully
[31m[1mFAILED:[0m Build did NOT complete successfully
[0m
ERROR: Could not build Bazel
*** Error code 1
Stop.
make: stopped making "build" in /usr/ports/devel/bazel5