[package - 150arm64-default][misc/py-paddlepaddle] Failed for py312-paddlepaddle-3.3.1 in build
- Go to: [ bottom of page ] [ top of archives ] [ this month ]
Date: Sun, 27 Sep 2026 23:37:24 UTC
You are receiving this mail as a port that you maintain
is failing to build on the FreeBSD package build server.
Please investigate the failure and submit a PR to fix
build.
Maintainer: yuri@FreeBSD.org
Log URL: https://pkg-status.freebsd.org/ampere5/data/150arm64-default/865889dac0a8/logs/py312-paddlepaddle-3.3.1.log
Build URL: https://pkg-status.freebsd.org/ampere5/build.html?mastername=150arm64-default&build=865889dac0a8
Log:
=>> Building misc/py-paddlepaddle
build started at Sun Sep 27 23:20:45 UTC 2026
port directory: /usr/ports/misc/py-paddlepaddle
package name: py312-paddlepaddle-3.3.1
building for: FreeBSD 150arm64-default-job-15 15.0-RELEASE-p13 FreeBSD 15.0-RELEASE-p13 arm64
maintained by: yuri@FreeBSD.org
Makefile datestamp: -rw-r--r-- 1 root wheel 8823 Sep 20 01:02 /usr/ports/misc/py-paddlepaddle/Makefile
Ports top last git commit: 865889dac0a8ac2b2423e00abaa263e49708699e
Ports top unclean checkout: no
Port dir last git commit: 1426db31939bec897a21eb7e646c6e0a092e5623
Port dir unclean checkout: no
Poudriere version: poudriere-git-3.4.8-3-gd92fb7c0
Host OSVERSION: 1600022
Jail OSVERSION: 1500068
Job Id: 15
---Begin Environment---
SHELL=/bin/sh
OSVERSION=1500068
UNAME_v=FreeBSD 15.0-RELEASE-p13
UNAME_r=15.0-RELEASE-p13
BLOCKSIZE=K
MAIL=/var/mail/root
MM_CHARSET=UTF-8
LANG=C.UTF-8
STATUS=1
HOME=/root
PATH=/sbin:/bin:/usr/sbin:/usr/bin:/usr/local/sbin:/usr/local/bin:/root/bin
MAKE_OBJDIR_CHECK_WRITABLE=0
LOCALBASE=/usr/local
USER=root
POUDRIERE_NAME=poudriere-git
LIBEXECPREFIX=/usr/local/libexec/poudriere
POUDRIERE_VERSION=3.4.8-3-gd92fb7c0
MASTERMNT=/usr/local/poudriere/data/.m/150arm64-default/ref
LC_COLLATE=C
POUDRIERE_BUILD_TYPE=bulk
PACKAGE_BUILDING=yes
SAVED_TERM=
OUTPUT_REDIRECTED_STDERR=4
OUTPUT_REDIRECTED=1
PWD=/usr/local/poudriere/data/.m/150arm64-default/15/.p
OUTPUT_REDIRECTED_STDOUT=3
P_PORTS_FEATURES=FLAVORS SUBPACKAGES SELECTED_OPTIONS
MASTERNAME=150arm64-default
SCRIPTPREFIX=/usr/local/share/poudriere
SCRIPTNAME=bulk.sh
OLDPWD=/usr/local/poudriere/data/.m/150arm64-default/ref/.p/pool
POUDRIERE_PKGNAME=poudriere-git-3.4.8-3-gd92fb7c0
SCRIPTPATH=/usr/local/share/poudriere/bulk.sh
POUDRIEREPATH=/usr/local/bin/poudriere
---End Environment---
---Begin Poudriere Port Flags/Env---
PORT_FLAGS=
PKGENV=
FLAVOR=
MAKE_ARGS=
---End Poudriere Port Flags/Env---
---Begin OPTIONS List---
---End OPTIONS List---
--MAINTAINER--
yuri@FreeBSD.org
--End MAINTAINER--
--CONFIGURE_ARGS--
--End CONFIGURE_ARGS--
--CONFIGURE_ENV--
PYTHON="/usr/local/bin/python3.12" XDG_DATA_HOME=/wrkdirs/usr/ports/misc/py-paddlepaddle/work XDG_CONFIG_HOME=/wrkdirs/usr/ports/misc/py-paddlepaddle/work XDG_CACHE_HOME=/wrkdirs/usr/ports/misc/py-paddlepaddle/work/.cache HOME=/wrkdirs/usr/ports/misc/py-paddlepaddle/work TMPDIR="/tmp" PATH=/wrkdirs/usr/ports/misc/py-paddlepaddle/work/.bin:/sbin:/bin:/usr/sbin:/usr/bin:/usr/local/sbin:/usr/local/bin:/root/bin PKG_CONFIG_LIBDIR=/wrkdirs/usr/ports/misc/py-paddlepaddle/work/.pkgconfig:/usr/local/libdata/pkgconfig:/usr/local/share/pkgconfig:/usr/libdata/pkgconfig SHELL=/bin/sh CONFIG_SHELL=/bin/sh
--End CONFIGURE_ENV--
--MAKE_ENV--
NINJA_STATUS="[%p %s/%t] " XDG_DATA_HOME=/wrkdirs/usr/ports/misc/py-paddlepaddle/work XDG_CONFIG_HOME=/wrkdirs/usr/ports/misc/py-paddlepaddle/work XDG_CACHE_HOME=/wrkdirs/usr/ports/misc/py-paddlepaddle/work/.cache HOME=/wrkdirs/usr/ports/misc/py-paddlepaddle/work TMPDIR="/tmp" PATH=/wrkdirs/usr/ports/misc/py-paddlepaddle/work/.bin:/sbin:/bin:/usr/sbin:/usr/bin:/usr/local/sbin:/usr/local/bin:/root/bin PKG_CONFIG_LIBDIR=/wrkdirs/usr/ports/misc/py-paddlepaddle/work/.pkgconfig:/usr/local/libdata/pkgconfig:/usr/local/share/pkgconfig:/usr/libdata/pkgconfig MK_DEBUG_FILES=no MK_KERNEL_SYMBOLS=no SHELL=/bin/sh NO_LINT=YES DESTDIR=/wrkdirs/usr/ports/misc/py-paddlepaddle/work/stage PREFIX=/usr/local LOCALBASE=/usr/local CC="/usr/local/llvm21/bin/clang" CFLAGS="-O2 -pipe -fstack-protector-strong -fno-strict-aliasing " CPP="/usr/local/llvm21/bin/clang-cpp" CPPFLAGS="" LDFLAGS=" " LIBS="" CXX="/usr/local/llvm21/bin/clang++" CXXFLAGS="-O2 -pipe -fstack-protector-strong -fno-stric
t-aliasing -Wno-invalid-specialization " BSD_INSTALL_PROGRAM="install -s -m 555" BSD_INSTALL_LIB="install -s -m 0644" BSD_INSTALL_SCRIPT="install -m 555" BSD_INSTALL_DATA="install -m 0644" BSD_INSTALL_MAN="install -m 444"
--End MAKE_ENV--
--PLIST_SUB--
WHEEL_TAG=freebsd_15_0_release_p13_arm64 CMAKE_BUILD_TYPE="release" PYTHON_INCLUDEDIR=include/python3.12 PYTHON_LIBDIR=lib/python3.12 PYTHON_PLATFORM=freebsd15 PYTHON_SITELIBDIR=lib/python3.12/site-packages PYTHON_SUFFIX=312 PYTHON_BASESUFFIX=312 PYTHON_TAG=.cpython-312 PYTHON_SOABI=.cpython-312 PYTHON_VER=3.12 PYTHON_BASEVER=3.12 PYTHON_VERSION=python3.12 PYTHON2="@comment " PYTHON3="" OSREL=15.0 PREFIX=%D LOCALBASE=/usr/local RESETPREFIX=/usr/local LIB32DIR=lib DOCSDIR="share/doc/paddlepaddle" EXAMPLESDIR="share/examples/paddlepaddle" DATADIR="share/paddlepaddle" WWWDIR="www/paddlepaddle" ETCDIR="etc/paddlepaddle"
--End PLIST_SUB--
--SUB_LIST--
PYTHON_INCLUDEDIR=/usr/local/include/python3.12 PYTHON_LIBDIR=/usr/local/lib/python3.12 PYTHON_PLATFORM=freebsd15 PYTHON_SITELIBDIR=/usr/local/lib/python3.12/site-packages PYTHON_SUFFIX=312 PYTHON_BASESUFFIX=312 PYTHON_TAG=.cpython-312 PYTHON_SOABI=.cpython-312 PYTHON_VER=3.12 PYTHON_BASEVER=3.12 PYTHON_VERSION=python3.12 PYTHON2="@comment " PYTHON3="" PREFIX=/usr/local LOCALBASE=/usr/local DATADIR=/usr/local/share/paddlepaddle DOCSDIR=/usr/local/share/doc/paddlepaddle EXAMPLESDIR=/usr/local/share/examples/paddlepaddle WWWDIR=/usr/local/www/paddlepaddle ETCDIR=/usr/local/etc/paddlepaddle
--End SUB_LIST--
---Begin make.conf---
USE_PACKAGE_DEPENDS=yes
BATCH=yes
WRKDIRPREFIX=/wrkdirs
PORTSDIR=/usr/ports
PACKAGES=/packages
DISTDIR=/distfiles
PACKAGE_BUILDING=yes
PACKAGE_BUILDING_FLAVORS=yes
#### ####
# XXX: We really need this but cannot use it while 'make checksum' does not
# try the next mirror on checksum failure. It currently retries the same
# failed mirror and then fails rather then trying another. It *does*
# try the next if the size is mismatched though.
#MASTER_SITE_FREEBSD=yes
# Build ALLOW_MAKE_JOBS_PACKAGES with 3 jobs
MAKE_JOBS_NUMBER=3
#### Misc Poudriere ####
.include "/etc/make.conf.ports_env"
GID=0
UID=0
---End make.conf---
--Resource limits--
cpu time (seconds, -t) unlimited
file size (512-blocks, -f) unlimited
data seg size (kbytes, -d) 1048576
stack size (kbytes, -s) 1048576
core file size (512-blocks, -c) unlimited
max memory size (kbytes, -m) unlimited
locked memory (kbytes, -l) unlimited
max user processes (-u) 89999
open files (-n) 8192
virtual mem size (kbytes, -v) unlimited
swap limit (kbytes, -w) unlimited
socket buffer size (bytes, -b) unlimited
pseudo-terminals (-p) unlimited
kqueues (-k) unlimited
umtx shared locks (-o) unlimited
pipebuf (-y) unlimited
--End resource limits--
=======================<phase: check-sanity >============================
===== env: NO_DEPENDS=yes USER=root UID=0 GID=0
===> License APACHE20 accepted by the user
===========================================================================
=======================<phase: pkg-depends >============================
===== env: USE_PACKAGE_DEPENDS_ONLY=1 USER=root UID=0 GID=0
===> py312-paddlepaddle-3.3.1 depends on file: /usr/local/sbin/pkg - not found
===> Installing existing package /packages/All/pkg-2.8.4.pkg
[150arm64-default-job-15] Installing pkg-2.8.4...
[150arm64-default-job-15] Extracting pkg-2.8.4: .......... done
===> py312-paddlepaddle-3.3.1 depends on file: /usr/local/sbin/pkg - found
===> Returning to build of py312-paddlepaddle-3.3.1
===========================================================================
=======================<phase: fetch-depends >============================
===== env: USE_PACKAGE_DEPENDS_ONLY=1 USER=root UID=0 GID=0
===========================================================================
=======================<phase: fetch >============================
===== env: NO_DEPENDS=yes USER=root UID=0 GID=0
===> License APACHE20 accepted by the user
===> Fetching all distfiles required by py312-paddlepaddle-3.3.1 for building
===========================================================================
=======================<phase: checksum >============================
===== env: NO_DEPENDS=yes USER=root UID=0 GID=0
===> License APACHE20 accepted by the user
===> Fetching all distfiles required by py312-paddlepaddle-3.3.1 for building
=> SHA256 Checksum OK for PaddlePaddle-Paddle-v3.3.1_GH0.tar.gz.
=> SHA256 Checksum OK for NVIDIA-cccl-1f6e4bcae0fbf1bbed87f88544d8d2161c490fc1_GH0.tar.gz.
=> SHA256 Checksum OK for weidai11-cryptopp-9dcc26c58213abb8351fbb1b2a7a1d2c667366e4_GH0.tar.gz.
=> SHA256 Checksum OK for noloader-cryptopp-cmake-6d0666c457fbbf6f81819fd2b80f0cb5b6646593_GH0.tar.gz.
=> SHA256 Checksum OK for NVIDIA-cub-48b555897ee66bcd057a521ed39d62b7688c7d59_GH0.tar.gz.
=> SHA256 Checksum OK for NVIDIA-cutlass-eefa171318b79cbe2e78514d4cce5cd0fe919d0c_GH0.tar.gz.
=> SHA256 Checksum OK for dmlc-dlpack-84d107bf416c6bab9ae68ad285876600d230490d_GH0.tar.gz.
=> SHA256 Checksum OK for FlagOpen-FlagCX-7c469f4af991bf0f64b8f76d66f8e307a5eaea3f_GH0.tar.gz.
=> SHA256 Checksum OK for PaddlePaddle-flash-attention-196115f865fc7f18a7ab55f32510415a788cb85d_GH0.tar.gz.
=> SHA256 Checksum OK for gflags-gflags-e171aa2d15ed9eb17054558e0b3a6a413bb01067_GH0.tar.gz.
=> SHA256 Checksum OK for google-glog-96a2f23dca4cc7180821ca5f32e526314395d26a_GH0.tar.gz.
=> SHA256 Checksum OK for ziyoujiyi-gloo-8b6b61dfa0dca02b226a01262bfcf0484382048f_GH0.tar.gz.
=> SHA256 Checksum OK for google-googletest-2fe3bd994b3189899d93f1d5a881e725e046fdc2_GH0.tar.gz.
=> SHA256 Checksum OK for NVIDIA-jitify-57de649139c866eb83acacfe50c92ad7c6278776_GH0.tar.gz.
=> SHA256 Checksum OK for libuv-libuv-2e7c07f4d10c1b391a7138471c49f4aae3c47d8d_GH0.tar.gz.
=> SHA256 Checksum OK for nlohmann-json-199dea11b17c533721b26249e2dcaee6ca1d51d3_GH0.tar.gz.
=> SHA256 Checksum OK for oneapi-src-oneDNN-28d696724426b943e2f4a0e607f90cdc19aedaf6_GH0.tar.gz.
=> SHA256 Checksum OK for xianyi-OpenBLAS-5f36f18148603facb6c3540e673610d6b24cbfbb_GH0.tar.gz.
=> SHA256 Checksum OK for openvinotoolkit-openvino-07ecdf07d2974410dc1d67d9fa2d3433dcab7865_GH0.tar.gz.
=> SHA256 Checksum OK for protocolbuffers-protobuf-f0dc78d7e6e331b8c6bb2d5283e06aa26883ca7c_GH0.tar.gz.
=> SHA256 Checksum OK for pybind-pybind11-a2e59f0e7065404b44dfe92a28aca47ba1378dc4_GH0.tar.gz.
=> SHA256 Checksum OK for Thunderbrook-rocksdb-9e18bf0e273b081de54ef1227e6f1db9e02a472a_GH0.tar.gz.
=> SHA256 Checksum OK for progschj-ThreadPool-9a42ec1329f259a5f4881a291db1dcb8f2ad9040_GH0.tar.gz.
=> SHA256 Checksum OK for JuliaStrings-utf8proc-3203baa7374d67132384e2830b2183c92351bffc_GH0.tar.gz.
=> SHA256 Checksum OK for baidu-research-warp-ctc-bdc2b4550453e0ef2d3b5190f9c6103a84eff184_GH0.tar.gz.
=> SHA256 Checksum OK for PaddlePaddle-warp-transducer-7ea6bfe748779c245a0fcaa5dd9383826273eff2_GH0.tar.gz.
=> SHA256 Checksum OK for herumi-xbyak-4ca0434b4e78c05e3f3e68bda70e8713668e87d3_GH0.tar.gz.
=> SHA256 Checksum OK for Cyan4973-xxHash-7cc9639699f64b750c0b82333dced9ea77e8436e_GH0.tar.gz.
=> SHA256 Checksum OK for jbeder-yaml-cpp-1d8ca1f35eb3a9c9142462b28282a848e5d29a91_GH0.tar.gz.
=> SHA256 Checksum OK for madler-zlib-51b7f2abdade71cd9bb0e7a373ef2610ec6f9daf_GH0.tar.gz.
=> SHA256 Checksum OK for libeigen-eigen-f612df273689a19d25b45ca4f8269463207c4fee_GL0.tar.gz.
=> SHA256 Checksum OK for mtr-pocketfft-ea778e37710c07723435b1be58235996d1d43a5a_GL0.tar.gz.
===========================================================================
=======================<phase: extract-depends>============================
===== env: USE_PACKAGE_DEPENDS_ONLY=1 USER=root UID=0 GID=0
===========================================================================
=======================<phase: extract >============================
===== env: NO_DEPENDS=yes USER=root UID=0 GID=0
===> License APACHE20 accepted by the user
===> Fetching all distfiles required by py312-paddlepaddle-3.3.1 for building
===> Extracting for py312-paddlepaddle-3.3.1
=> SHA256 Checksum OK for PaddlePaddle-Paddle-v3.3.1_GH0.tar.gz.
=> SHA256 Checksum OK for NVIDIA-cccl-1f6e4bcae0fbf1bbed87f88544d8d2161c490fc1_GH0.tar.gz.
=> SHA256 Checksum OK for weidai11-cryptopp-9dcc26c58213abb8351fbb1b2a7a1d2c667366e4_GH0.tar.gz.
=> SHA256 Checksum OK for noloader-cryptopp-cmake-6d0666c457fbbf6f81819fd2b80f0cb5b6646593_GH0.tar.gz.
=> SHA256 Checksum OK for NVIDIA-cub-48b555897ee66bcd057a521ed39d62b7688c7d59_GH0.tar.gz.
=> SHA256 Checksum OK for NVIDIA-cutlass-eefa171318b79cbe2e78514d4cce5cd0fe919d0c_GH0.tar.gz.
<snip>
[ 13% 337/2552] /usr/local/llvm21/bin/clang++ -DGLOG_NO_ABBREVIATED_SEVERITIES -DHPPL_STUB_FUNC -DLAPACK_FOUND -DPADDLE_DISABLE_PROFILER -DPADDLE_DLL_EXPORT -DPADDLE_ON_INFERENCE -DPADDLE_SLEEF_POW_PRECISION=10 -DPADDLE_USE_OPENBLAS -DPADDLE_USE_PTHREAD_BARRIER -DPADDLE_USE_PTHREAD_SPINLOCK -DPADDLE_VERSION=3.3.0.dev -DPADDLE_VERSION_INTEGER=3003000 -DPADDLE_WITH_CRYPTO -DPADDLE_WITH_POCKETFFT -DPADDLE_WITH_SLEEF -DPADDLE_WITH_XBYAK -DPHI_INNER -DPHI_SHARED -DSTATIC_IR -DXBYAK64 -DXBYAK_NO_OP_NAMES -DYAML_CPP_STATIC_DEFINE -Dphi_core_EXPORTS -I/wrkdirs/usr/ports/misc/py-paddlepaddle/work/.build -I/wrkdirs/usr/ports/misc/py-paddlepaddle/work/Paddle-3.3.1/paddle/fluid/framework/io -I/wrkdirs/usr/ports/misc/py-paddlepaddle/work/.build/third_party/install/zlib/include -I/wrkdirs/usr/ports/misc/py-paddlepaddle/work/.build/third_party/install -I/wrkdirs/usr/ports/misc/py-paddlepaddle/work/.build/third_party/install/gflags/include -I/wrkdirs/usr/ports/misc/py-paddlepaddle/work/.bui
ld/third_party/install/glog/include -I/wrkdirs/usr/ports/misc/py-paddlepaddle/work/Paddle-3.3.1/third_party/eigen3 -I/wrkdirs/usr/ports/misc/py-paddlepaddle/work/Paddle-3.3.1/third_party/threadpool -I/wrkdirs/usr/ports/misc/py-paddlepaddle/work/Paddle-3.3.1/third_party/dlpack/include -I/wrkdirs/usr/ports/misc/py-paddlepaddle/work/.build/third_party/install/xxhash/include -I/wrkdirs/usr/ports/misc/py-paddlepaddle/work/.build/third_party/install/warpctc/include -I/wrkdirs/usr/ports/misc/py-paddlepaddle/work/.build/third_party/install/warprnnt/include -I/wrkdirs/usr/ports/misc/py-paddlepaddle/work/.build/third_party/install/utf8proc/include -I/wrkdirs/usr/ports/misc/py-paddlepaddle/work/.build/third_party/install/protobuf/include -I/wrkdirs/usr/ports/misc/py-paddlepaddle/work/Paddle-3.3.1/third_party/nlohmann_json/include -I/wrkdirs/usr/ports/misc/py-paddlepaddle/work/.build/third_party/install/yaml-cpp/include -I/usr/local/include/python3.12 -I/usr/local/lib/python3.12/site-pa
ckages/numpy/_core/include -I/wrkdirs/usr/ports/misc/py-paddlepaddle/work/.build/third_party/pybind/src/extern_pybind/include -I/wrkdirs/usr/ports/misc/py-paddlepaddle/work/.build/third_party/install/libuv/include -I/wrkdirs/usr/ports/misc/py-paddlepaddle/work/.build/third_party/install/gloo/include -I/wrkdirs/usr/ports/misc/py-paddlepaddle/work/.build/third_party/install/xbyak/include -I/wrkdirs/usr/ports/misc/py-paddlepaddle/work/.build/third_party/install/xbyak/include/xbyak -I/wrkdirs/usr/ports/misc/py-paddlepaddle/work/.build/third_party/install/cryptopp/include -I/wrkdirs/usr/ports/misc/py-paddlepaddle/work/.build/third_party/pocketfft/src -I/wrkdirs/usr/ports/misc/py-paddlepaddle/work/Paddle-3.3.1 -I/wrkdirs/usr/ports/misc/py-paddlepaddle/work/Paddle-3.3.1/paddle/phi/api/include/compat -I/wrkdirs/usr/ports/misc/py-paddlepaddle/work/Paddle-3.3.1/paddle/phi/api/include/compat/torch/csrc/api/include -I/wrkdirs/usr/ports/misc/py-paddlepaddle/work/.build/../paddle/fluid/fr
amework/io -isystem /usr/local/include -O2 -pipe -fstack-protector-strong -fno-strict-aliasing -Wno-invalid-specialization -Wno-error=deprecated-declarations -Wno-deprecated-declarations -Wno-error=uninitialized -std=c++17 -m64 -fPIC -fno-omit-frame-pointer -pipe -ffunction-sections -fdata-sections -Wall -Wextra -Wno-unused-parameter -Wno-unused-function -Wno-error=array-bounds -Wno-error=ignored-attributes -Wno-error=int-in-bool-context -Wno-error=unknown-warning-option -Wno-error=unused-private-field -Wno-error=unused-const-variable -Wno-error=deprecated-copy-with-user-provided-copy -Wno-error=deprecated-copy -Wno-error=inconsistent-missing-override -Wno-error=bitwise-instead-of-logical -Wno-error=overloaded-virtual -Wno-error=defaulted-function-deleted -Wno-ignored-qualifiers -Wno-ignored-attributes -Wno-parentheses -O3 -DNDEBUG -fPIC -MD -MT paddle/phi/CMakeFiles/phi_core.dir/core/memory/stats.cc.o -MF paddle/phi/CMakeFiles/phi_core.dir/core/memory/stats.cc.o.d -o pad
dle/phi/CMakeFiles/phi_core.dir/core/memory/stats.cc.o -c /wrkdirs/usr/ports/misc/py-paddlepaddle/work/Paddle-3.3.1/paddle/phi/core/memory/stats.cc
[ 13% 338/2552] /usr/local/llvm21/bin/clang++ -DGLOG_NO_ABBREVIATED_SEVERITIES -DHPPL_STUB_FUNC -DLAPACK_FOUND -DPADDLE_DISABLE_PROFILER -DPADDLE_DLL_EXPORT -DPADDLE_ON_INFERENCE -DPADDLE_SLEEF_POW_PRECISION=10 -DPADDLE_USE_OPENBLAS -DPADDLE_USE_PTHREAD_BARRIER -DPADDLE_USE_PTHREAD_SPINLOCK -DPADDLE_VERSION=3.3.0.dev -DPADDLE_VERSION_INTEGER=3003000 -DPADDLE_WITH_CRYPTO -DPADDLE_WITH_POCKETFFT -DPADDLE_WITH_SLEEF -DPADDLE_WITH_XBYAK -DPHI_INNER -DPHI_SHARED -DSTATIC_IR -DXBYAK64 -DXBYAK_NO_OP_NAMES -DYAML_CPP_STATIC_DEFINE -Dphi_core_EXPORTS -I/wrkdirs/usr/ports/misc/py-paddlepaddle/work/.build -I/wrkdirs/usr/ports/misc/py-paddlepaddle/work/Paddle-3.3.1/paddle/fluid/framework/io -I/wrkdirs/usr/ports/misc/py-paddlepaddle/work/.build/third_party/install/zlib/include -I/wrkdirs/usr/ports/misc/py-paddlepaddle/work/.build/third_party/install -I/wrkdirs/usr/ports/misc/py-paddlepaddle/work/.build/third_party/install/gflags/include -I/wrkdirs/usr/ports/misc/py-paddlepaddle/work/.bui
ld/third_party/install/glog/include -I/wrkdirs/usr/ports/misc/py-paddlepaddle/work/Paddle-3.3.1/third_party/eigen3 -I/wrkdirs/usr/ports/misc/py-paddlepaddle/work/Paddle-3.3.1/third_party/threadpool -I/wrkdirs/usr/ports/misc/py-paddlepaddle/work/Paddle-3.3.1/third_party/dlpack/include -I/wrkdirs/usr/ports/misc/py-paddlepaddle/work/.build/third_party/install/xxhash/include -I/wrkdirs/usr/ports/misc/py-paddlepaddle/work/.build/third_party/install/warpctc/include -I/wrkdirs/usr/ports/misc/py-paddlepaddle/work/.build/third_party/install/warprnnt/include -I/wrkdirs/usr/ports/misc/py-paddlepaddle/work/.build/third_party/install/utf8proc/include -I/wrkdirs/usr/ports/misc/py-paddlepaddle/work/.build/third_party/install/protobuf/include -I/wrkdirs/usr/ports/misc/py-paddlepaddle/work/Paddle-3.3.1/third_party/nlohmann_json/include -I/wrkdirs/usr/ports/misc/py-paddlepaddle/work/.build/third_party/install/yaml-cpp/include -I/usr/local/include/python3.12 -I/usr/local/lib/python3.12/site-pa
ckages/numpy/_core/include -I/wrkdirs/usr/ports/misc/py-paddlepaddle/work/.build/third_party/pybind/src/extern_pybind/include -I/wrkdirs/usr/ports/misc/py-paddlepaddle/work/.build/third_party/install/libuv/include -I/wrkdirs/usr/ports/misc/py-paddlepaddle/work/.build/third_party/install/gloo/include -I/wrkdirs/usr/ports/misc/py-paddlepaddle/work/.build/third_party/install/xbyak/include -I/wrkdirs/usr/ports/misc/py-paddlepaddle/work/.build/third_party/install/xbyak/include/xbyak -I/wrkdirs/usr/ports/misc/py-paddlepaddle/work/.build/third_party/install/cryptopp/include -I/wrkdirs/usr/ports/misc/py-paddlepaddle/work/.build/third_party/pocketfft/src -I/wrkdirs/usr/ports/misc/py-paddlepaddle/work/Paddle-3.3.1 -I/wrkdirs/usr/ports/misc/py-paddlepaddle/work/Paddle-3.3.1/paddle/phi/api/include/compat -I/wrkdirs/usr/ports/misc/py-paddlepaddle/work/Paddle-3.3.1/paddle/phi/api/include/compat/torch/csrc/api/include -I/wrkdirs/usr/ports/misc/py-paddlepaddle/work/.build/../paddle/fluid/fr
amework/io -isystem /usr/local/include -O2 -pipe -fstack-protector-strong -fno-strict-aliasing -Wno-invalid-specialization -Wno-error=deprecated-declarations -Wno-deprecated-declarations -Wno-error=uninitialized -std=c++17 -m64 -fPIC -fno-omit-frame-pointer -pipe -ffunction-sections -fdata-sections -Wall -Wextra -Wno-unused-parameter -Wno-unused-function -Wno-error=array-bounds -Wno-error=ignored-attributes -Wno-error=int-in-bool-context -Wno-error=unknown-warning-option -Wno-error=unused-private-field -Wno-error=unused-const-variable -Wno-error=deprecated-copy-with-user-provided-copy -Wno-error=deprecated-copy -Wno-error=inconsistent-missing-override -Wno-error=bitwise-instead-of-logical -Wno-error=overloaded-virtual -Wno-error=defaulted-function-deleted -Wno-ignored-qualifiers -Wno-ignored-attributes -Wno-parentheses -O3 -DNDEBUG -fPIC -MD -MT paddle/phi/CMakeFiles/phi_core.dir/core/platform/device_event_base.cc.o -MF paddle/phi/CMakeFiles/phi_core.dir/core/platform/dev
ice_event_base.cc.o.d -o paddle/phi/CMakeFiles/phi_core.dir/core/platform/device_event_base.cc.o -c /wrkdirs/usr/ports/misc/py-paddlepaddle/work/Paddle-3.3.1/paddle/phi/core/platform/device_event_base.cc
In file included from /wrkdirs/usr/ports/misc/py-paddlepaddle/work/Paddle-3.3.1/paddle/phi/core/platform/device_event_base.cc:15:
In file included from /wrkdirs/usr/ports/misc/py-paddlepaddle/work/Paddle-3.3.1/paddle/phi/core/platform/device_event_base.h:19:
In file included from /wrkdirs/usr/ports/misc/py-paddlepaddle/work/Paddle-3.3.1/paddle/phi/core/platform/device_context.h:24:
In file included from /wrkdirs/usr/ports/misc/py-paddlepaddle/work/Paddle-3.3.1/paddle/phi/core/memory/malloc.h:22:
/wrkdirs/usr/ports/misc/py-paddlepaddle/work/Paddle-3.3.1/paddle/phi/core/memory/allocation/allocator.h:293:20: warning: 'AllocateImpl' overrides a member function but is not marked 'override' [-Winconsistent-missing-override]
293 | phi::Allocation* AllocateImpl(size_t UNUSED) { return nullptr; }
| ^
/wrkdirs/usr/ports/misc/py-paddlepaddle/work/Paddle-3.3.1/paddle/phi/core/memory/allocation/allocator.h:210:28: note: overridden virtual function is here
210 | virtual phi::Allocation* AllocateImpl(size_t size) = 0;
| ^
1 warning generated.
[ 13% 339/2552] /usr/local/llvm21/bin/clang++ -DGLOG_NO_ABBREVIATED_SEVERITIES -DHPPL_STUB_FUNC -DLAPACK_FOUND -DPADDLE_DISABLE_PROFILER -DPADDLE_DLL_EXPORT -DPADDLE_ON_INFERENCE -DPADDLE_SLEEF_POW_PRECISION=10 -DPADDLE_USE_OPENBLAS -DPADDLE_USE_PTHREAD_BARRIER -DPADDLE_USE_PTHREAD_SPINLOCK -DPADDLE_VERSION=3.3.0.dev -DPADDLE_VERSION_INTEGER=3003000 -DPADDLE_WITH_CRYPTO -DPADDLE_WITH_POCKETFFT -DPADDLE_WITH_SLEEF -DPADDLE_WITH_XBYAK -DPHI_INNER -DPHI_SHARED -DSTATIC_IR -DXBYAK64 -DXBYAK_NO_OP_NAMES -DYAML_CPP_STATIC_DEFINE -Dphi_core_EXPORTS -I/wrkdirs/usr/ports/misc/py-paddlepaddle/work/.build -I/wrkdirs/usr/ports/misc/py-paddlepaddle/work/Paddle-3.3.1/paddle/fluid/framework/io -I/wrkdirs/usr/ports/misc/py-paddlepaddle/work/.build/third_party/install/zlib/include -I/wrkdirs/usr/ports/misc/py-paddlepaddle/work/.build/third_party/install -I/wrkdirs/usr/ports/misc/py-paddlepaddle/work/.build/third_party/install/gflags/include -I/wrkdirs/usr/ports/misc/py-paddlepaddle/work/.bui
ld/third_party/install/glog/include -I/wrkdirs/usr/ports/misc/py-paddlepaddle/work/Paddle-3.3.1/third_party/eigen3 -I/wrkdirs/usr/ports/misc/py-paddlepaddle/work/Paddle-3.3.1/third_party/threadpool -I/wrkdirs/usr/ports/misc/py-paddlepaddle/work/Paddle-3.3.1/third_party/dlpack/include -I/wrkdirs/usr/ports/misc/py-paddlepaddle/work/.build/third_party/install/xxhash/include -I/wrkdirs/usr/ports/misc/py-paddlepaddle/work/.build/third_party/install/warpctc/include -I/wrkdirs/usr/ports/misc/py-paddlepaddle/work/.build/third_party/install/warprnnt/include -I/wrkdirs/usr/ports/misc/py-paddlepaddle/work/.build/third_party/install/utf8proc/include -I/wrkdirs/usr/ports/misc/py-paddlepaddle/work/.build/third_party/install/protobuf/include -I/wrkdirs/usr/ports/misc/py-paddlepaddle/work/Paddle-3.3.1/third_party/nlohmann_json/include -I/wrkdirs/usr/ports/misc/py-paddlepaddle/work/.build/third_party/install/yaml-cpp/include -I/usr/local/include/python3.12 -I/usr/local/lib/python3.12/site-pa
ckages/numpy/_core/include -I/wrkdirs/usr/ports/misc/py-paddlepaddle/work/.build/third_party/pybind/src/extern_pybind/include -I/wrkdirs/usr/ports/misc/py-paddlepaddle/work/.build/third_party/install/libuv/include -I/wrkdirs/usr/ports/misc/py-paddlepaddle/work/.build/third_party/install/gloo/include -I/wrkdirs/usr/ports/misc/py-paddlepaddle/work/.build/third_party/install/xbyak/include -I/wrkdirs/usr/ports/misc/py-paddlepaddle/work/.build/third_party/install/xbyak/include/xbyak -I/wrkdirs/usr/ports/misc/py-paddlepaddle/work/.build/third_party/install/cryptopp/include -I/wrkdirs/usr/ports/misc/py-paddlepaddle/work/.build/third_party/pocketfft/src -I/wrkdirs/usr/ports/misc/py-paddlepaddle/work/Paddle-3.3.1 -I/wrkdirs/usr/ports/misc/py-paddlepaddle/work/Paddle-3.3.1/paddle/phi/api/include/compat -I/wrkdirs/usr/ports/misc/py-paddlepaddle/work/Paddle-3.3.1/paddle/phi/api/include/compat/torch/csrc/api/include -I/wrkdirs/usr/ports/misc/py-paddlepaddle/work/.build/../paddle/fluid/fr
amework/io -isystem /usr/local/include -O2 -pipe -fstack-protector-strong -fno-strict-aliasing -Wno-invalid-specialization -Wno-error=deprecated-declarations -Wno-deprecated-declarations -Wno-error=uninitialized -std=c++17 -m64 -fPIC -fno-omit-frame-pointer -pipe -ffunction-sections -fdata-sections -Wall -Wextra -Wno-unused-parameter -Wno-unused-function -Wno-error=array-bounds -Wno-error=ignored-attributes -Wno-error=int-in-bool-context -Wno-error=unknown-warning-option -Wno-error=unused-private-field -Wno-error=unused-const-variable -Wno-error=deprecated-copy-with-user-provided-copy -Wno-error=deprecated-copy -Wno-error=inconsistent-missing-override -Wno-error=bitwise-instead-of-logical -Wno-error=overloaded-virtual -Wno-error=defaulted-function-deleted -Wno-ignored-qualifiers -Wno-ignored-attributes -Wno-parentheses -O3 -DNDEBUG -fPIC -MD -MT paddle/phi/CMakeFiles/phi_core.dir/core/platform/device_event_defs.cc.o -MF paddle/phi/CMakeFiles/phi_core.dir/core/platform/dev
ice_event_defs.cc.o.d -o paddle/phi/CMakeFiles/phi_core.dir/core/platform/device_event_defs.cc.o -c /wrkdirs/usr/ports/misc/py-paddlepaddle/work/Paddle-3.3.1/paddle/phi/core/platform/device_event_defs.cc
[ 13% 340/2552] /usr/local/llvm21/bin/clang++ -DGLOG_NO_ABBREVIATED_SEVERITIES -DHPPL_STUB_FUNC -DLAPACK_FOUND -DPADDLE_DISABLE_PROFILER -DPADDLE_DLL_EXPORT -DPADDLE_ON_INFERENCE -DPADDLE_SLEEF_POW_PRECISION=10 -DPADDLE_USE_OPENBLAS -DPADDLE_USE_PTHREAD_BARRIER -DPADDLE_USE_PTHREAD_SPINLOCK -DPADDLE_VERSION=3.3.0.dev -DPADDLE_VERSION_INTEGER=3003000 -DPADDLE_WITH_CRYPTO -DPADDLE_WITH_POCKETFFT -DPADDLE_WITH_SLEEF -DPADDLE_WITH_XBYAK -DPHI_INNER -DPHI_SHARED -DSTATIC_IR -DXBYAK64 -DXBYAK_NO_OP_NAMES -DYAML_CPP_STATIC_DEFINE -Dphi_core_EXPORTS -I/wrkdirs/usr/ports/misc/py-paddlepaddle/work/.build -I/wrkdirs/usr/ports/misc/py-paddlepaddle/work/Paddle-3.3.1/paddle/fluid/framework/io -I/wrkdirs/usr/ports/misc/py-paddlepaddle/work/.build/third_party/install/zlib/include -I/wrkdirs/usr/ports/misc/py-paddlepaddle/work/.build/third_party/install -I/wrkdirs/usr/ports/misc/py-paddlepaddle/work/.build/third_party/install/gflags/include -I/wrkdirs/usr/ports/misc/py-paddlepaddle/work/.bui
ld/third_party/install/glog/include -I/wrkdirs/usr/ports/misc/py-paddlepaddle/work/Paddle-3.3.1/third_party/eigen3 -I/wrkdirs/usr/ports/misc/py-paddlepaddle/work/Paddle-3.3.1/third_party/threadpool -I/wrkdirs/usr/ports/misc/py-paddlepaddle/work/Paddle-3.3.1/third_party/dlpack/include -I/wrkdirs/usr/ports/misc/py-paddlepaddle/work/.build/third_party/install/xxhash/include -I/wrkdirs/usr/ports/misc/py-paddlepaddle/work/.build/third_party/install/warpctc/include -I/wrkdirs/usr/ports/misc/py-paddlepaddle/work/.build/third_party/install/warprnnt/include -I/wrkdirs/usr/ports/misc/py-paddlepaddle/work/.build/third_party/install/utf8proc/include -I/wrkdirs/usr/ports/misc/py-paddlepaddle/work/.build/third_party/install/protobuf/include -I/wrkdirs/usr/ports/misc/py-paddlepaddle/work/Paddle-3.3.1/third_party/nlohmann_json/include -I/wrkdirs/usr/ports/misc/py-paddlepaddle/work/.build/third_party/install/yaml-cpp/include -I/usr/local/include/python3.12 -I/usr/local/lib/python3.12/site-pa
ckages/numpy/_core/include -I/wrkdirs/usr/ports/misc/py-paddlepaddle/work/.build/third_party/pybind/src/extern_pybind/include -I/wrkdirs/usr/ports/misc/py-paddlepaddle/work/.build/third_party/install/libuv/include -I/wrkdirs/usr/ports/misc/py-paddlepaddle/work/.build/third_party/install/gloo/include -I/wrkdirs/usr/ports/misc/py-paddlepaddle/work/.build/third_party/install/xbyak/include -I/wrkdirs/usr/ports/misc/py-paddlepaddle/work/.build/third_party/install/xbyak/include/xbyak -I/wrkdirs/usr/ports/misc/py-paddlepaddle/work/.build/third_party/install/cryptopp/include -I/wrkdirs/usr/ports/misc/py-paddlepaddle/work/.build/third_party/pocketfft/src -I/wrkdirs/usr/ports/misc/py-paddlepaddle/work/Paddle-3.3.1 -I/wrkdirs/usr/ports/misc/py-paddlepaddle/work/Paddle-3.3.1/paddle/phi/api/include/compat -I/wrkdirs/usr/ports/misc/py-paddlepaddle/work/Paddle-3.3.1/paddle/phi/api/include/compat/torch/csrc/api/include -I/wrkdirs/usr/ports/misc/py-paddlepaddle/work/.build/../paddle/fluid/fr
amework/io -isystem /usr/local/include -O2 -pipe -fstack-protector-strong -fno-strict-aliasing -Wno-invalid-specialization -Wno-error=deprecated-declarations -Wno-deprecated-declarations -Wno-error=uninitialized -std=c++17 -m64 -fPIC -fno-omit-frame-pointer -pipe -ffunction-sections -fdata-sections -Wall -Wextra -Wno-unused-parameter -Wno-unused-function -Wno-error=array-bounds -Wno-error=ignored-attributes -Wno-error=int-in-bool-context -Wno-error=unknown-warning-option -Wno-error=unused-private-field -Wno-error=unused-const-variable -Wno-error=deprecated-copy-with-user-provided-copy -Wno-error=deprecated-copy -Wno-error=inconsistent-missing-override -Wno-error=bitwise-instead-of-logical -Wno-error=overloaded-virtual -Wno-error=defaulted-function-deleted -Wno-ignored-qualifiers -Wno-ignored-attributes -Wno-parentheses -O3 -DNDEBUG -fPIC -MD -MT paddle/phi/CMakeFiles/phi_core.dir/core/platform/cuda_graph_with_memory_pool.cc.o -MF paddle/phi/CMakeFiles/phi_core.dir/core/pl
atform/cuda_graph_with_memory_pool.cc.o.d -o paddle/phi/CMakeFiles/phi_core.dir/core/platform/cuda_graph_with_memory_pool.cc.o -c /wrkdirs/usr/ports/misc/py-paddlepaddle/work/Paddle-3.3.1/paddle/phi/core/platform/cuda_graph_with_memory_pool.cc
In file included from /wrkdirs/usr/ports/misc/py-paddlepaddle/work/Paddle-3.3.1/paddle/phi/core/platform/cuda_graph_with_memory_pool.cc:20:
In file included from /wrkdirs/usr/ports/misc/py-paddlepaddle/work/Paddle-3.3.1/paddle/phi/core/memory/allocation/allocator_facade.h:18:
/wrkdirs/usr/ports/misc/py-paddlepaddle/work/Paddle-3.3.1/paddle/phi/core/memory/allocation/allocator.h:293:20: warning: 'AllocateImpl' overrides a member function but is not marked 'override' [-Winconsistent-missing-override]
293 | phi::Allocation* AllocateImpl(size_t UNUSED) { return nullptr; }
| ^
/wrkdirs/usr/ports/misc/py-paddlepaddle/work/Paddle-3.3.1/paddle/phi/core/memory/allocation/allocator.h:210:28: note: overridden virtual function is here
210 | virtual phi::Allocation* AllocateImpl(size_t size) = 0;
| ^
1 warning generated.
[ 13% 341/2552] /usr/local/llvm21/bin/clang++ -DGLOG_NO_ABBREVIATED_SEVERITIES -DHPPL_STUB_FUNC -DLAPACK_FOUND -DPADDLE_DISABLE_PROFILER -DPADDLE_DLL_EXPORT -DPADDLE_ON_INFERENCE -DPADDLE_SLEEF_POW_PRECISION=10 -DPADDLE_USE_OPENBLAS -DPADDLE_USE_PTHREAD_BARRIER -DPADDLE_USE_PTHREAD_SPINLOCK -DPADDLE_VERSION=3.3.0.dev -DPADDLE_VERSION_INTEGER=3003000 -DPADDLE_WITH_CRYPTO -DPADDLE_WITH_POCKETFFT -DPADDLE_WITH_SLEEF -DPADDLE_WITH_XBYAK -DPHI_INNER -DPHI_SHARED -DSTATIC_IR -DXBYAK64 -DXBYAK_NO_OP_NAMES -DYAML_CPP_STATIC_DEFINE -Dphi_core_EXPORTS -I/wrkdirs/usr/ports/misc/py-paddlepaddle/work/.build -I/wrkdirs/usr/ports/misc/py-paddlepaddle/work/Paddle-3.3.1/paddle/fluid/framework/io -I/wrkdirs/usr/ports/misc/py-paddlepaddle/work/.build/third_party/install/zlib/include -I/wrkdirs/usr/ports/misc/py-paddlepaddle/work/.build/third_party/install -I/wrkdirs/usr/ports/misc/py-paddlepaddle/work/.build/third_party/install/gflags/include -I/wrkdirs/usr/ports/misc/py-paddlepaddle/work/.bui
ld/third_party/install/glog/include -I/wrkdirs/usr/ports/misc/py-paddlepaddle/work/Paddle-3.3.1/third_party/eigen3 -I/wrkdirs/usr/ports/misc/py-paddlepaddle/work/Paddle-3.3.1/third_party/threadpool -I/wrkdirs/usr/ports/misc/py-paddlepaddle/work/Paddle-3.3.1/third_party/dlpack/include -I/wrkdirs/usr/ports/misc/py-paddlepaddle/work/.build/third_party/install/xxhash/include -I/wrkdirs/usr/ports/misc/py-paddlepaddle/work/.build/third_party/install/warpctc/include -I/wrkdirs/usr/ports/misc/py-paddlepaddle/work/.build/third_party/install/warprnnt/include -I/wrkdirs/usr/ports/misc/py-paddlepaddle/work/.build/third_party/install/utf8proc/include -I/wrkdirs/usr/ports/misc/py-paddlepaddle/work/.build/third_party/install/protobuf/include -I/wrkdirs/usr/ports/misc/py-paddlepaddle/work/Paddle-3.3.1/third_party/nlohmann_json/include -I/wrkdirs/usr/ports/misc/py-paddlepaddle/work/.build/third_party/install/yaml-cpp/include -I/usr/local/include/python3.12 -I/usr/local/lib/python3.12/site-pa
ckages/numpy/_core/include -I/wrkdirs/usr/ports/misc/py-paddlepaddle/work/.build/third_party/pybind/src/extern_pybind/include -I/wrkdirs/usr/ports/misc/py-paddlepaddle/work/.build/third_party/install/libuv/include -I/wrkdirs/usr/ports/misc/py-paddlepaddle/work/.build/third_party/install/gloo/include -I/wrkdirs/usr/ports/misc/py-paddlepaddle/work/.build/third_party/install/xbyak/include -I/wrkdirs/usr/ports/misc/py-paddlepaddle/work/.build/third_party/install/xbyak/include/xbyak -I/wrkdirs/usr/ports/misc/py-paddlepaddle/work/.build/third_party/install/cryptopp/include -I/wrkdirs/usr/ports/misc/py-paddlepaddle/work/.build/third_party/pocketfft/src -I/wrkdirs/usr/ports/misc/py-paddlepaddle/work/Paddle-3.3.1 -I/wrkdirs/usr/ports/misc/py-paddlepaddle/work/Paddle-3.3.1/paddle/phi/api/include/compat -I/wrkdirs/usr/ports/misc/py-paddlepaddle/work/Paddle-3.3.1/paddle/phi/api/include/compat/torch/csrc/api/include -I/wrkdirs/usr/ports/misc/py-paddlepaddle/work/.build/../paddle/fluid/fr
amework/io -isystem /usr/local/include -O2 -pipe -fstack-protector-strong -fno-strict-aliasing -Wno-invalid-specialization -Wno-error=deprecated-declarations -Wno-deprecated-declarations -Wno-error=uninitialized -std=c++17 -m64 -fPIC -fno-omit-frame-pointer -pipe -ffunction-sections -fdata-sections -Wall -Wextra -Wno-unused-parameter -Wno-unused-function -Wno-error=array-bounds -Wno-error=ignored-attributes -Wno-error=int-in-bool-context -Wno-error=unknown-warning-option -Wno-error=unused-private-field -Wno-error=unused-const-variable -Wno-error=deprecated-copy-with-user-provided-copy -Wno-error=deprecated-copy -Wno-error=inconsistent-missing-override -Wno-error=bitwise-instead-of-logical -Wno-error=overloaded-virtual -Wno-error=defaulted-function-deleted -Wno-ignored-qualifiers -Wno-ignored-attributes -Wno-parentheses -O3 -DNDEBUG -fPIC -MD -MT paddle/phi/CMakeFiles/phi_core.dir/core/platform/gen_comm_id_helper.cc.o -MF paddle/phi/CMakeFiles/phi_core.dir/core/platform/ge
n_comm_id_helper.cc.o.d -o paddle/phi/CMakeFiles/phi_core.dir/core/platform/gen_comm_id_helper.cc.o -c /wrkdirs/usr/ports/misc/py-paddlepaddle/work/Paddle-3.3.1/paddle/phi/core/platform/gen_comm_id_helper.cc
[ 13% 342/2552] /usr/local/llvm21/bin/clang++ -DGLOG_NO_ABBREVIATED_SEVERITIES -DHPPL_STUB_FUNC -DLAPACK_FOUND -DPADDLE_DISABLE_PROFILER -DPADDLE_DLL_EXPORT -DPADDLE_ON_INFERENCE -DPADDLE_SLEEF_POW_PRECISION=10 -DPADDLE_USE_OPENBLAS -DPADDLE_USE_PTHREAD_BARRIER -DPADDLE_USE_PTHREAD_SPINLOCK -DPADDLE_VERSION=3.3.0.dev -DPADDLE_VERSION_INTEGER=3003000 -DPADDLE_WITH_CRYPTO -DPADDLE_WITH_POCKETFFT -DPADDLE_WITH_SLEEF -DPADDLE_WITH_XBYAK -DPHI_INNER -DPHI_SHARED -DSTATIC_IR -DXBYAK64 -DXBYAK_NO_OP_NAMES -DYAML_CPP_STATIC_DEFINE -Dphi_core_EXPORTS -I/wrkdirs/usr/ports/misc/py-paddlepaddle/work/.build -I/wrkdirs/usr/ports/misc/py-paddlepaddle/work/Paddle-3.3.1/paddle/fluid/framework/io -I/wrkdirs/usr/ports/misc/py-paddlepaddle/work/.build/third_party/install/zlib/include -I/wrkdirs/usr/ports/misc/py-paddlepaddle/work/.build/third_party/install -I/wrkdirs/usr/ports/misc/py-paddlepaddle/work/.build/third_party/install/gflags/include -I/wrkdirs/usr/ports/misc/py-paddlepaddle/work/.bui
ld/third_party/install/glog/include -I/wrkdirs/usr/ports/misc/py-paddlepaddle/work/Paddle-3.3.1/third_party/eigen3 -I/wrkdirs/usr/ports/misc/py-paddlepaddle/work/Paddle-3.3.1/third_party/threadpool -I/wrkdirs/usr/ports/misc/py-paddlepaddle/work/Paddle-3.3.1/third_party/dlpack/include -I/wrkdirs/usr/ports/misc/py-paddlepaddle/work/.build/third_party/install/xxhash/include -I/wrkdirs/usr/ports/misc/py-paddlepaddle/work/.build/third_party/install/warpctc/include -I/wrkdirs/usr/ports/misc/py-paddlepaddle/work/.build/third_party/install/warprnnt/include -I/wrkdirs/usr/ports/misc/py-paddlepaddle/work/.build/third_party/install/utf8proc/include -I/wrkdirs/usr/ports/misc/py-paddlepaddle/work/.build/third_party/install/protobuf/include -I/wrkdirs/usr/ports/misc/py-paddlepaddle/work/Paddle-3.3.1/third_party/nlohmann_json/include -I/wrkdirs/usr/ports/misc/py-paddlepaddle/work/.build/third_party/install/yaml-cpp/include -I/usr/local/include/python3.12 -I/usr/local/lib/python3.12/site-pa
ckages/numpy/_core/include -I/wrkdirs/usr/ports/misc/py-paddlepaddle/work/.build/third_party/pybind/src/extern_pybind/include -I/wrkdirs/usr/ports/misc/py-paddlepaddle/work/.build/third_party/install/libuv/include -I/wrkdirs/usr/ports/misc/py-paddlepaddle/work/.build/third_party/install/gloo/include -I/wrkdirs/usr/ports/misc/py-paddlepaddle/work/.build/third_party/install/xbyak/include -I/wrkdirs/usr/ports/misc/py-paddlepaddle/work/.build/third_party/install/xbyak/include/xbyak -I/wrkdirs/usr/ports/misc/py-paddlepaddle/work/.build/third_party/install/cryptopp/include -I/wrkdirs/usr/ports/misc/py-paddlepaddle/work/.build/third_party/pocketfft/src -I/wrkdirs/usr/ports/misc/py-paddlepaddle/work/Paddle-3.3.1 -I/wrkdirs/usr/ports/misc/py-paddlepaddle/work/Paddle-3.3.1/paddle/phi/api/include/compat -I/wrkdirs/usr/ports/misc/py-paddlepaddle/work/Paddle-3.3.1/paddle/phi/api/include/compat/torch/csrc/api/include -I/wrkdirs/usr/ports/misc/py-paddlepaddle/work/.build/../paddle/fluid/fr
amework/io -isystem /usr/local/include -O2 -pipe -fstack-protector-strong -fno-strict-aliasing -Wno-invalid-specialization -Wno-error=deprecated-declarations -Wno-deprecated-declarations -Wno-error=uninitialized -std=c++17 -m64 -fPIC -fno-omit-frame-pointer -pipe -ffunction-sections -fdata-sections -Wall -Wextra -Wno-unused-parameter -Wno-unused-function -Wno-error=array-bounds -Wno-error=ignored-attributes -Wno-error=int-in-bool-context -Wno-error=unknown-warning-option -Wno-error=unused-private-field -Wno-error=unused-const-variable -Wno-error=deprecated-copy-with-user-provided-copy -Wno-error=deprecated-copy -Wno-error=inconsistent-missing-override -Wno-error=bitwise-instead-of-logical -Wno-error=overloaded-virtual -Wno-error=defaulted-function-deleted -Wno-ignored-qualifiers -Wno-ignored-attributes -Wno-parentheses -O3 -DNDEBUG -fPIC -MD -MT paddle/phi/CMakeFiles/phi_core.dir/core/platform/device_context.cc.o -MF paddle/phi/CMakeFiles/phi_core.dir/core/platform/device
_context.cc.o.d -o paddle/phi/CMakeFiles/phi_core.dir/core/platform/device_context.cc.o -c /wrkdirs/usr/ports/misc/py-paddlepaddle/work/Paddle-3.3.1/paddle/phi/core/platform/device_context.cc
In file included from /wrkdirs/usr/ports/misc/py-paddlepaddle/work/Paddle-3.3.1/paddle/phi/core/platform/device_context.cc:15:
In file included from /wrkdirs/usr/ports/misc/py-paddlepaddle/work/Paddle-3.3.1/paddle/phi/core/platform/device_context.h:24:
In file included from /wrkdirs/usr/ports/misc/py-paddlepaddle/work/Paddle-3.3.1/paddle/phi/core/memory/malloc.h:22:
/wrkdirs/usr/ports/misc/py-paddlepaddle/work/Paddle-3.3.1/paddle/phi/core/memory/allocation/allocator.h:293:20: warning: 'AllocateImpl' overrides a member function but is not marked 'override' [-Winconsistent-missing-override]
293 | phi::Allocation* AllocateImpl(size_t UNUSED) { return nullptr; }
| ^
/wrkdirs/usr/ports/misc/py-paddlepaddle/work/Paddle-3.3.1/paddle/phi/core/memory/allocation/allocator.h:210:28: note: overridden virtual function is here
210 | virtual phi::Allocation* AllocateImpl(size_t size) = 0;
| ^
1 warning generated.
[ 13% 343/2552] /usr/local/llvm21/bin/clang++ -DGLOG_NO_ABBREVIATED_SEVERITIES -DHPPL_STUB_FUNC -DLAPACK_FOUND -DPADDLE_DISABLE_PROFILER -DPADDLE_DLL_EXPORT -DPADDLE_ON_INFERENCE -DPADDLE_SLEEF_POW_PRECISION=10 -DPADDLE_USE_OPENBLAS -DPADDLE_USE_PTHREAD_BARRIER -DPADDLE_USE_PTHREAD_SPINLOCK -DPADDLE_VERSION=3.3.0.dev -DPADDLE_VERSION_INTEGER=3003000 -DPADDLE_WITH_CRYPTO -DPADDLE_WITH_POCKETFFT -DPADDLE_WITH_SLEEF -DPADDLE_WITH_XBYAK -DPHI_INNER -DPHI_SHARED -DSTATIC_IR -DXBYAK64 -DXBYAK_NO_OP_NAMES -DYAML_CPP_STATIC_DEFINE -Dphi_core_EXPORTS -I/wrkdirs/usr/ports/misc/py-paddlepaddle/work/.build -I/wrkdirs/usr/ports/misc/py-paddlepaddle/work/Paddle-3.3.1/paddle/fluid/framework/io -I/wrkdirs/usr/ports/misc/py-paddlepaddle/work/.build/third_party/install/zlib/include -I/wrkdirs/usr/ports/misc/py-paddlepaddle/work/.build/third_party/install -I/wrkdirs/usr/ports/misc/py-paddlepaddle/work/.build/third_party/install/gflags/include -I/wrkdirs/usr/ports/misc/py-paddlepaddle/work/.bui
ld/third_party/install/glog/include -I/wrkdirs/usr/ports/misc/py-paddlepaddle/work/Paddle-3.3.1/third_party/eigen3 -I/wrkdirs/usr/ports/misc/py-paddlepaddle/work/Paddle-3.3.1/third_party/threadpool -I/wrkdirs/usr/ports/misc/py-paddlepaddle/work/Paddle-3.3.1/third_party/dlpack/include -I/wrkdirs/usr/ports/misc/py-paddlepaddle/work/.build/third_party/install/xxhash/include -I/wrkdirs/usr/ports/misc/py-paddlepaddle/work/.build/third_party/install/warpctc/include -I/wrkdirs/usr/ports/misc/py-paddlepaddle/work/.build/third_party/install/warprnnt/include -I/wrkdirs/usr/ports/misc/py-paddlepaddle/work/.build/third_party/install/utf8proc/include -I/wrkdirs/usr/ports/misc/py-paddlepaddle/work/.build/third_party/install/protobuf/include -I/wrkdirs/usr/ports/misc/py-paddlepaddle/work/Paddle-3.3.1/third_party/nlohmann_json/include -I/wrkdirs/usr/ports/misc/py-paddlepaddle/work/.build/third_party/install/yaml-cpp/include -I/usr/local/include/python3.12 -I/usr/local/lib/python3.12/site-pa
ckages/numpy/_core/include -I/wrkdirs/usr/ports/misc/py-paddlepaddle/work/.build/third_party/pybind/src/extern_pybind/include -I/wrkdirs/usr/ports/misc/py-paddlepaddle/work/.build/third_party/install/libuv/include -I/wrkdirs/usr/ports/misc/py-paddlepaddle/work/.build/third_party/install/gloo/include -I/wrkdirs/usr/ports/misc/py-paddlepaddle/work/.build/third_party/install/xbyak/include -I/wrkdirs/usr/ports/misc/py-paddlepaddle/work/.build/third_party/install/xbyak/include/xbyak -I/wrkdirs/usr/ports/misc/py-paddlepaddle/work/.build/third_party/install/cryptopp/include -I/wrkdirs/usr/ports/misc/py-paddlepaddle/work/.build/third_party/pocketfft/src -I/wrkdirs/usr/ports/misc/py-paddlepaddle/work/Paddle-3.3.1 -I/wrkdirs/usr/ports/misc/py-paddlepaddle/work/Paddle-3.3.1/paddle/phi/api/include/compat -I/wrkdirs/usr/ports/misc/py-paddlepaddle/work/Paddle-3.3.1/paddle/phi/api/include/compat/torch/csrc/api/include -I/wrkdirs/usr/ports/misc/py-paddlepaddle/work/.build/../paddle/fluid/fr
amework/io -isystem /usr/local/include -O2 -pipe -fstack-protector-strong -fno-strict-aliasing -Wno-invalid-specialization -Wno-error=deprecated-declarations -Wno-deprecated-declarations -Wno-error=uninitialized -std=c++17 -m64 -fPIC -fno-omit-frame-pointer -pipe -ffunction-sections -fdata-sections -Wall -Wextra -Wno-unused-parameter -Wno-unused-function -Wno-error=array-bounds -Wno-error=ignored-attributes -Wno-error=int-in-bool-context -Wno-error=unknown-warning-option -Wno-error=unused-private-field -Wno-error=unused-const-variable -Wno-error=deprecated-copy-with-user-provided-copy -Wno-error=deprecated-copy -Wno-error=inconsistent-missing-override -Wno-error=bitwise-instead-of-logical -Wno-error=overloaded-virtual -Wno-error=defaulted-function-deleted -Wno-ignored-qualifiers -Wno-ignored-attributes -Wno-parentheses -O3 -DNDEBUG -fPIC -MD -MT paddle/phi/CMakeFiles/phi_core.dir/core/platform/profiler/utils.cc.o -MF paddle/phi/CMakeFiles/phi_core.dir/core/platform/profil
er/utils.cc.o.d -o paddle/phi/CMakeFiles/phi_core.dir/core/platform/profiler/utils.cc.o -c /wrkdirs/usr/ports/misc/py-paddlepaddle/work/Paddle-3.3.1/paddle/phi/core/platform/profiler/utils.cc
[ 13% 344/2552] /usr/local/llvm21/bin/clang++ -DGLOG_NO_ABBREVIATED_SEVERITIES -DHPPL_STUB_FUNC -DLAPACK_FOUND -DPADDLE_DISABLE_PROFILER -DPADDLE_DLL_EXPORT -DPADDLE_ON_INFERENCE -DPADDLE_SLEEF_POW_PRECISION=10 -DPADDLE_USE_OPENBLAS -DPADDLE_USE_PTHREAD_BARRIER -DPADDLE_USE_PTHREAD_SPINLOCK -DPADDLE_VERSION=3.3.0.dev -DPADDLE_VERSION_INTEGER=3003000 -DPADDLE_WITH_CRYPTO -DPADDLE_WITH_POCKETFFT -DPADDLE_WITH_SLEEF -DPADDLE_WITH_XBYAK -DPHI_INNER -DPHI_SHARED -DSTATIC_IR -DXBYAK64 -DXBYAK_NO_OP_NAMES -DYAML_CPP_STATIC_DEFINE -Dphi_core_EXPORTS -I/wrkdirs/usr/ports/misc/py-paddlepaddle/work/.build -I/wrkdirs/usr/ports/misc/py-paddlepaddle/work/Paddle-3.3.1/paddle/fluid/framework/io -I/wrkdirs/usr/ports/misc/py-paddlepaddle/work/.build/third_party/install/zlib/include -I/wrkdirs/usr/ports/misc/py-paddlepaddle/work/.build/third_party/install -I/wrkdirs/usr/ports/misc/py-paddlepaddle/work/.build/third_party/install/gflags/include -I/wrkdirs/usr/ports/misc/py-paddlepaddle/work/.bui
ld/third_party/install/glog/include -I/wrkdirs/usr/ports/misc/py-paddlepaddle/work/Paddle-3.3.1/third_party/eigen3 -I/wrkdirs/usr/ports/misc/py-paddlepaddle/work/Paddle-3.3.1/third_party/threadpool -I/wrkdirs/usr/ports/misc/py-paddlepaddle/work/Paddle-3.3.1/third_party/dlpack/include -I/wrkdirs/usr/ports/misc/py-paddlepaddle/work/.build/third_party/install/xxhash/include -I/wrkdirs/usr/ports/misc/py-paddlepaddle/work/.build/third_party/install/warpctc/include -I/wrkdirs/usr/ports/misc/py-paddlepaddle/work/.build/third_party/install/warprnnt/include -I/wrkdirs/usr/ports/misc/py-paddlepaddle/work/.build/third_party/install/utf8proc/include -I/wrkdirs/usr/ports/misc/py-paddlepaddle/work/.build/third_party/install/protobuf/include -I/wrkdirs/usr/ports/misc/py-paddlepaddle/work/Paddle-3.3.1/third_party/nlohmann_json/include -I/wrkdirs/usr/ports/misc/py-paddlepaddle/work/.build/third_party/install/yaml-cpp/include -I/usr/local/include/python3.12 -I/usr/local/lib/python3.12/site-pa
ckages/numpy/_core/include -I/wrkdirs/usr/ports/misc/py-paddlepaddle/work/.build/third_party/pybind/src/extern_pybind/include -I/wrkdirs/usr/ports/misc/py-paddlepaddle/work/.build/third_party/install/libuv/include -I/wrkdirs/usr/ports/misc/py-paddlepaddle/work/.build/third_party/install/gloo/include -I/wrkdirs/usr/ports/misc/py-paddlepaddle/work/.build/third_party/install/xbyak/include -I/wrkdirs/usr/ports/misc/py-paddlepaddle/work/.build/third_party/install/xbyak/include/xbyak -I/wrkdirs/usr/ports/misc/py-paddlepaddle/work/.build/third_party/install/cryptopp/include -I/wrkdirs/usr/ports/misc/py-paddlepaddle/work/.build/third_party/pocketfft/src -I/wrkdirs/usr/ports/misc/py-paddlepaddle/work/Paddle-3.3.1 -I/wrkdirs/usr/ports/misc/py-paddlepaddle/work/Paddle-3.3.1/paddle/phi/api/include/compat -I/wrkdirs/usr/ports/misc/py-paddlepaddle/work/Paddle-3.3.1/paddle/phi/api/include/compat/torch/csrc/api/include -I/wrkdirs/usr/ports/misc/py-paddlepaddle/work/.build/../paddle/fluid/fr
amework/io -isystem /usr/local/include -O2 -pipe -fstack-protector-strong -fno-strict-aliasing -Wno-invalid-specialization -Wno-error=deprecated-declarations -Wno-deprecated-declarations -Wno-error=uninitialized -std=c++17 -m64 -fPIC -fno-omit-frame-pointer -pipe -ffunction-sections -fdata-sections -Wall -Wextra -Wno-unused-parameter -Wno-unused-function -Wno-error=array-bounds -Wno-error=ignored-attributes -Wno-error=int-in-bool-context -Wno-error=unknown-warning-option -Wno-error=unused-private-field -Wno-error=unused-const-variable -Wno-error=deprecated-copy-with-user-provided-copy -Wno-error=deprecated-copy -Wno-error=inconsistent-missing-override -Wno-error=bitwise-instead-of-logical -Wno-error=overloaded-virtual -Wno-error=defaulted-function-deleted -Wno-ignored-qualifiers -Wno-ignored-attributes -Wno-parentheses -O3 -DNDEBUG -fPIC -MD -MT paddle/phi/CMakeFiles/phi_core.dir/core/platform/profiler/cpu_utilization.cc.o -MF paddle/phi/CMakeFiles/phi_core.dir/core/platf
orm/profiler/cpu_utilization.cc.o.d -o paddle/phi/CMakeFiles/phi_core.dir/core/platform/profiler/cpu_utilization.cc.o -c /wrkdirs/usr/ports/misc/py-paddlepaddle/work/Paddle-3.3.1/paddle/phi/core/platform/profiler/cpu_utilization.cc
In file included from /wrkdirs/usr/ports/misc/py-paddlepaddle/work/Paddle-3.3.1/paddle/phi/core/platform/profiler/cpu_utilization.cc:15:
/wrkdirs/usr/ports/misc/py-paddlepaddle/work/Paddle-3.3.1/paddle/phi/core/platform/profiler/cpu_utilization.h:50:11: warning: private field 'start_' is not used [-Wunused-private-field]
50 | clock_t start_, end_;
| ^
/wrkdirs/usr/ports/misc/py-paddlepaddle/work/Paddle-3.3.1/paddle/phi/core/platform/profiler/cpu_utilization.h:50:19: warning: private field 'end_' is not used [-Wunused-private-field]
50 | clock_t start_, end_;
| ^
/wrkdirs/usr/ports/misc/py-paddlepaddle/work/Paddle-3.3.1/paddle/phi/core/platform/profiler/cpu_utilization.h:51:12: warning: private field 'idle_start_' is not used [-Wunused-private-field]
51 | uint64_t idle_start_, idle_end_;
| ^
/wrkdirs/usr/ports/misc/py-paddlepaddle/work/Paddle-3.3.1/paddle/phi/core/platform/profiler/cpu_utilization.h:51:25: warning: private field 'idle_end_' is not used [-Wunused-private-field]
51 | uint64_t idle_start_, idle_end_;
| ^
/wrkdirs/usr/ports/misc/py-paddlepaddle/work/Paddle-3.3.1/paddle/phi/core/platform/profiler/cpu_utilization.h:52:12: warning: private field 'iowait_start_' is not used [-Wunused-private-field]
52 | uint64_t iowait_start_, iowait_end_;
| ^
/wrkdirs/usr/ports/misc/py-paddlepaddle/work/Paddle-3.3.1/paddle/phi/core/platform/profiler/cpu_utilization.h:52:27: warning: private field 'iowait_end_' is not used [-Wunused-private-field]
52 | uint64_t iowait_start_, iowait_end_;
| ^
/wrkdirs/usr/ports/misc/py-paddlepaddle/work/Paddle-3.3.1/paddle/phi/core/platform/profiler/cpu_utilization.h:53:12: warning: private field 'nice_time_start_' is not used [-Wunused-private-field]
53 | uint64_t nice_time_start_, nice_time_end_;
| ^
/wrkdirs/usr/ports/misc/py-paddlepaddle/work/Paddle-3.3.1/paddle/phi/core/platform/profiler/cpu_utilization.h:53:30: warning: private field 'nice_time_end_' is not used [-Wunused-private-field]
53 | uint64_t nice_time_start_, nice_time_end_;
| ^
/wrkdirs/usr/ports/misc/py-paddlepaddle/work/Paddle-3.3.1/paddle/phi/core/platform/profiler/cpu_utilization.h:54:12: warning: private field 'irq_start_' is not used [-Wunused-private-field]
54 | uint64_t irq_start_, irq_end_;
| ^
/wrkdirs/usr/ports/misc/py-paddlepaddle/work/Paddle-3.3.1/paddle/phi/core/platform/profiler/cpu_utilization.h:54:24: warning: private field 'irq_end_' is not used [-Wunused-private-field]
54 | uint64_t irq_start_, irq_end_;
| ^
/wrkdirs/usr/ports/misc/py-paddlepaddle/work/Paddle-3.3.1/paddle/phi/core/platform/profiler/cpu_utilization.h:55:12: warning: private field 'softirq_start_' is not used [-Wunused-private-field]
55 | uint64_t softirq_start_, softirq_end_;
| ^
/wrkdirs/usr/ports/misc/py-paddlepaddle/work/Paddle-3.3.1/paddle/phi/core/platform/profiler/cpu_utilization.h:55:28: warning: private field 'softirq_end_' is not used [-Wunused-private-field]
55 | uint64_t softirq_start_, softirq_end_;
| ^
/wrkdirs/usr/ports/misc/py-paddlepaddle/work/Paddle-3.3.1/paddle/phi/core/platform/profiler/cpu_utilization.h:56:12: warning: private field 'steal_start_' is not used [-Wunused-private-field]
56 | uint64_t steal_start_, steal_end_;
| ^
/wrkdirs/usr/ports/misc/py-paddlepaddle/work/Paddle-3.3.1/paddle/phi/core/platform/profiler/cpu_utilization.h:56:26: warning: private field 'steal_end_' is not used [-Wunused-private-field]
56 | uint64_t steal_start_, steal_end_;
| ^
/wrkdirs/usr/ports/misc/py-paddlepaddle/work/Paddle-3.3.1/paddle/phi/core/platform/profiler/cpu_utilization.h:57:14: warning: private field 'system_tms_start_' is not used [-Wunused-private-field]
57 | struct tms system_tms_start_, system_tms_end_;
| ^
/wrkdirs/usr/ports/misc/py-paddlepaddle/work/Paddle-3.3.1/paddle/phi/core/platform/profiler/cpu_utilization.h:57:33: warning: private field 'system_tms_end_' is not used [-Wunused-private-field]
57 | struct tms system_tms_start_, system_tms_end_;
| ^
/wrkdirs/usr/ports/misc/py-paddlepaddle/work/Paddle-3.3.1/paddle/phi/core/platform/profiler/cpu_utilization.h:58:14: warning: private field 'process_tms_start_' is not used [-Wunused-private-field]
58 | struct tms process_tms_start_, process_tms_end_;
| ^
/wrkdirs/usr/ports/misc/py-paddlepaddle/work/Paddle-3.3.1/paddle/phi/core/platform/profiler/cpu_utilization.h:58:34: warning: private field 'process_tms_end_' is not used [-Wunused-private-field]
58 | struct tms process_tms_start_, process_tms_end_;
| ^
18 warnings generated.
[ 13% 345/2552] /usr/local/llvm21/bin/clang++ -DGLOG_NO_ABBREVIATED_SEVERITIES -DHPPL_STUB_FUNC -DLAPACK_FOUND -DPADDLE_DISABLE_PROFILER -DPADDLE_DLL_EXPORT -DPADDLE_ON_INFERENCE -DPADDLE_SLEEF_POW_PRECISION=10 -DPADDLE_USE_OPENBLAS -DPADDLE_USE_PTHREAD_BARRIER -DPADDLE_USE_PTHREAD_SPINLOCK -DPADDLE_VERSION=3.3.0.dev -DPADDLE_VERSION_INTEGER=3003000 -DPADDLE_WITH_CRYPTO -DPADDLE_WITH_POCKETFFT -DPADDLE_WITH_SLEEF -DPADDLE_WITH_XBYAK -DPHI_INNER -DPHI_SHARED -DSTATIC_IR -DXBYAK64 -DXBYAK_NO_OP_NAMES -DYAML_CPP_STATIC_DEFINE -Dphi_core_EXPORTS -I/wrkdirs/usr/ports/misc/py-paddlepaddle/work/.build -I/wrkdirs/usr/ports/misc/py-paddlepaddle/work/Paddle-3.3.1/paddle/fluid/framework/io -I/wrkdirs/usr/ports/misc/py-paddlepaddle/work/.build/third_party/install/zlib/include -I/wrkdirs/usr/ports/misc/py-paddlepaddle/work/.build/third_party/install -I/wrkdirs/usr/ports/misc/py-paddlepaddle/work/.build/third_party/install/gflags/include -I/wrkdirs/usr/ports/misc/py-paddlepaddle/work/.bui
ld/third_party/install/glog/include -I/wrkdirs/usr/ports/misc/py-paddlepaddle/work/Paddle-3.3.1/third_party/eigen3 -I/wrkdirs/usr/ports/misc/py-paddlepaddle/work/Paddle-3.3.1/third_party/threadpool -I/wrkdirs/usr/ports/misc/py-paddlepaddle/work/Paddle-3.3.1/third_party/dlpack/include -I/wrkdirs/usr/ports/misc/py-paddlepaddle/work/.build/third_party/install/xxhash/include -I/wrkdirs/usr/ports/misc/py-paddlepaddle/work/.build/third_party/install/warpctc/include -I/wrkdirs/usr/ports/misc/py-paddlepaddle/work/.build/third_party/install/warprnnt/include -I/wrkdirs/usr/ports/misc/py-paddlepaddle/work/.build/third_party/install/utf8proc/include -I/wrkdirs/usr/ports/misc/py-paddlepaddle/work/.build/third_party/install/protobuf/include -I/wrkdirs/usr/ports/misc/py-paddlepaddle/work/Paddle-3.3.1/third_party/nlohmann_json/include -I/wrkdirs/usr/ports/misc/py-paddlepaddle/work/.build/third_party/install/yaml-cpp/include -I/usr/local/include/python3.12 -I/usr/local/lib/python3.12/site-pa
ckages/numpy/_core/include -I/wrkdirs/usr/ports/misc/py-paddlepaddle/work/.build/third_party/pybind/src/extern_pybind/include -I/wrkdirs/usr/ports/misc/py-paddlepaddle/work/.build/third_party/install/libuv/include -I/wrkdirs/usr/ports/misc/py-paddlepaddle/work/.build/third_party/install/gloo/include -I/wrkdirs/usr/ports/misc/py-paddlepaddle/work/.build/third_party/install/xbyak/include -I/wrkdirs/usr/ports/misc/py-paddlepaddle/work/.build/third_party/install/xbyak/include/xbyak -I/wrkdirs/usr/ports/misc/py-paddlepaddle/work/.build/third_party/install/cryptopp/include -I/wrkdirs/usr/ports/misc/py-paddlepaddle/work/.build/third_party/pocketfft/src -I/wrkdirs/usr/ports/misc/py-paddlepaddle/work/Paddle-3.3.1 -I/wrkdirs/usr/ports/misc/py-paddlepaddle/work/Paddle-3.3.1/paddle/phi/api/include/compat -I/wrkdirs/usr/ports/misc/py-paddlepaddle/work/Paddle-3.3.1/paddle/phi/api/include/compat/torch/csrc/api/include -I/wrkdirs/usr/ports/misc/py-paddlepaddle/work/.build/../paddle/fluid/fr
amework/io -isystem /usr/local/include -O2 -pipe -fstack-protector-strong -fno-strict-aliasing -Wno-invalid-specialization -Wno-error=deprecated-declarations -Wno-deprecated-declarations -Wno-error=uninitialized -std=c++17 -m64 -fPIC -fno-omit-frame-pointer -pipe -ffunction-sections -fdata-sections -Wall -Wextra -Wno-unused-parameter -Wno-unused-function -Wno-error=array-bounds -Wno-error=ignored-attributes -Wno-error=int-in-bool-context -Wno-error=unknown-warning-option -Wno-error=unused-private-field -Wno-error=unused-const-variable -Wno-error=deprecated-copy-with-user-provided-copy -Wno-error=deprecated-copy -Wno-error=inconsistent-missing-override -Wno-error=bitwise-instead-of-logical -Wno-error=overloaded-virtual -Wno-error=defaulted-function-deleted -Wno-ignored-qualifiers -Wno-ignored-attributes -Wno-parentheses -O3 -DNDEBUG -fPIC -MD -MT paddle/phi/CMakeFiles/phi_core.dir/core/platform/cpu_helper.cc.o -MF paddle/phi/CMakeFiles/phi_core.dir/core/platform/cpu_helper
.cc.o.d -o paddle/phi/CMakeFiles/phi_core.dir/core/platform/cpu_helper.cc.o -c /wrkdirs/usr/ports/misc/py-paddlepaddle/work/Paddle-3.3.1/paddle/phi/core/platform/cpu_helper.cc
[ 13% 346/2552] /usr/local/llvm21/bin/clang++ -DGLOG_NO_ABBREVIATED_SEVERITIES -DHPPL_STUB_FUNC -DLAPACK_FOUND -DPADDLE_DISABLE_PROFILER -DPADDLE_DLL_EXPORT -DPADDLE_ON_INFERENCE -DPADDLE_SLEEF_POW_PRECISION=10 -DPADDLE_USE_OPENBLAS -DPADDLE_USE_PTHREAD_BARRIER -DPADDLE_USE_PTHREAD_SPINLOCK -DPADDLE_VERSION=3.3.0.dev -DPADDLE_VERSION_INTEGER=3003000 -DPADDLE_WITH_CRYPTO -DPADDLE_WITH_POCKETFFT -DPADDLE_WITH_SLEEF -DPADDLE_WITH_XBYAK -DPHI_INNER -DPHI_SHARED -DSTATIC_IR -DXBYAK64 -DXBYAK_NO_OP_NAMES -DYAML_CPP_STATIC_DEFINE -Dphi_core_EXPORTS -I/wrkdirs/usr/ports/misc/py-paddlepaddle/work/.build -I/wrkdirs/usr/ports/misc/py-paddlepaddle/work/Paddle-3.3.1/paddle/fluid/framework/io -I/wrkdirs/usr/ports/misc/py-paddlepaddle/work/.build/third_party/install/zlib/include -I/wrkdirs/usr/ports/misc/py-paddlepaddle/work/.build/third_party/install -I/wrkdirs/usr/ports/misc/py-paddlepaddle/work/.build/third_party/install/gflags/include -I/wrkdirs/usr/ports/misc/py-paddlepaddle/work/.bui
ld/third_party/install/glog/include -I/wrkdirs/usr/ports/misc/py-paddlepaddle/work/Paddle-3.3.1/third_party/eigen3 -I/wrkdirs/usr/ports/misc/py-paddlepaddle/work/Paddle-3.3.1/third_party/threadpool -I/wrkdirs/usr/ports/misc/py-paddlepaddle/work/Paddle-3.3.1/third_party/dlpack/include -I/wrkdirs/usr/ports/misc/py-paddlepaddle/work/.build/third_party/install/xxhash/include -I/wrkdirs/usr/ports/misc/py-paddlepaddle/work/.build/third_party/install/warpctc/include -I/wrkdirs/usr/ports/misc/py-paddlepaddle/work/.build/third_party/install/warprnnt/include -I/wrkdirs/usr/ports/misc/py-paddlepaddle/work/.build/third_party/install/utf8proc/include -I/wrkdirs/usr/ports/misc/py-paddlepaddle/work/.build/third_party/install/protobuf/include -I/wrkdirs/usr/ports/misc/py-paddlepaddle/work/Paddle-3.3.1/third_party/nlohmann_json/include -I/wrkdirs/usr/ports/misc/py-paddlepaddle/work/.build/third_party/install/yaml-cpp/include -I/usr/local/include/python3.12 -I/usr/local/lib/python3.12/site-pa
ckages/numpy/_core/include -I/wrkdirs/usr/ports/misc/py-paddlepaddle/work/.build/third_party/pybind/src/extern_pybind/include -I/wrkdirs/usr/ports/misc/py-paddlepaddle/work/.build/third_party/install/libuv/include -I/wrkdirs/usr/ports/misc/py-paddlepaddle/work/.build/third_party/install/gloo/include -I/wrkdirs/usr/ports/misc/py-paddlepaddle/work/.build/third_party/install/xbyak/include -I/wrkdirs/usr/ports/misc/py-paddlepaddle/work/.build/third_party/install/xbyak/include/xbyak -I/wrkdirs/usr/ports/misc/py-paddlepaddle/work/.build/third_party/install/cryptopp/include -I/wrkdirs/usr/ports/misc/py-paddlepaddle/work/.build/third_party/pocketfft/src -I/wrkdirs/usr/ports/misc/py-paddlepaddle/work/Paddle-3.3.1 -I/wrkdirs/usr/ports/misc/py-paddlepaddle/work/Paddle-3.3.1/paddle/phi/api/include/compat -I/wrkdirs/usr/ports/misc/py-paddlepaddle/work/Paddle-3.3.1/paddle/phi/api/include/compat/torch/csrc/api/include -I/wrkdirs/usr/ports/misc/py-paddlepaddle/work/.build/../paddle/fluid/fr
amework/io -isystem /usr/local/include -O2 -pipe -fstack-protector-strong -fno-strict-aliasing -Wno-invalid-specialization -Wno-error=deprecated-declarations -Wno-deprecated-declarations -Wno-error=uninitialized -std=c++17 -m64 -fPIC -fno-omit-frame-pointer -pipe -ffunction-sections -fdata-sections -Wall -Wextra -Wno-unused-parameter -Wno-unused-function -Wno-error=array-bounds -Wno-error=ignored-attributes -Wno-error=int-in-bool-context -Wno-error=unknown-warning-option -Wno-error=unused-private-field -Wno-error=unused-const-variable -Wno-error=deprecated-copy-with-user-provided-copy -Wno-error=deprecated-copy -Wno-error=inconsistent-missing-override -Wno-error=bitwise-instead-of-logical -Wno-error=overloaded-virtual -Wno-error=defaulted-function-deleted -Wno-ignored-qualifiers -Wno-ignored-attributes -Wno-parentheses -O3 -DNDEBUG -fPIC -MD -MT paddle/phi/CMakeFiles/phi_core.dir/core/platform/denormal.cc.o -MF paddle/phi/CMakeFiles/phi_core.dir/core/platform/denormal.cc.
o.d -o paddle/phi/CMakeFiles/phi_core.dir/core/platform/denormal.cc.o -c /wrkdirs/usr/ports/misc/py-paddlepaddle/work/Paddle-3.3.1/paddle/phi/core/platform/denormal.cc
FAILED: [code=1] paddle/phi/CMakeFiles/phi_core.dir/core/platform/denormal.cc.o
/usr/local/llvm21/bin/clang++ -DGLOG_NO_ABBREVIATED_SEVERITIES -DHPPL_STUB_FUNC -DLAPACK_FOUND -DPADDLE_DISABLE_PROFILER -DPADDLE_DLL_EXPORT -DPADDLE_ON_INFERENCE -DPADDLE_SLEEF_POW_PRECISION=10 -DPADDLE_USE_OPENBLAS -DPADDLE_USE_PTHREAD_BARRIER -DPADDLE_USE_PTHREAD_SPINLOCK -DPADDLE_VERSION=3.3.0.dev -DPADDLE_VERSION_INTEGER=3003000 -DPADDLE_WITH_CRYPTO -DPADDLE_WITH_POCKETFFT -DPADDLE_WITH_SLEEF -DPADDLE_WITH_XBYAK -DPHI_INNER -DPHI_SHARED -DSTATIC_IR -DXBYAK64 -DXBYAK_NO_OP_NAMES -DYAML_CPP_STATIC_DEFINE -Dphi_core_EXPORTS -I/wrkdirs/usr/ports/misc/py-paddlepaddle/work/.build -I/wrkdirs/usr/ports/misc/py-paddlepaddle/work/Paddle-3.3.1/paddle/fluid/framework/io -I/wrkdirs/usr/ports/misc/py-paddlepaddle/work/.build/third_party/install/zlib/include -I/wrkdirs/usr/ports/misc/py-paddlepaddle/work/.build/third_party/install -I/wrkdirs/usr/ports/misc/py-paddlepaddle/work/.build/third_party/install/gflags/include -I/wrkdirs/usr/ports/misc/py-paddlepaddle/work/.build/third_party/i
nstall/glog/include -I/wrkdirs/usr/ports/misc/py-paddlepaddle/work/Paddle-3.3.1/third_party/eigen3 -I/wrkdirs/usr/ports/misc/py-paddlepaddle/work/Paddle-3.3.1/third_party/threadpool -I/wrkdirs/usr/ports/misc/py-paddlepaddle/work/Paddle-3.3.1/third_party/dlpack/include -I/wrkdirs/usr/ports/misc/py-paddlepaddle/work/.build/third_party/install/xxhash/include -I/wrkdirs/usr/ports/misc/py-paddlepaddle/work/.build/third_party/install/warpctc/include -I/wrkdirs/usr/ports/misc/py-paddlepaddle/work/.build/third_party/install/warprnnt/include -I/wrkdirs/usr/ports/misc/py-paddlepaddle/work/.build/third_party/install/utf8proc/include -I/wrkdirs/usr/ports/misc/py-paddlepaddle/work/.build/third_party/install/protobuf/include -I/wrkdirs/usr/ports/misc/py-paddlepaddle/work/Paddle-3.3.1/third_party/nlohmann_json/include -I/wrkdirs/usr/ports/misc/py-paddlepaddle/work/.build/third_party/install/yaml-cpp/include -I/usr/local/include/python3.12 -I/usr/local/lib/python3.12/site-packages/numpy/_co
re/include -I/wrkdirs/usr/ports/misc/py-paddlepaddle/work/.build/third_party/pybind/src/extern_pybind/include -I/wrkdirs/usr/ports/misc/py-paddlepaddle/work/.build/third_party/install/libuv/include -I/wrkdirs/usr/ports/misc/py-paddlepaddle/work/.build/third_party/install/gloo/include -I/wrkdirs/usr/ports/misc/py-paddlepaddle/work/.build/third_party/install/xbyak/include -I/wrkdirs/usr/ports/misc/py-paddlepaddle/work/.build/third_party/install/xbyak/include/xbyak -I/wrkdirs/usr/ports/misc/py-paddlepaddle/work/.build/third_party/install/cryptopp/include -I/wrkdirs/usr/ports/misc/py-paddlepaddle/work/.build/third_party/pocketfft/src -I/wrkdirs/usr/ports/misc/py-paddlepaddle/work/Paddle-3.3.1 -I/wrkdirs/usr/ports/misc/py-paddlepaddle/work/Paddle-3.3.1/paddle/phi/api/include/compat -I/wrkdirs/usr/ports/misc/py-paddlepaddle/work/Paddle-3.3.1/paddle/phi/api/include/compat/torch/csrc/api/include -I/wrkdirs/usr/ports/misc/py-paddlepaddle/work/.build/../paddle/fluid/framework/io -isys
tem /usr/local/include -O2 -pipe -fstack-protector-strong -fno-strict-aliasing -Wno-invalid-specialization -Wno-error=deprecated-declarations -Wno-deprecated-declarations -Wno-error=uninitialized -std=c++17 -m64 -fPIC -fno-omit-frame-pointer -pipe -ffunction-sections -fdata-sections -Wall -Wextra -Wno-unused-parameter -Wno-unused-function -Wno-error=array-bounds -Wno-error=ignored-attributes -Wno-error=int-in-bool-context -Wno-error=unknown-warning-option -Wno-error=unused-private-field -Wno-error=unused-const-variable -Wno-error=deprecated-copy-with-user-provided-copy -Wno-error=deprecated-copy -Wno-error=inconsistent-missing-override -Wno-error=bitwise-instead-of-logical -Wno-error=overloaded-virtual -Wno-error=defaulted-function-deleted -Wno-ignored-qualifiers -Wno-ignored-attributes -Wno-parentheses -O3 -DNDEBUG -fPIC -MD -MT paddle/phi/CMakeFiles/phi_core.dir/core/platform/denormal.cc.o -MF paddle/phi/CMakeFiles/phi_core.dir/core/platform/denormal.cc.o.d -o paddle/ph
i/CMakeFiles/phi_core.dir/core/platform/denormal.cc.o -c /wrkdirs/usr/ports/misc/py-paddlepaddle/work/Paddle-3.3.1/paddle/phi/core/platform/denormal.cc
In file included from /wrkdirs/usr/ports/misc/py-paddlepaddle/work/Paddle-3.3.1/paddle/phi/core/platform/denormal.cc:38:
/usr/local/llvm21/lib/clang/21/include/pmmintrin.h:14:2: error: "This header is only meant to be used on x86 and x64 architecture"
14 | #error "This header is only meant to be used on x86 and x64 architecture"
| ^
In file included from /wrkdirs/usr/ports/misc/py-paddlepaddle/work/Paddle-3.3.1/paddle/phi/core/platform/denormal.cc:38:
In file included from /usr/local/llvm21/lib/clang/21/include/pmmintrin.h:17:
/usr/local/llvm21/lib/clang/21/include/emmintrin.h:14:2: error: "This header is only meant to be used on x86 and x64 architecture"
14 | #error "This header is only meant to be used on x86 and x64 architecture"
| ^
In file included from /wrkdirs/usr/ports/misc/py-paddlepaddle/work/Paddle-3.3.1/paddle/phi/core/platform/denormal.cc:38:
In file included from /usr/local/llvm21/lib/clang/21/include/pmmintrin.h:17:
In file included from /usr/local/llvm21/lib/clang/21/include/emmintrin.h:17:
/usr/local/llvm21/lib/clang/21/include/xmmintrin.h:14:2: error: "This header is only meant to be used on x86 and x64 architecture"
14 | #error "This header is only meant to be used on x86 and x64 architecture"
| ^
In file included from /wrkdirs/usr/ports/misc/py-paddlepaddle/work/Paddle-3.3.1/paddle/phi/core/platform/denormal.cc:38:
In file included from /usr/local/llvm21/lib/clang/21/include/pmmintrin.h:17:
In file included from /usr/local/llvm21/lib/clang/21/include/emmintrin.h:17:
In file included from /usr/local/llvm21/lib/clang/21/include/xmmintrin.h:17:
/usr/local/llvm21/lib/clang/21/include/mmintrin.h:14:2: error: "This header is only meant to be used on x86 and x64 architecture"
14 | #error "This header is only meant to be used on x86 and x64 architecture"
| ^
/usr/local/llvm21/lib/clang/21/include/mmintrin.h:74:3: error: use of undeclared identifier '__builtin_ia32_emms'; did you mean '__builtin_isless'?
74 | __builtin_ia32_emms();
| ^~~~~~~~~~~~~~~~~~~
/usr/include/c++/v1/__math/traits.h:157:10: note: '__builtin_isless' declared here
157 | return __builtin_isless((type)__x, (type)__y);
| ^
In file included from /wrkdirs/usr/ports/misc/py-paddlepaddle/work/Paddle-3.3.1/paddle/phi/core/platform/denormal.cc:38:
In file included from /usr/local/llvm21/lib/clang/21/include/pmmintrin.h:17:
In file included from /usr/local/llvm21/lib/clang/21/include/emmintrin.h:17:
In file included from /usr/local/llvm21/lib/clang/21/include/xmmintrin.h:17:
/usr/local/llvm21/lib/clang/21/include/mmintrin.h:74:23: error: too few arguments to function call, expected 2, have 0
74 | __builtin_ia32_emms();
| ~~~~~~~~~~~~~~~~~~~~^
/usr/local/llvm21/lib/clang/21/include/mmintrin.h:165:22: error: use of undeclared identifier '__builtin_ia32_packsswb128'
165 | return __trunc64(__builtin_ia32_packsswb128(
| ^~~~~~~~~~~~~~~~~~~~~~~~~~
/usr/local/llvm21/lib/clang/21/include/mmintrin.h:191:22: error: use of undeclared identifier '__builtin_ia32_packssdw128'
191 | return __trunc64(__builtin_ia32_packssdw128(
| ^~~~~~~~~~~~~~~~~~~~~~~~~~
/usr/local/llvm21/lib/clang/21/include/mmintrin.h:217:22: error: use of undeclared identifier '__builtin_ia32_packuswb128'
217 | return __trunc64(__builtin_ia32_packuswb128(
| ^~~~~~~~~~~~~~~~~~~~~~~~~~
/usr/local/llvm21/lib/clang/21/include/mmintrin.h:707:22: error: use of undeclared identifier '__builtin_ia32_pmaddwd128'
707 | return __trunc64(__builtin_ia32_pmaddwd128((__v8hi)__anyext128(__m1),
| ^~~~~~~~~~~~~~~~~~~~~~~~~
/usr/local/llvm21/lib/clang/21/include/mmintrin.h:729:22: error: use of undeclared identifier '__builtin_ia32_pmulhw128'
729 | return __trunc64(__builtin_ia32_pmulhw128((__v8hi)__anyext128(__m1),
| ^~~~~~~~~~~~~~~~~~~~~~~~
/usr/local/llvm21/lib/clang/21/include/mmintrin.h:774:22: error: use of undeclared identifier '__builtin_ia32_psllw128'; did you mean '__builtin_arm_wsr128'?
774 | return __trunc64(__builtin_ia32_psllw128((__v8hi)__anyext128(__m),
| ^~~~~~~~~~~~~~~~~~~~~~~
/usr/local/llvm21/lib/clang/21/include/mmintrin.h:774:46: error: cannot initialize a parameter of type 'const char *' with an rvalue of type '__v8hi' (vector of 8 'short' values)
774 | return __trunc64(__builtin_ia32_psllw128((__v8hi)__anyext128(__m),
| ~~~~~~~~~~~~~~~~~~~~~~~~~~~~~~~~~~^~~~~~~~~~~~~~~~~~~~~~~~~
775 | (__v8hi)__anyext128(__count)));
| ~~~~~~~~~~~~~~~~~~~~~~~~~~~~~~
/usr/local/llvm21/lib/clang/21/include/mmintrin.h:59:44: note: expanded from macro '__trunc64'
59 | (__m64) __builtin_shufflevector((__v2di)(x), __extension__(__v2di){}, 0)
| ^
/usr/local/llvm21/lib/clang/21/include/mmintrin.h:797:22: error: use of undeclared identifier '__builtin_ia32_psllwi128'
797 | return __trunc64(__builtin_ia32_psllwi128((__v8hi)__anyext128(__m),
| ^~~~~~~~~~~~~~~~~~~~~~~~
/usr/local/llvm21/lib/clang/21/include/mmintrin.h:821:22: error: use of undeclared identifier '__builtin_ia32_pslld128'
821 | return __trunc64(__builtin_ia32_pslld128((__v4si)__anyext128(__m),
| ^~~~~~~~~~~~~~~~~~~~~~~
/usr/local/llvm21/lib/clang/21/include/mmintrin.h:844:22: error: use of undeclared identifier '__builtin_ia32_pslldi128'
844 | return __trunc64(__builtin_ia32_pslldi128((__v4si)__anyext128(__m),
| ^~~~~~~~~~~~~~~~~~~~~~~~
/usr/local/llvm21/lib/clang/21/include/mmintrin.h:865:22: error: use of undeclared identifier '__builtin_ia32_psllq128'
865 | return __trunc64(__builtin_ia32_psllq128((__v2di)__anyext128(__m),
| ^~~~~~~~~~~~~~~~~~~~~~~
/usr/local/llvm21/lib/clang/21/include/mmintrin.h:886:22: error: use of undeclared identifier '__builtin_ia32_psllqi128'
886 | return __trunc64(__builtin_ia32_psllqi128((__v2di)__anyext128(__m),
| ^~~~~~~~~~~~~~~~~~~~~~~~
/usr/local/llvm21/lib/clang/21/include/mmintrin.h:911:22: error: use of undeclared identifier '__builtin_ia32_psraw128'
911 | return __trunc64(__builtin_ia32_psraw128((__v8hi)__anyext128(__m),
| ^~~~~~~~~~~~~~~~~~~~~~~
fatal error: too many errors emitted, stopping now [-ferror-limit=]
20 errors generated.
[ 13% 346/2552] /usr/local/llvm21/bin/clang++ -DGLOG_NO_ABBREVIATED_SEVERITIES -DHPPL_STUB_FUNC -DLAPACK_FOUND -DPADDLE_DISABLE_PROFILER -DPADDLE_DLL_EXPORT -DPADDLE_ON_INFERENCE -DPADDLE_SLEEF_POW_PRECISION=10 -DPADDLE_USE_OPENBLAS -DPADDLE_USE_PTHREAD_BARRIER -DPADDLE_USE_PTHREAD_SPINLOCK -DPADDLE_VERSION=3.3.0.dev -DPADDLE_VERSION_INTEGER=3003000 -DPADDLE_WITH_CRYPTO -DPADDLE_WITH_POCKETFFT -DPADDLE_WITH_SLEEF -DPADDLE_WITH_XBYAK -DPHI_INNER -DPHI_SHARED -DSTATIC_IR -DXBYAK64 -DXBYAK_NO_OP_NAMES -DYAML_CPP_STATIC_DEFINE -Dphi_core_EXPORTS -I/wrkdirs/usr/ports/misc/py-paddlepaddle/work/.build -I/wrkdirs/usr/ports/misc/py-paddlepaddle/work/Paddle-3.3.1/paddle/fluid/framework/io -I/wrkdirs/usr/ports/misc/py-paddlepaddle/work/.build/third_party/install/zlib/include -I/wrkdirs/usr/ports/misc/py-paddlepaddle/work/.build/third_party/install -I/wrkdirs/usr/ports/misc/py-paddlepaddle/work/.build/third_party/install/gflags/include -I/wrkdirs/usr/ports/misc/py-paddlepaddle/work/.bui
ld/third_party/install/glog/include -I/wrkdirs/usr/ports/misc/py-paddlepaddle/work/Paddle-3.3.1/third_party/eigen3 -I/wrkdirs/usr/ports/misc/py-paddlepaddle/work/Paddle-3.3.1/third_party/threadpool -I/wrkdirs/usr/ports/misc/py-paddlepaddle/work/Paddle-3.3.1/third_party/dlpack/include -I/wrkdirs/usr/ports/misc/py-paddlepaddle/work/.build/third_party/install/xxhash/include -I/wrkdirs/usr/ports/misc/py-paddlepaddle/work/.build/third_party/install/warpctc/include -I/wrkdirs/usr/ports/misc/py-paddlepaddle/work/.build/third_party/install/warprnnt/include -I/wrkdirs/usr/ports/misc/py-paddlepaddle/work/.build/third_party/install/utf8proc/include -I/wrkdirs/usr/ports/misc/py-paddlepaddle/work/.build/third_party/install/protobuf/include -I/wrkdirs/usr/ports/misc/py-paddlepaddle/work/Paddle-3.3.1/third_party/nlohmann_json/include -I/wrkdirs/usr/ports/misc/py-paddlepaddle/work/.build/third_party/install/yaml-cpp/include -I/usr/local/include/python3.12 -I/usr/local/lib/python3.12/site-pa
ckages/numpy/_core/include -I/wrkdirs/usr/ports/misc/py-paddlepaddle/work/.build/third_party/pybind/src/extern_pybind/include -I/wrkdirs/usr/ports/misc/py-paddlepaddle/work/.build/third_party/install/libuv/include -I/wrkdirs/usr/ports/misc/py-paddlepaddle/work/.build/third_party/install/gloo/include -I/wrkdirs/usr/ports/misc/py-paddlepaddle/work/.build/third_party/install/xbyak/include -I/wrkdirs/usr/ports/misc/py-paddlepaddle/work/.build/third_party/install/xbyak/include/xbyak -I/wrkdirs/usr/ports/misc/py-paddlepaddle/work/.build/third_party/install/cryptopp/include -I/wrkdirs/usr/ports/misc/py-paddlepaddle/work/.build/third_party/pocketfft/src -I/wrkdirs/usr/ports/misc/py-paddlepaddle/work/Paddle-3.3.1 -I/wrkdirs/usr/ports/misc/py-paddlepaddle/work/Paddle-3.3.1/paddle/phi/api/include/compat -I/wrkdirs/usr/ports/misc/py-paddlepaddle/work/Paddle-3.3.1/paddle/phi/api/include/compat/torch/csrc/api/include -I/wrkdirs/usr/ports/misc/py-paddlepaddle/work/.build/../paddle/fluid/fr
amework/io -isystem /usr/local/include -O2 -pipe -fstack-protector-strong -fno-strict-aliasing -Wno-invalid-specialization -Wno-error=deprecated-declarations -Wno-deprecated-declarations -Wno-error=uninitialized -std=c++17 -m64 -fPIC -fno-omit-frame-pointer -pipe -ffunction-sections -fdata-sections -Wall -Wextra -Wno-unused-parameter -Wno-unused-function -Wno-error=array-bounds -Wno-error=ignored-attributes -Wno-error=int-in-bool-context -Wno-error=unknown-warning-option -Wno-error=unused-private-field -Wno-error=unused-const-variable -Wno-error=deprecated-copy-with-user-provided-copy -Wno-error=deprecated-copy -Wno-error=inconsistent-missing-override -Wno-error=bitwise-instead-of-logical -Wno-error=overloaded-virtual -Wno-error=defaulted-function-deleted -Wno-ignored-qualifiers -Wno-ignored-attributes -Wno-parentheses -O3 -DNDEBUG -fPIC -MD -MT paddle/phi/CMakeFiles/phi_core.dir/core/platform/monitor.cc.o -MF paddle/phi/CMakeFiles/phi_core.dir/core/platform/monitor.cc.o.
d -o paddle/phi/CMakeFiles/phi_core.dir/core/platform/monitor.cc.o -c /wrkdirs/usr/ports/misc/py-paddlepaddle/work/Paddle-3.3.1/paddle/phi/core/platform/monitor.cc
[ 13% 346/2552] /usr/local/llvm21/bin/clang++ -DGLOG_NO_ABBREVIATED_SEVERITIES -DHPPL_STUB_FUNC -DLAPACK_FOUND -DPADDLE_DISABLE_PROFILER -DPADDLE_DLL_EXPORT -DPADDLE_ON_INFERENCE -DPADDLE_SLEEF_POW_PRECISION=10 -DPADDLE_USE_OPENBLAS -DPADDLE_USE_PTHREAD_BARRIER -DPADDLE_USE_PTHREAD_SPINLOCK -DPADDLE_VERSION=3.3.0.dev -DPADDLE_VERSION_INTEGER=3003000 -DPADDLE_WITH_CRYPTO -DPADDLE_WITH_POCKETFFT -DPADDLE_WITH_SLEEF -DPADDLE_WITH_XBYAK -DPHI_INNER -DPHI_SHARED -DSTATIC_IR -DXBYAK64 -DXBYAK_NO_OP_NAMES -DYAML_CPP_STATIC_DEFINE -Dphi_core_EXPORTS -I/wrkdirs/usr/ports/misc/py-paddlepaddle/work/.build -I/wrkdirs/usr/ports/misc/py-paddlepaddle/work/Paddle-3.3.1/paddle/fluid/framework/io -I/wrkdirs/usr/ports/misc/py-paddlepaddle/work/.build/third_party/install/zlib/include -I/wrkdirs/usr/ports/misc/py-paddlepaddle/work/.build/third_party/install -I/wrkdirs/usr/ports/misc/py-paddlepaddle/work/.build/third_party/install/gflags/include -I/wrkdirs/usr/ports/misc/py-paddlepaddle/work/.bui
ld/third_party/install/glog/include -I/wrkdirs/usr/ports/misc/py-paddlepaddle/work/Paddle-3.3.1/third_party/eigen3 -I/wrkdirs/usr/ports/misc/py-paddlepaddle/work/Paddle-3.3.1/third_party/threadpool -I/wrkdirs/usr/ports/misc/py-paddlepaddle/work/Paddle-3.3.1/third_party/dlpack/include -I/wrkdirs/usr/ports/misc/py-paddlepaddle/work/.build/third_party/install/xxhash/include -I/wrkdirs/usr/ports/misc/py-paddlepaddle/work/.build/third_party/install/warpctc/include -I/wrkdirs/usr/ports/misc/py-paddlepaddle/work/.build/third_party/install/warprnnt/include -I/wrkdirs/usr/ports/misc/py-paddlepaddle/work/.build/third_party/install/utf8proc/include -I/wrkdirs/usr/ports/misc/py-paddlepaddle/work/.build/third_party/install/protobuf/include -I/wrkdirs/usr/ports/misc/py-paddlepaddle/work/Paddle-3.3.1/third_party/nlohmann_json/include -I/wrkdirs/usr/ports/misc/py-paddlepaddle/work/.build/third_party/install/yaml-cpp/include -I/usr/local/include/python3.12 -I/usr/local/lib/python3.12/site-pa
ckages/numpy/_core/include -I/wrkdirs/usr/ports/misc/py-paddlepaddle/work/.build/third_party/pybind/src/extern_pybind/include -I/wrkdirs/usr/ports/misc/py-paddlepaddle/work/.build/third_party/install/libuv/include -I/wrkdirs/usr/ports/misc/py-paddlepaddle/work/.build/third_party/install/gloo/include -I/wrkdirs/usr/ports/misc/py-paddlepaddle/work/.build/third_party/install/xbyak/include -I/wrkdirs/usr/ports/misc/py-paddlepaddle/work/.build/third_party/install/xbyak/include/xbyak -I/wrkdirs/usr/ports/misc/py-paddlepaddle/work/.build/third_party/install/cryptopp/include -I/wrkdirs/usr/ports/misc/py-paddlepaddle/work/.build/third_party/pocketfft/src -I/wrkdirs/usr/ports/misc/py-paddlepaddle/work/Paddle-3.3.1 -I/wrkdirs/usr/ports/misc/py-paddlepaddle/work/Paddle-3.3.1/paddle/phi/api/include/compat -I/wrkdirs/usr/ports/misc/py-paddlepaddle/work/Paddle-3.3.1/paddle/phi/api/include/compat/torch/csrc/api/include -I/wrkdirs/usr/ports/misc/py-paddlepaddle/work/.build/../paddle/fluid/fr
amework/io -isystem /usr/local/include -O2 -pipe -fstack-protector-strong -fno-strict-aliasing -Wno-invalid-specialization -Wno-error=deprecated-declarations -Wno-deprecated-declarations -Wno-error=uninitialized -std=c++17 -m64 -fPIC -fno-omit-frame-pointer -pipe -ffunction-sections -fdata-sections -Wall -Wextra -Wno-unused-parameter -Wno-unused-function -Wno-error=array-bounds -Wno-error=ignored-attributes -Wno-error=int-in-bool-context -Wno-error=unknown-warning-option -Wno-error=unused-private-field -Wno-error=unused-const-variable -Wno-error=deprecated-copy-with-user-provided-copy -Wno-error=deprecated-copy -Wno-error=inconsistent-missing-override -Wno-error=bitwise-instead-of-logical -Wno-error=overloaded-virtual -Wno-error=defaulted-function-deleted -Wno-ignored-qualifiers -Wno-ignored-attributes -Wno-parentheses -O3 -DNDEBUG -fPIC -MD -MT paddle/phi/CMakeFiles/phi_core.dir/core/platform/profiler.cc.o -MF paddle/phi/CMakeFiles/phi_core.dir/core/platform/profiler.cc.
o.d -o paddle/phi/CMakeFiles/phi_core.dir/core/platform/profiler.cc.o -c /wrkdirs/usr/ports/misc/py-paddlepaddle/work/Paddle-3.3.1/paddle/phi/core/platform/profiler.cc
In file included from /wrkdirs/usr/ports/misc/py-paddlepaddle/work/Paddle-3.3.1/paddle/phi/core/platform/profiler.cc:29:
In file included from /wrkdirs/usr/ports/misc/py-paddlepaddle/work/Paddle-3.3.1/paddle/phi/core/platform/profiler_helper.h:42:
In file included from /wrkdirs/usr/ports/misc/py-paddlepaddle/work/Paddle-3.3.1/paddle/phi/core/memory/memory.h:17:
In file included from /wrkdirs/usr/ports/misc/py-paddlepaddle/work/Paddle-3.3.1/paddle/phi/core/memory/malloc.h:22:
/wrkdirs/usr/ports/misc/py-paddlepaddle/work/Paddle-3.3.1/paddle/phi/core/memory/allocation/allocator.h:293:20: warning: 'AllocateImpl' overrides a member function but is not marked 'override' [-Winconsistent-missing-override]
293 | phi::Allocation* AllocateImpl(size_t UNUSED) { return nullptr; }
| ^
/wrkdirs/usr/ports/misc/py-paddlepaddle/work/Paddle-3.3.1/paddle/phi/core/memory/allocation/allocator.h:210:28: note: overridden virtual function is here
210 | virtual phi::Allocation* AllocateImpl(size_t size) = 0;
| ^
1 warning generated.
ninja: build stopped: subcommand failed.
===> Compilation failed unexpectedly.
Try to set MAKE_JOBS_UNSAFE=yes and rebuild before reporting the failure to
the maintainer.
*** Error code 1
Stop.
make: stopped making "build" in /usr/ports/misc/py-paddlepaddle