[package - main-amd64-default][databases/mongodb90] Failed for mongodb90-9.0.4 in build
- Go to: [ bottom of page ] [ top of archives ] [ this month ]
Date: Tue, 20 Oct 2026 06:30:33 UTC
You are receiving this mail as a port that you maintain
is failing to build on the FreeBSD package build server.
Please investigate the failure and submit a PR to fix
build.
Maintainer: ronald@FreeBSD.org
Log URL: https://pkg-status.freebsd.org/beefy24/data/main-amd64-default/pce97aa4dd1d9_se45c7bc611/logs/mongodb90-9.0.4.log
Build URL: https://pkg-status.freebsd.org/beefy24/build.html?mastername=main-amd64-default&build=pce97aa4dd1d9_se45c7bc611
Log:
=>> Building databases/mongodb90
build started at Tue Oct 20 06:25:28 UTC 2026
port directory: /usr/ports/databases/mongodb90
package name: mongodb90-9.0.4
building for: FreeBSD main-amd64-default-job-12 16.0-CURRENT FreeBSD 16.0-CURRENT 1600028 amd64
maintained by: ronald@FreeBSD.org
Makefile datestamp: -rw-r--r-- 1 root wheel 18376 Oct 18 01:01 /usr/ports/databases/mongodb90/Makefile
Ports top last git commit: ce97aa4dd1d9326775655b810ef384f38f78f0e5
Ports top unclean checkout: no
Port dir last git commit: cc91f92841b5673811cd4d549b5ca897dad3b8ec
Port dir unclean checkout: no
Poudriere version: poudriere-git-3.4.8-3-gd92fb7c0
Host OSVERSION: 1600022
Jail OSVERSION: 1600028
Job Id: 12
!!! Jail is newer than host. (Jail: 1600028, Host: 1600022) !!!
!!! This is not supported. !!!
!!! Host kernel must be same or newer than jail. !!!
!!! Expect build failures. !!!
---Begin Environment---
SHELL=/bin/sh
OSVERSION=1600028
UNAME_v=FreeBSD 16.0-CURRENT 1600028
UNAME_r=16.0-CURRENT
BLOCKSIZE=K
MAIL=/var/mail/root
MM_CHARSET=UTF-8
LANG=C.UTF-8
STATUS=1
HOME=/root
PATH=/sbin:/bin:/usr/sbin:/usr/bin:/usr/local/sbin:/usr/local/bin:/root/bin
MAKE_OBJDIR_CHECK_WRITABLE=0
LOCALBASE=/usr/local
USER=root
POUDRIERE_NAME=poudriere-git
LIBEXECPREFIX=/usr/local/libexec/poudriere
POUDRIERE_VERSION=3.4.8-3-gd92fb7c0
MASTERMNT=/usr/local/poudriere/data/.m/main-amd64-default/ref
LC_COLLATE=C
POUDRIERE_BUILD_TYPE=bulk
PACKAGE_BUILDING=yes
SAVED_TERM=
OUTPUT_REDIRECTED_STDERR=4
OUTPUT_REDIRECTED=1
PWD=/usr/local/poudriere/data/.m/main-amd64-default/12/.p
OUTPUT_REDIRECTED_STDOUT=3
P_PORTS_FEATURES=FLAVORS SUBPACKAGES SELECTED_OPTIONS
MASTERNAME=main-amd64-default
SCRIPTPREFIX=/usr/local/share/poudriere
SCRIPTNAME=bulk.sh
OLDPWD=/usr/local/poudriere/data/.m/main-amd64-default/ref/.p/pool
POUDRIERE_PKGNAME=poudriere-git-3.4.8-3-gd92fb7c0
SCRIPTPATH=/usr/local/share/poudriere/bulk.sh
POUDRIEREPATH=/usr/local/bin/poudriere
---End Environment---
---Begin Poudriere Port Flags/Env---
PORT_FLAGS=
PKGENV=
FLAVOR=default
MAKE_ARGS= FLAVOR=default
---End Poudriere Port Flags/Env---
---Begin OPTIONS List---
===> The following configuration options are available for mongodb90-9.0.4:
LTO=off: Use Link-Time Optimization
NOAVX=on: "Disable AVX instructions on amd64 (Sandybridge+)"
===> Use 'make config' to modify these settings
---End OPTIONS List---
--MAINTAINER--
ronald@FreeBSD.org
--End MAINTAINER--
--CONFIGURE_ARGS--
x86_64 freebsd
--End CONFIGURE_ARGS--
--CONFIGURE_ENV--
PYTHON3="/usr/local/bin/python3.12" PKG_CONFIG=pkgconf MAKE=/usr/local/bin/gmake PYTHON="/usr/local/bin/python3.12" XDG_DATA_HOME=/wrkdirs/usr/ports/databases/mongodb90/work-default XDG_CONFIG_HOME=/wrkdirs/usr/ports/databases/mongodb90/work-default XDG_CACHE_HOME=/wrkdirs/usr/ports/databases/mongodb90/work-default/.cache HOME=/wrkdirs/usr/ports/databases/mongodb90/work-default TMPDIR="/wrkdirs/usr/ports/databases/mongodb90/work-default" PATH=/wrkdirs/usr/ports/databases/mongodb90/work-default/.bin:/sbin:/bin:/usr/sbin:/usr/bin:/usr/local/sbin:/usr/local/bin:/root/bin PKG_CONFIG_LIBDIR=/wrkdirs/usr/ports/databases/mongodb90/work-default/.pkgconfig:/usr/local/libdata/pkgconfig:/usr/local/share/pkgconfig:/usr/libdata/pkgconfig SHELL=/bin/sh CONFIG_SHELL=/bin/sh
--End CONFIGURE_ENV--
--MAKE_ENV--
OPENSSLBASE=/usr OPENSSLDIR=/etc/ssl OPENSSLINC=/usr/include OPENSSLLIB=/usr/lib XDG_DATA_HOME=/wrkdirs/usr/ports/databases/mongodb90/work-default XDG_CONFIG_HOME=/wrkdirs/usr/ports/databases/mongodb90/work-default XDG_CACHE_HOME=/wrkdirs/usr/ports/databases/mongodb90/work-default/.cache HOME=/wrkdirs/usr/ports/databases/mongodb90/work-default TMPDIR="/wrkdirs/usr/ports/databases/mongodb90/work-default" PATH=/wrkdirs/usr/ports/databases/mongodb90/work-default/.bin:/sbin:/bin:/usr/sbin:/usr/bin:/usr/local/sbin:/usr/local/bin:/root/bin PKG_CONFIG_LIBDIR=/wrkdirs/usr/ports/databases/mongodb90/work-default/.pkgconfig:/usr/local/libdata/pkgconfig:/usr/local/share/pkgconfig:/usr/libdata/pkgconfig MK_DEBUG_FILES=no MK_KERNEL_SYMBOLS=no SHELL=/bin/sh NO_LINT=YES PREFIX=/usr/local LOCALBASE=/usr/local CC="cc" CFLAGS="-O2 -pipe -fstack-protector-strong -fno-strict-aliasing " CPP="cpp" CPPFLAGS="" LDFLAGS=" " LIBS="" CXX="c++" CXXFLAGS="-O2 -pipe -fstack-protector-strong -fno
-strict-aliasing " BSD_INSTALL_PROGRAM="install -s -m 555" BSD_INSTALL_LIB="install -s -m 0644" BSD_INSTALL_SCRIPT="install -m 555" BSD_INSTALL_DATA="install -m 0644" BSD_INSTALL_MAN="install -m 444"
--End MAKE_ENV--
--PLIST_SUB--
PYTHON_INCLUDEDIR=include/python3.12 PYTHON_LIBDIR=lib/python3.12 PYTHON_PLATFORM=freebsd16 PYTHON_SITELIBDIR=lib/python3.12/site-packages PYTHON_SUFFIX=312 PYTHON_BASESUFFIX=312 PYTHON_TAG=.cpython-312 PYTHON_SOABI=.cpython-312 PYTHON_VER=3.12 PYTHON_BASEVER=3.12 PYTHON_VERSION=python3.12 PYTHON2="@comment " PYTHON3="" OSREL=16.0 PREFIX=%D LOCALBASE=/usr/local RESETPREFIX=/usr/local LIB32DIR=lib DOCSDIR="share/doc/mongodb" EXAMPLESDIR="share/examples/mongodb" DATADIR="share/mongodb" WWWDIR="www/mongodb" ETCDIR="etc/mongodb"
--End PLIST_SUB--
--SUB_LIST--
PYTHON_INCLUDEDIR=/usr/local/include/python3.12 PYTHON_LIBDIR=/usr/local/lib/python3.12 PYTHON_PLATFORM=freebsd16 PYTHON_SITELIBDIR=/usr/local/lib/python3.12/site-packages PYTHON_SUFFIX=312 PYTHON_BASESUFFIX=312 PYTHON_TAG=.cpython-312 PYTHON_SOABI=.cpython-312 PYTHON_VER=3.12 PYTHON_BASEVER=3.12 PYTHON_VERSION=python3.12 PYTHON2="@comment " PYTHON3="" PREFIX=/usr/local LOCALBASE=/usr/local DATADIR=/usr/local/share/mongodb DOCSDIR=/usr/local/share/doc/mongodb EXAMPLESDIR=/usr/local/share/examples/mongodb WWWDIR=/usr/local/www/mongodb ETCDIR=/usr/local/etc/mongodb
--End SUB_LIST--
---Begin make.conf---
USE_PACKAGE_DEPENDS=yes
BATCH=yes
WRKDIRPREFIX=/wrkdirs
PORTSDIR=/usr/ports
PACKAGES=/packages
DISTDIR=/distfiles
PACKAGE_BUILDING=yes
PACKAGE_BUILDING_FLAVORS=yes
#### ####
# XXX: We really need this but cannot use it while 'make checksum' does not
# try the next mirror on checksum failure. It currently retries the same
# failed mirror and then fails rather then trying another. It *does*
# try the next if the size is mismatched though.
#MASTER_SITE_FREEBSD=yes
# Build ALLOW_MAKE_JOBS_PACKAGES with 3 jobs
MAKE_JOBS_NUMBER=3
#### Misc Poudriere ####
.include "/etc/make.conf.ports_env"
GID=0
UID=0
---End make.conf---
--Resource limits--
cpu time (seconds, -t) unlimited
file size (512-blocks, -f) unlimited
data seg size (kbytes, -d) 33554432
stack size (kbytes, -s) 524288
core file size (512-blocks, -c) unlimited
max memory size (kbytes, -m) unlimited
locked memory (kbytes, -l) unlimited
max user processes (-u) 89999
open files (-n) 8192
virtual mem size (kbytes, -v) unlimited
swap limit (kbytes, -w) unlimited
socket buffer size (bytes, -b) unlimited
pseudo-terminals (-p) unlimited
kqueues (-k) unlimited
umtx shared locks (-o) unlimited
pipebuf (kbytes, -y) unlimited
virtual machines (-V) unlimited
--End resource limits--
=======================<phase: check-sanity >============================
===== env: NO_DEPENDS=yes USER=root UID=0 GID=0
/!\ WARNING /!\
WITH_LTO is unsupported, use WITH=LTO on the command line, or one of these
in /etc/make.conf, OPTIONS_SET+=LTO to set it globally, or
databases_mongodb90_SET+=LTO for only this port.
===> License APACHE20 SSPLv1 accepted by the user
===========================================================================
=======================<phase: pkg-depends >============================
===== env: USE_PACKAGE_DEPENDS_ONLY=1 USER=root UID=0 GID=0
===> mongodb90-9.0.4 depends on file: /usr/local/sbin/pkg - not found
===> Installing existing package /packages/All/pkg-2.8.4.pkg
[main-amd64-default-job-12] Installing pkg-2.8.4...
[main-amd64-default-job-12] Extracting pkg-2.8.4: .......... done
===> mongodb90-9.0.4 depends on file: /usr/local/sbin/pkg - found
===> Returning to build of mongodb90-9.0.4
===========================================================================
=======================<phase: fetch-depends >============================
===== env: USE_PACKAGE_DEPENDS_ONLY=1 USER=root UID=0 GID=0
===========================================================================
=======================<phase: fetch >============================
===== env: NO_DEPENDS=yes USER=root UID=0 GID=0
===> License APACHE20 SSPLv1 accepted by the user
=> rust/crates/maplit-1.0.2.crate doesn't seem to exist in /portdistfiles.
=> Attempting to fetch https://static.crates.io/crates/maplit/maplit-1.0.2.crate
rust/crates/maplit-1.0.2.crate 8871 B 6045 kBps 00s
=> rust/crates/zerocopy-0.7.35.crate doesn't seem to exist in /portdistfiles.
=> Attempting to fetch https://static.crates.io/crates/zerocopy/zerocopy-0.7.35.crate
rust/crates/zerocopy-0.7.35.crate 149 kB 4012 kBps 00s
=> rust/crates/zerocopy-derive-0.7.35.crate doesn't seem to exist in /portdistfiles.
=> Attempting to fetch https://static.crates.io/crates/zerocopy-derive/zerocopy-derive-0.7.35.crate
rust/crates/zerocopy-derive-0.7.35.crate 36 kB 4899 kBps 00s
===> Fetching all distfiles required by mongodb90-9.0.4 for building
===========================================================================
=======================<phase: checksum >============================
===== env: NO_DEPENDS=yes USER=root UID=0 GID=0
===> License APACHE20 SSPLv1 accepted by the user
===> Fetching all distfiles required by mongodb90-9.0.4 for building
=> SHA256 Checksum OK for bazelbuild-bazel-central-registry-5df17720d4367282afb8e5ca27a35199ab7620e4_GH0.tar.gz.
=> SHA256 Checksum OK for mongodb-forks-rules_poetry-092d43107d13e711ac4ac92050d8b570bcc8ef43_GH0.tar.gz.
=> SHA256 Checksum OK for wasi-sysroot-33.0+m.tar.gz.
=> SHA256 Checksum OK for libclang_rt-33.0+m.tar.gz.
=> SHA256 Checksum OK for apple_support.1.24.1.tar.gz.
=> SHA256 Checksum OK for bazel-lib-v2.13.0.tar.gz.
=> SHA256 Checksum OK for rules_js-v2.1.3.tar.gz.
=> SHA256 Checksum OK for bats-core-1.10.0.tar.gz.
=> SHA256 Checksum OK for bazel_clang_tidy-1.7.tar.gz.
=> SHA256 Checksum OK for bazel_features-v1.37.0.tar.gz.
=> SHA256 Checksum OK for bazel-skylib-1.9.0.tar.gz.
=> SHA256 Checksum OK for buildifier-prebuilt-6.4.0.tar.gz.
=> SHA256 Checksum OK for platforms-0.0.11.tar.gz.
=> SHA256 Checksum OK for rules_cc-0.2.10.tar.gz.
=> SHA256 Checksum OK for rules_foreign_cc-0.15.1.tar.gz.
=> SHA256 Checksum OK for rules_go-v0.50.1.zip.
=> SHA256 Checksum OK for rules_java-8.6.1.tar.gz.
<snip>
Compiling unic-segment v0.9.0
Compiling block-buffer v0.10.4
Compiling crypto-common v0.1.6
Compiling errno v0.3.11
Compiling memmap2 v0.9.5
Compiling gix-sec v0.10.11
Compiling filetime v0.2.22
Compiling parking_lot v0.12.1
Compiling digest v0.10.7
Compiling prodash v29.0.0
Compiling sha2 v0.10.8
Compiling regex v1.11.1
Compiling globset v0.4.11
Compiling tempfile v3.19.1
Compiling ignore v0.4.18
Compiling maybe-async v0.2.7
Compiling globwalk v0.9.1
Compiling synstructure v0.13.1
Compiling serde_derive v1.0.219
Compiling thiserror-impl v2.0.4
Compiling zerofrom-derive v0.1.5
Compiling yoke-derive v0.7.5
Compiling zerovec-derive v0.10.3
Compiling displaydoc v0.2.5
Compiling icu_provider_macros v1.5.0
Compiling thiserror-impl v1.0.50
Compiling tracing-attributes v0.1.28
Compiling clap_derive v4.5.32
Compiling gix-path v0.10.14
Compiling gix-date v0.9.3
Compiling gix-validate v0.9.3
Compiling gix-chunk v0.4.11
Compiling gix-quote v0.4.15
Compiling gix-bitmap v0.2.14
Compiling zerofrom v0.1.5
Compiling tracing v0.1.41
Compiling gix-config-value v0.14.11
Compiling gix-command v0.4.1
Compiling pest v2.7.0
Compiling yoke v0.7.5
Compiling clap v4.5.37
Compiling gix-actor v0.33.2
Compiling gix-prompt v0.9.1
Compiling zerovec v0.10.4
Compiling pest_meta v2.7.0
Compiling tinystr v0.7.6
Compiling icu_collections v1.5.0
Compiling pest_generator v2.7.0
Compiling icu_locid v1.5.0
Compiling pest_derive v2.7.0
Compiling icu_provider v1.5.0
Compiling icu_locid_transform v1.5.0
Compiling faster-hex v0.9.0
Compiling toml_datetime v0.6.9
Compiling serde_spanned v0.6.8
Compiling hex v0.4.3
Compiling cargo-platform v0.1.9
Compiling smol_str v0.3.2
Compiling serde_starlark v0.1.17
Compiling icu_properties v1.5.1
Compiling gix-hash v0.16.0
Compiling gix-packetline v0.18.3
Compiling gix-packetline-blocking v0.18.2
Compiling toml_edit v0.22.25
Compiling gix-features v0.40.0
Compiling gix-hashtable v0.7.0
Compiling gix-object v0.47.0
Compiling gix-fs v0.13.0
Compiling gix-commitgraph v0.26.0
Compiling gix-glob v0.18.0
Compiling gix-tempfile v16.0.0
Compiling cargo_metadata v0.19.2
Compiling tera v1.20.0
Compiling gix-lock v16.0.0
Compiling gix-attributes v0.24.0
Compiling gix-ignore v0.13.0
Compiling gix-shallow v0.2.0
Compiling gix-pathspec v0.9.0
Compiling gix-revwalk v0.18.0
Compiling gix-ref v0.50.0
Compiling gix-pack v0.57.0
Compiling gix-filter v0.17.0
Compiling gix-diff v0.50.0
Compiling toml v0.8.21
Compiling gix-revision v0.32.0
Compiling gix-traverse v0.44.0
Compiling gix-negotiate v0.18.0
Compiling icu_normalizer v1.5.0
Compiling gix-index v0.38.0
Compiling cargo_toml v0.22.1
Compiling gix-refspec v0.28.0
Compiling gix-config v0.43.0
Compiling gix-discover v0.38.0
Compiling idna_adapter v1.2.0
Compiling idna v1.0.3
Compiling gix-odb v0.67.0
Compiling gix-worktree v0.39.0
Compiling url v2.5.4
Compiling gix-url v0.29.0
Compiling cargo-lock v10.1.0
Compiling gix-credentials v0.27.0
Compiling gix-transport v0.45.0
Compiling gix-submodule v0.17.0
Compiling gix-protocol v0.48.0
Compiling gix v0.70.0
Compiling crates-index v3.7.0
Compiling cargo-bazel v0.17.0 (/wrkdirs/usr/ports/databases/mongodb90/work-default/bazel/7a35cfdf178effa2cffd7f5d37a512a7/external/rules_rust~/crate_universe)
Finished `release` profile [optimized] target(s) in 1m 27s
Analyzing: target //:install-core (707 packages loaded, 47203 targets configured)
Analyzing: target //:install-core (1111 packages loaded, 69835 targets configured)
Analyzing: target //:install-core (1179 packages loaded, 75249 targets configured)
INFO: Analyzed target //:install-core (1179 packages loaded, 75249 targets configured).
[120 / 4,098] [Prepa] Creating symlink bazel-out/freebsd-opt-exec-ST-e0dba4dfc6c2/bin/external/rules_rust~~rust~rust_freebsd_x86_64__x86_64-unknown-freebsd__nightly_tools/rust_toolchain/lib/librustc_driver-c007a00e28114aa2.so [for tool] ... (2 actions, 0 running)
[511 / 15,343] [Prepa] Creating symlink bazel-out/freebsd-opt-exec-ST-9f43ae98e6e4/bin/external/rules_rust~~rust~rust_freebsd_x86_64__x86_64-unknown-freebsd__nightly_tools/rust_toolchain/lib/rustlib/x86_64-unknown-freebsd/lib/libcfg_if-da3523bbd78a242f.rmeta [for tool]
[730 / 16,739] Compiling src/third_party/tomcrypt-1.18.2/src/hashes/md5.c; 0s processwrapper-sandbox ... (2 actions, 1 running)
[793 / 16,739] Compiling src/third_party/tomcrypt-1.18.2/src/misc/crypt/crypt_register_hash.c; 0s processwrapper-sandbox ... (4 actions, 2 running)
[819 / 16,739] Compiling src/third_party/tomcrypt-1.18.2/src/mac/hmac/hmac_init.c; 0s processwrapper-sandbox ... (3 actions, 2 running)
[834 / 16,739] Compiling src/third_party/tomcrypt-1.18.2/src/ciphers/aes/aes.c; 0s processwrapper-sandbox ... (3 actions, 2 running)
[844 / 16,739] Compiling src/third_party/libstemmer_c/dist/src_c/stem_UTF_8_turkish.c; 0s processwrapper-sandbox ... (3 actions, 2 running)
[850 / 16,739] Compiling src/third_party/libstemmer_c/dist/src_c/stem_UTF_8_romanian.c; 0s processwrapper-sandbox ... (3 actions, 2 running)
[858 / 16,739] Compiling src/third_party/libstemmer_c/dist/src_c/stem_UTF_8_italian.c; 0s processwrapper-sandbox ... (4 actions, 2 running)
[864 / 16,739] Compiling src/third_party/libstemmer_c/dist/src_c/stem_UTF_8_italian.c; 0s processwrapper-sandbox ... (3 actions, 2 running)
[870 / 16,739] Compiling src/third_party/libstemmer_c/dist/src_c/stem_UTF_8_english.c; 0s processwrapper-sandbox ... (3 actions, 2 running)
[878 / 16,739] Compiling src/third_party/fmt/dist/src/format.cc; 0s processwrapper-sandbox ... (3 actions running)
[882 / 16,739] Compiling src/third_party/fmt/dist/src/format.cc; 1s processwrapper-sandbox ... (4 actions, 3 running)
[883 / 16,739] Compiling src/third_party/fmt/dist/src/format.cc; 3s processwrapper-sandbox ... (3 actions running)
[888 / 16,739] Compiling src/third_party/fmt/dist/src/format.cc; 5s processwrapper-sandbox ... (3 actions, 2 running)
[890 / 16,739] Compiling src/third_party/croaring/dist/roaring.c; 6s processwrapper-sandbox ... (3 actions running)
ERROR: /wrkdirs/usr/ports/databases/mongodb90/work-default/mongo-r9.0.4/src/third_party/fmt/BUILD.bazel:5:17: Compiling src/third_party/fmt/dist/src/os.cc failed: (Exit 1): clang failed: error executing CppCompile command (from target //src/third_party/fmt:fmt_with_debug)
(cd /wrkdirs/usr/ports/databases/mongodb90/work-default/bazel/7a35cfdf178effa2cffd7f5d37a512a7/sandbox/processwrapper-sandbox/132/execroot/_main && \
exec env - \
AR=llvm-ar \
CC=cc \
CXX=c++ \
PATH=/bin:/usr/bin/:/usr/local/bin \
PWD=/proc/self/cwd \
RESET_CACHE=A \
/usr/bin/clang -U_FORTIFY_SOURCE '-D_FORTIFY_SOURCE=1' -fstack-protector -Wall -fno-omit-frame-pointer -g0 -O2 -DNDEBUG -ffunction-sections -fdata-sections '-std=c++17' -MD -MF bazel-out/freebsd-opt/bin/src/third_party/fmt/_objs/fmt_with_debug/os.d '-frandom-seed=bazel-out/freebsd-opt/bin/src/third_party/fmt/_objs/fmt_with_debug/os.o' -iquote . -iquote bazel-out/freebsd-opt/bin -isystem src/third_party/fmt/dist/include -isystem bazel-out/freebsd-opt/bin/src/third_party/fmt/dist/include -isystem/usr/local/include -isystem/usr/local/include -Iexternal/abseil-cpp~ -DBOOST_NO_CXX98_FUNCTION_BASE -Wno-unused-function -Wno-invalid-offsetof -Wno-defaulted-function-deleted -Wno-unknown-warning-option -Wno-macro-redefined -Wno-register -Isrc -Ibazel-out/freebsd-opt/bin/src -Ibazel-out/freebsd-opt/bin/src/mongo/db/modules/enterprise/src -Isrc/mongo/db/modules/enterprise/src -Isrc/third_party/valgrind/include -no-canonical-prefixes -Wno-builtin-macro-redefined '-D__DATE__="redacted"'
'-D__TIMESTAMP__="redacted"' '-D__TIME__="redacted"' -c src/third_party/fmt/dist/src/os.cc -o bazel-out/freebsd-opt/bin/src/third_party/fmt/_objs/fmt_with_debug/os.o)
# Configuration: a70d7dd472d8309203da0978341fa63b9fcac7073e00303636d53ef9d665aa16
# Execution platform: @@_main~_repo_rules~internal_platforms_do_not_use//host:host
Use --sandbox_debug to see verbose messages from the sandbox and retain the sandbox build root for debugging
In file included from src/third_party/fmt/dist/src/os.cc:13:
In file included from src/third_party/fmt/dist/include/fmt/os.h:11:
src/third_party/fmt/dist/include/fmt/format.h:747:28: error: use of undeclared identifier 'malloc'
747 | T* p = static_cast<T*>(malloc(n * sizeof(T)));
| ^~~~~~
src/third_party/fmt/dist/include/fmt/format.h:752:35: error: use of undeclared identifier 'free'
752 | void deallocate(T* p, size_t) { free(p); }
| ^~~~
src/third_party/fmt/dist/include/fmt/format.h:812:46: note: in instantiation of member function 'fmt::detail::allocator<int>::deallocate' requested here
812 | if (old_data != self.store_) self.alloc_.deallocate(old_data, old_capacity);
| ^
src/third_party/fmt/dist/include/fmt/format.h:821:27: note: in instantiation of member function 'fmt::basic_memory_buffer<int>::grow' requested here
821 | : detail::buffer<T>(grow), alloc_(alloc) {
| ^
src/third_party/fmt/dist/include/fmt/format.h:752:35: error: use of undeclared identifier 'free'
752 | void deallocate(T* p, size_t) { free(p); }
| ^~~~
src/third_party/fmt/dist/include/fmt/format.h:812:46: note: in instantiation of member function 'fmt::detail::allocator<char>::deallocate' requested here
812 | if (old_data != self.store_) self.alloc_.deallocate(old_data, old_capacity);
| ^
src/third_party/fmt/dist/include/fmt/format.h:821:27: note: in instantiation of member function 'fmt::basic_memory_buffer<char>::grow' requested here
821 | : detail::buffer<T>(grow), alloc_(alloc) {
| ^
src/third_party/fmt/dist/include/fmt/format.h:752:35: error: use of undeclared identifier 'free'
752 | void deallocate(T* p, size_t) { free(p); }
| ^~~~
src/third_party/fmt/dist/include/fmt/format.h:812:46: note: in instantiation of member function 'fmt::detail::allocator<unsigned int>::deallocate' requested here
812 | if (old_data != self.store_) self.alloc_.deallocate(old_data, old_capacity);
| ^
src/third_party/fmt/dist/include/fmt/format.h:821:27: note: in instantiation of member function 'fmt::basic_memory_buffer<unsigned int, 32>::grow' requested here
821 | : detail::buffer<T>(grow), alloc_(alloc) {
| ^
4 errors generated.
Target //:install-core failed to build
ERROR: /wrkdirs/usr/ports/databases/mongodb90/work-default/mongo-r9.0.4/BUILD.bazel:200:14 MongoInstallRule install-core/bin/mongod failed: (Exit 1): clang failed: error executing CppCompile command (from target //src/third_party/fmt:fmt_with_debug)
(cd /wrkdirs/usr/ports/databases/mongodb90/work-default/bazel/7a35cfdf178effa2cffd7f5d37a512a7/sandbox/processwrapper-sandbox/132/execroot/_main && \
exec env - \
AR=llvm-ar \
CC=cc \
CXX=c++ \
PATH=/bin:/usr/bin/:/usr/local/bin \
PWD=/proc/self/cwd \
RESET_CACHE=A \
/usr/bin/clang -U_FORTIFY_SOURCE '-D_FORTIFY_SOURCE=1' -fstack-protector -Wall -fno-omit-frame-pointer -g0 -O2 -DNDEBUG -ffunction-sections -fdata-sections '-std=c++17' -MD -MF bazel-out/freebsd-opt/bin/src/third_party/fmt/_objs/fmt_with_debug/os.d '-frandom-seed=bazel-out/freebsd-opt/bin/src/third_party/fmt/_objs/fmt_with_debug/os.o' -iquote . -iquote bazel-out/freebsd-opt/bin -isystem src/third_party/fmt/dist/include -isystem bazel-out/freebsd-opt/bin/src/third_party/fmt/dist/include -isystem/usr/local/include -isystem/usr/local/include -Iexternal/abseil-cpp~ -DBOOST_NO_CXX98_FUNCTION_BASE -Wno-unused-function -Wno-invalid-offsetof -Wno-defaulted-function-deleted -Wno-unknown-warning-option -Wno-macro-redefined -Wno-register -Isrc -Ibazel-out/freebsd-opt/bin/src -Ibazel-out/freebsd-opt/bin/src/mongo/db/modules/enterprise/src -Isrc/mongo/db/modules/enterprise/src -Isrc/third_party/valgrind/include -no-canonical-prefixes -Wno-builtin-macro-redefined '-D__DATE__="redacted"'
'-D__TIMESTAMP__="redacted"' '-D__TIME__="redacted"' -c src/third_party/fmt/dist/src/os.cc -o bazel-out/freebsd-opt/bin/src/third_party/fmt/_objs/fmt_with_debug/os.o)
# Configuration: a70d7dd472d8309203da0978341fa63b9fcac7073e00303636d53ef9d665aa16
# Execution platform: @@_main~_repo_rules~internal_platforms_do_not_use//host:host
Use --sandbox_debug to see verbose messages from the sandbox and retain the sandbox build root for debugging
INFO: Elapsed time: 125.272s, Critical Path: 7.02s
INFO: 897 processes: 766 internal, 15 local, 116 processwrapper-sandbox.
ERROR: Build did NOT complete successfully
*** Error code 1
Stop.
make: stopped making "build" in /usr/ports/databases/mongodb90