[package - main-amd64-default][databases/mongodb90] Failed for mongodb90-9.0.4 in build
- Go to: [ bottom of page ] [ top of archives ] [ this month ]
Date: Sun, 18 Oct 2026 05:01:17 UTC
You are receiving this mail as a port that you maintain
is failing to build on the FreeBSD package build server.
Please investigate the failure and submit a PR to fix
build.
Maintainer: ronald@FreeBSD.org
Log URL: https://pkg-status.freebsd.org/beefy24/data/main-amd64-default/pbdf56c40600a_s02971f2000/logs/mongodb90-9.0.4.log
Build URL: https://pkg-status.freebsd.org/beefy24/build.html?mastername=main-amd64-default&build=pbdf56c40600a_s02971f2000
Log:
=>> Building databases/mongodb90
build started at Sun Oct 18 04:51:08 UTC 2026
port directory: /usr/ports/databases/mongodb90
package name: mongodb90-9.0.4
building for: FreeBSD main-amd64-default-job-09 16.0-CURRENT FreeBSD 16.0-CURRENT 1600028 amd64
maintained by: ronald@FreeBSD.org
Makefile datestamp: -rw-r--r-- 1 root wheel 18376 Oct 18 01:01 /usr/ports/databases/mongodb90/Makefile
Ports top last git commit: bdf56c40600a34c93ce4badad821d77ad8025535
Ports top unclean checkout: no
Port dir last git commit: cc91f92841b5673811cd4d549b5ca897dad3b8ec
Port dir unclean checkout: no
Poudriere version: poudriere-git-3.4.8-3-gd92fb7c0
Host OSVERSION: 1600022
Jail OSVERSION: 1600028
Job Id: 09
!!! Jail is newer than host. (Jail: 1600028, Host: 1600022) !!!
!!! This is not supported. !!!
!!! Host kernel must be same or newer than jail. !!!
!!! Expect build failures. !!!
---Begin Environment---
SHELL=/bin/sh
OSVERSION=1600028
UNAME_v=FreeBSD 16.0-CURRENT 1600028
UNAME_r=16.0-CURRENT
BLOCKSIZE=K
MAIL=/var/mail/root
MM_CHARSET=UTF-8
LANG=C.UTF-8
STATUS=1
HOME=/root
PATH=/sbin:/bin:/usr/sbin:/usr/bin:/usr/local/sbin:/usr/local/bin:/root/bin
MAKE_OBJDIR_CHECK_WRITABLE=0
LOCALBASE=/usr/local
USER=root
POUDRIERE_NAME=poudriere-git
LIBEXECPREFIX=/usr/local/libexec/poudriere
POUDRIERE_VERSION=3.4.8-3-gd92fb7c0
MASTERMNT=/usr/local/poudriere/data/.m/main-amd64-default/ref
LC_COLLATE=C
POUDRIERE_BUILD_TYPE=bulk
PACKAGE_BUILDING=yes
SAVED_TERM=
OUTPUT_REDIRECTED_STDERR=4
OUTPUT_REDIRECTED=1
PWD=/usr/local/poudriere/data/.m/main-amd64-default/09/.p
OUTPUT_REDIRECTED_STDOUT=3
P_PORTS_FEATURES=FLAVORS SUBPACKAGES SELECTED_OPTIONS
MASTERNAME=main-amd64-default
SCRIPTPREFIX=/usr/local/share/poudriere
SCRIPTNAME=bulk.sh
OLDPWD=/usr/local/poudriere/data/.m/main-amd64-default/ref/.p/pool
POUDRIERE_PKGNAME=poudriere-git-3.4.8-3-gd92fb7c0
SCRIPTPATH=/usr/local/share/poudriere/bulk.sh
POUDRIEREPATH=/usr/local/bin/poudriere
---End Environment---
---Begin Poudriere Port Flags/Env---
PORT_FLAGS=
PKGENV=
FLAVOR=default
MAKE_ARGS= FLAVOR=default
---End Poudriere Port Flags/Env---
---Begin OPTIONS List---
===> The following configuration options are available for mongodb90-9.0.4:
LTO=off: Use Link-Time Optimization
NOAVX=on: "Disable AVX instructions on amd64 (Sandybridge+)"
===> Use 'make config' to modify these settings
---End OPTIONS List---
--MAINTAINER--
ronald@FreeBSD.org
--End MAINTAINER--
--CONFIGURE_ARGS--
x86_64 freebsd
--End CONFIGURE_ARGS--
--CONFIGURE_ENV--
PYTHON3="/usr/local/bin/python3.12" PKG_CONFIG=pkgconf MAKE=/usr/local/bin/gmake PYTHON="/usr/local/bin/python3.12" XDG_DATA_HOME=/wrkdirs/usr/ports/databases/mongodb90/work-default XDG_CONFIG_HOME=/wrkdirs/usr/ports/databases/mongodb90/work-default XDG_CACHE_HOME=/wrkdirs/usr/ports/databases/mongodb90/work-default/.cache HOME=/wrkdirs/usr/ports/databases/mongodb90/work-default TMPDIR="/wrkdirs/usr/ports/databases/mongodb90/work-default" PATH=/wrkdirs/usr/ports/databases/mongodb90/work-default/.bin:/sbin:/bin:/usr/sbin:/usr/bin:/usr/local/sbin:/usr/local/bin:/root/bin PKG_CONFIG_LIBDIR=/wrkdirs/usr/ports/databases/mongodb90/work-default/.pkgconfig:/usr/local/libdata/pkgconfig:/usr/local/share/pkgconfig:/usr/libdata/pkgconfig SHELL=/bin/sh CONFIG_SHELL=/bin/sh
--End CONFIGURE_ENV--
--MAKE_ENV--
OPENSSLBASE=/usr OPENSSLDIR=/etc/ssl OPENSSLINC=/usr/include OPENSSLLIB=/usr/lib XDG_DATA_HOME=/wrkdirs/usr/ports/databases/mongodb90/work-default XDG_CONFIG_HOME=/wrkdirs/usr/ports/databases/mongodb90/work-default XDG_CACHE_HOME=/wrkdirs/usr/ports/databases/mongodb90/work-default/.cache HOME=/wrkdirs/usr/ports/databases/mongodb90/work-default TMPDIR="/wrkdirs/usr/ports/databases/mongodb90/work-default" PATH=/wrkdirs/usr/ports/databases/mongodb90/work-default/.bin:/sbin:/bin:/usr/sbin:/usr/bin:/usr/local/sbin:/usr/local/bin:/root/bin PKG_CONFIG_LIBDIR=/wrkdirs/usr/ports/databases/mongodb90/work-default/.pkgconfig:/usr/local/libdata/pkgconfig:/usr/local/share/pkgconfig:/usr/libdata/pkgconfig MK_DEBUG_FILES=no MK_KERNEL_SYMBOLS=no SHELL=/bin/sh NO_LINT=YES PREFIX=/usr/local LOCALBASE=/usr/local CC="cc" CFLAGS="-O2 -pipe -fstack-protector-strong -fno-strict-aliasing " CPP="cpp" CPPFLAGS="" LDFLAGS=" " LIBS="" CXX="c++" CXXFLAGS="-O2 -pipe -fstack-protector-strong -fno
-strict-aliasing " BSD_INSTALL_PROGRAM="install -s -m 555" BSD_INSTALL_LIB="install -s -m 0644" BSD_INSTALL_SCRIPT="install -m 555" BSD_INSTALL_DATA="install -m 0644" BSD_INSTALL_MAN="install -m 444"
--End MAKE_ENV--
--PLIST_SUB--
PYTHON_INCLUDEDIR=include/python3.12 PYTHON_LIBDIR=lib/python3.12 PYTHON_PLATFORM=freebsd16 PYTHON_SITELIBDIR=lib/python3.12/site-packages PYTHON_SUFFIX=312 PYTHON_BASESUFFIX=312 PYTHON_TAG=.cpython-312 PYTHON_SOABI=.cpython-312 PYTHON_VER=3.12 PYTHON_BASEVER=3.12 PYTHON_VERSION=python3.12 PYTHON2="@comment " PYTHON3="" OSREL=16.0 PREFIX=%D LOCALBASE=/usr/local RESETPREFIX=/usr/local LIB32DIR=lib DOCSDIR="share/doc/mongodb" EXAMPLESDIR="share/examples/mongodb" DATADIR="share/mongodb" WWWDIR="www/mongodb" ETCDIR="etc/mongodb"
--End PLIST_SUB--
--SUB_LIST--
PYTHON_INCLUDEDIR=/usr/local/include/python3.12 PYTHON_LIBDIR=/usr/local/lib/python3.12 PYTHON_PLATFORM=freebsd16 PYTHON_SITELIBDIR=/usr/local/lib/python3.12/site-packages PYTHON_SUFFIX=312 PYTHON_BASESUFFIX=312 PYTHON_TAG=.cpython-312 PYTHON_SOABI=.cpython-312 PYTHON_VER=3.12 PYTHON_BASEVER=3.12 PYTHON_VERSION=python3.12 PYTHON2="@comment " PYTHON3="" PREFIX=/usr/local LOCALBASE=/usr/local DATADIR=/usr/local/share/mongodb DOCSDIR=/usr/local/share/doc/mongodb EXAMPLESDIR=/usr/local/share/examples/mongodb WWWDIR=/usr/local/www/mongodb ETCDIR=/usr/local/etc/mongodb
--End SUB_LIST--
---Begin make.conf---
USE_PACKAGE_DEPENDS=yes
BATCH=yes
WRKDIRPREFIX=/wrkdirs
PORTSDIR=/usr/ports
PACKAGES=/packages
DISTDIR=/distfiles
PACKAGE_BUILDING=yes
PACKAGE_BUILDING_FLAVORS=yes
#### ####
# XXX: We really need this but cannot use it while 'make checksum' does not
# try the next mirror on checksum failure. It currently retries the same
# failed mirror and then fails rather then trying another. It *does*
# try the next if the size is mismatched though.
#MASTER_SITE_FREEBSD=yes
# Build ALLOW_MAKE_JOBS_PACKAGES with 3 jobs
MAKE_JOBS_NUMBER=3
#### Misc Poudriere ####
.include "/etc/make.conf.ports_env"
GID=0
UID=0
---End make.conf---
--Resource limits--
cpu time (seconds, -t) unlimited
file size (512-blocks, -f) unlimited
data seg size (kbytes, -d) 33554432
stack size (kbytes, -s) 524288
core file size (512-blocks, -c) unlimited
max memory size (kbytes, -m) unlimited
locked memory (kbytes, -l) unlimited
max user processes (-u) 89999
open files (-n) 8192
virtual mem size (kbytes, -v) unlimited
swap limit (kbytes, -w) unlimited
socket buffer size (bytes, -b) unlimited
pseudo-terminals (-p) unlimited
kqueues (-k) unlimited
umtx shared locks (-o) unlimited
pipebuf (kbytes, -y) unlimited
virtual machines (-V) unlimited
--End resource limits--
=======================<phase: check-sanity >============================
===== env: NO_DEPENDS=yes USER=root UID=0 GID=0
/!\ WARNING /!\
WITH_LTO is unsupported, use WITH=LTO on the command line, or one of these
in /etc/make.conf, OPTIONS_SET+=LTO to set it globally, or
databases_mongodb90_SET+=LTO for only this port.
===> License APACHE20 SSPLv1 accepted by the user
===========================================================================
=======================<phase: pkg-depends >============================
===== env: USE_PACKAGE_DEPENDS_ONLY=1 USER=root UID=0 GID=0
===> mongodb90-9.0.4 depends on file: /usr/local/sbin/pkg - not found
===> Installing existing package /packages/All/pkg-2.8.4.pkg
[main-amd64-default-job-09] Installing pkg-2.8.4...
[main-amd64-default-job-09] Extracting pkg-2.8.4: .......... done
===> mongodb90-9.0.4 depends on file: /usr/local/sbin/pkg - found
===> Returning to build of mongodb90-9.0.4
===========================================================================
=======================<phase: fetch-depends >============================
===== env: USE_PACKAGE_DEPENDS_ONLY=1 USER=root UID=0 GID=0
===========================================================================
=======================<phase: fetch >============================
===== env: NO_DEPENDS=yes USER=root UID=0 GID=0
===> License APACHE20 SSPLv1 accepted by the user
=> wasi-sysroot-33.0+m.tar.gz doesn't seem to exist in /portdistfiles.
=> Attempting to fetch https://github.com/WebAssembly/wasi-sdk/releases/download/wasi-sdk-33/wasi-sysroot-33.0+m.tar.gz
wasi-sysroot-33.0+m.tar.gz 118 MB 109 MBps 01s
=> libclang_rt-33.0+m.tar.gz doesn't seem to exist in /portdistfiles.
=> Attempting to fetch https://github.com/WebAssembly/wasi-sdk/releases/download/wasi-sdk-33/libclang_rt-33.0+m.tar.gz
libclang_rt-33.0+m.tar.gz 630 kB 59 MBps 00s
=> apple_support.1.24.1.tar.gz doesn't seem to exist in /portdistfiles.
=> Attempting to fetch https://github.com/bazelbuild/apple_support/releases/download/1.24.1/apple_support.1.24.1.tar.gz
apple_support.1.24.1.tar.gz 104 kB 9123 kBps 00s
=> bazel-lib-v2.13.0.tar.gz doesn't seem to exist in /portdistfiles.
=> Attempting to fetch https://github.com/bazel-contrib/bazel-lib/releases/download/v2.13.0/bazel-lib-v2.13.0.tar.gz
bazel-lib-v2.13.0.tar.gz 182 kB 35 MBps 00s
=> rules_js-v2.1.3.tar.gz doesn't seem to exist in /portdistfiles.
=> Attempting to fetch https://github.com/aspect-build/rules_js/releases/download/v2.1.3/rules_js-v2.1.3.tar.gz
rules_js-v2.1.3.tar.gz 1647 kB 75 MBps 00s
=> bats-core-1.10.0.tar.gz doesn't seem to exist in /portdistfiles.
=> Attempting to fetch https://github.com/bats-core/bats-core/archive/v1.10.0.tar.gz
bats-core-1.10.0.tar.gz 155 kB 1870 kBps 00s
=> bazel_clang_tidy-1.7.tar.gz doesn't seem to exist in /portdistfiles.
=> Attempting to fetch https://github.com/mongodb-forks/bazel_clang_tidy/archive/refs/tags/v1.7.tar.gz
bazel_clang_tidy-1.7.tar.gz 8589 B 53 MBps 00s
=> bazel_features-v1.37.0.tar.gz doesn't seem to exist in /portdistfiles.
=> Attempting to fetch https://github.com/bazel-contrib/bazel_features/releases/download/v1.37.0/bazel_features-v1.37.0.tar.gz
bazel_features-v1.37.0.tar.gz 17 kB 103 MBps 00s
=> bazel-skylib-1.9.0.tar.gz doesn't seem to exist in /portdistfiles.
=> Attempting to fetch https://github.com/bazelbuild/bazel-skylib/releases/download/1.9.0/bazel-skylib-1.9.0.tar.gz
bazel-skylib-1.9.0.tar.gz 43 kB 26 MBps 00s
=> buildifier-prebuilt-6.4.0.tar.gz doesn't seem to exist in /portdistfiles.
=> Attempting to fetch https://github.com/keith/buildifier-prebuilt/archive/refs/tags/6.4.0.tar.gz
buildifier-prebuilt-6.4.0.tar.gz 19 kB 915 kBps 00s
=> platforms-0.0.11.tar.gz doesn't seem to exist in /portdistfiles.
=> Attempting to fetch https://github.com/bazelbuild/platforms/releases/download/0.0.11/platforms-0.0.11.tar.gz
<snip>
Compiling gix-hashtable v0.7.0
Compiling gix-object v0.47.0
Compiling gix-fs v0.13.0
Compiling gix-commitgraph v0.26.0
Compiling gix-glob v0.18.0
Compiling tera v1.20.0
Compiling cargo_metadata v0.19.2
Compiling gix-tempfile v16.0.0
Compiling gix-attributes v0.24.0
Compiling gix-ignore v0.13.0
Compiling gix-lock v16.0.0
Compiling icu_normalizer v1.5.0
Compiling gix-shallow v0.2.0
Compiling gix-pathspec v0.9.0
Compiling gix-revwalk v0.18.0
Compiling gix-ref v0.50.0
Compiling gix-pack v0.57.0
Compiling gix-filter v0.17.0
Compiling gix-diff v0.50.0
Compiling idna_adapter v1.2.0
Compiling toml v0.8.21
Compiling idna v1.0.3
Compiling gix-revision v0.32.0
Compiling gix-traverse v0.44.0
Compiling gix-negotiate v0.18.0
Compiling url v2.5.4
Compiling cargo_toml v0.22.1
Compiling gix-index v0.38.0
Compiling gix-config v0.43.0
Compiling gix-discover v0.38.0
Compiling gix-refspec v0.28.0
Compiling gix-url v0.29.0
Compiling cargo-lock v10.1.0
Compiling gix-odb v0.67.0
Compiling gix-credentials v0.27.0
Compiling gix-transport v0.45.0
Compiling gix-worktree v0.39.0
Compiling gix-protocol v0.48.0
Compiling gix-submodule v0.17.0
Compiling gix v0.70.0
Compiling crates-index v3.7.0
Compiling cargo-bazel v0.17.0 (/wrkdirs/usr/ports/databases/mongodb90/work-default/bazel/7a35cfdf178effa2cffd7f5d37a512a7/external/rules_rust~/crate_universe)
Finished `release` profile [optimized] target(s) in 1m 26s
Analyzing: target //:install-core (707 packages loaded, 47203 targets configured)
Analyzing: target //:install-core (1057 packages loaded, 62524 targets configured)
Analyzing: target //:install-core (1179 packages loaded, 75249 targets configured)
INFO: Analyzed target //:install-core (1179 packages loaded, 75249 targets configured).
[283 / 13,529] [Prepa] Creating source manifest for @@rules_rust~~crate~crates__thiserror-2.0.18//:_bs- [for tool]
[582 / 15,919] Compiling src/third_party/murmurhash3/MurmurHash3.cpp; 0s processwrapper-sandbox ... (3 actions, 2 running)
[741 / 16,739] IdlcGenerator src/mongo/db/versioning_protocol/database_version_gen.cpp; 0s processwrapper-sandbox ... (4 actions, 2 running)
[751 / 16,739] Compiling src/third_party/timelib/dist/parse_date.c; 0s processwrapper-sandbox ... (3 actions, 2 running)
[762 / 16,739] Compiling src/third_party/timelib/dist/parse_date.c; 1s processwrapper-sandbox ... (4 actions, 2 running)
[772 / 16,739] Compiling src/third_party/timelib/dist/parse_date.c; 3s processwrapper-sandbox ... (3 actions, 2 running)
[780 / 16,739] Compiling src/third_party/timelib/dist/parse_date.c; 4s processwrapper-sandbox ... (4 actions, 2 running)
[789 / 16,739] Compiling src/third_party/timelib/dist/parse_date.c; 5s processwrapper-sandbox ... (3 actions, 2 running)
[794 / 16,739] Compiling src/third_party/timelib/dist/parse_date.c; 6s processwrapper-sandbox ... (3 actions running)
[802 / 16,739] Compiling src/third_party/timelib/dist/parse_date.c; 7s processwrapper-sandbox ... (3 actions, 2 running)
[806 / 16,739] Compiling src/third_party/timelib/dist/parse_date.c; 9s processwrapper-sandbox ... (3 actions running)
[810 / 16,739] Compiling src/third_party/timelib/dist/parse_date.c; 10s processwrapper-sandbox ... (3 actions running)
[822 / 16,739] Compiling src/third_party/timelib/dist/parse_date.c; 11s processwrapper-sandbox ... (4 actions, 2 running)
[825 / 16,739] Compiling src/third_party/timelib/dist/parse_date.c; 13s processwrapper-sandbox ... (3 actions running)
[826 / 16,739] Compiling src/third_party/timelib/dist/parse_date.c; 15s processwrapper-sandbox ... (4 actions, 2 running)
[828 / 16,739] Compiling src/third_party/timelib/dist/parse_date.c; 16s processwrapper-sandbox ... (3 actions running)
[834 / 16,739] Compiling src/third_party/timelib/dist/parse_date.c; 18s processwrapper-sandbox ... (3 actions running)
[837 / 16,739] Compiling src/third_party/timelib/dist/parse_date.c; 20s processwrapper-sandbox ... (4 actions, 2 running)
[839 / 16,739] Compiling src/third_party/timelib/dist/parse_date.c; 21s processwrapper-sandbox ... (4 actions, 2 running)
[847 / 16,739] Compiling src/third_party/timelib/dist/parse_date.c; 22s processwrapper-sandbox ... (3 actions running)
[855 / 16,739] Compiling src/third_party/zstandard/zstd/lib/compress/zstd_lazy.c [for tool]; 4s processwrapper-sandbox ... (4 actions, 2 running)
[864 / 16,739] Compiling src/third_party/zstandard/zstd/lib/compress/zstd_lazy.c [for tool]; 5s processwrapper-sandbox ... (3 actions, 2 running)
[873 / 16,739] Compiling src/third_party/timelib/dist/parse_zoneinfo.c; 0s processwrapper-sandbox ... (3 actions, 2 running)
[881 / 16,739] Compiling src/third_party/zstandard/zstd/lib/compress/zstd_opt.c [for tool]; 1s processwrapper-sandbox ... (3 actions, 2 running)
[892 / 16,739] Compiling src/third_party/zstandard/zstd/lib/compress/zstdmt_compress.c [for tool]; 0s processwrapper-sandbox ... (4 actions, 2 running)
[900 / 16,739] Compiling src/third_party/timelib/dist/parse_date.c; 1s processwrapper-sandbox ... (3 actions, 2 running)
[905 / 16,739] Compiling src/third_party/timelib/dist/parse_date.c; 2s processwrapper-sandbox ... (3 actions, 2 running)
[912 / 16,739] Compiling src/third_party/timelib/dist/parse_date.c; 3s processwrapper-sandbox ... (3 actions running)
[921 / 16,739] Compiling src/third_party/timelib/dist/parse_date.c; 4s processwrapper-sandbox ... (3 actions running)
[925 / 16,739] Compiling src/third_party/timelib/dist/parse_date.c; 5s processwrapper-sandbox ... (3 actions, 2 running)
[931 / 16,739] Compiling src/third_party/timelib/dist/parse_date.c; 6s processwrapper-sandbox ... (3 actions, 2 running)
[941 / 16,739] Compiling src/third_party/timelib/dist/parse_date.c; 7s processwrapper-sandbox ... (4 actions, 2 running)
[946 / 16,739] Compiling src/third_party/timelib/dist/parse_date.c; 9s processwrapper-sandbox ... (4 actions, 2 running)
[951 / 16,739] Compiling src/third_party/timelib/dist/parse_date.c; 10s processwrapper-sandbox ... (4 actions, 2 running)
[961 / 16,739] Compiling src/third_party/timelib/dist/parse_date.c; 11s processwrapper-sandbox ... (4 actions, 2 running)
[971 / 16,739] Compiling src/third_party/timelib/dist/parse_date.c; 12s processwrapper-sandbox ... (3 actions, 2 running)
[980 / 16,739] Compiling src/third_party/timelib/dist/parse_date.c; 13s processwrapper-sandbox ... (3 actions, 2 running)
[989 / 16,739] Compiling src/third_party/timelib/dist/parse_date.c; 14s processwrapper-sandbox ... (3 actions, 2 running)
[995 / 16,739] Compiling src/third_party/timelib/dist/parse_date.c; 15s processwrapper-sandbox ... (3 actions, 2 running)
[1,000 / 16,739] Compiling src/third_party/timelib/dist/parse_date.c; 16s processwrapper-sandbox ... (3 actions, 2 running)
[1,006 / 16,739] Compiling src/third_party/timelib/dist/parse_date.c; 17s processwrapper-sandbox ... (3 actions, 2 running)
[1,012 / 16,739] Compiling src/third_party/libbson/dist/src/libbson/src/bson/bson-json.c; 0s processwrapper-sandbox ... (4 actions, 2 running)
[1,019 / 16,739] Compiling src/third_party/libbson/dist/src/libbson/src/bson/bson-json.c; 0s processwrapper-sandbox ... (3 actions running)
[1,025 / 16,739] Compiling src/third_party/zstandard/zstd/lib/compress/zstd_double_fast.c; 0s processwrapper-sandbox ... (3 actions running)
[1,033 / 16,739] Compiling src/third_party/zstandard/zstd/lib/compress/zstd_double_fast.c; 1s processwrapper-sandbox ... (3 actions, 2 running)
[1,050 / 16,739] Compiling src/third_party/zstandard/zstd/lib/compress/zstd_fast.c; 0s processwrapper-sandbox ... (3 actions, 2 running)
[1,067 / 16,739] Compiling src/third_party/zstandard/zstd/lib/compress/zstd_fast.c; 1s processwrapper-sandbox ... (3 actions, 2 running)
[1,080 / 16,739] Compiling src/third_party/zstandard/zstd/lib/compress/zstd_fast.c; 2s processwrapper-sandbox ... (3 actions, 2 running)
[1,095 / 16,739] Compiling src/third_party/zstandard/zstd/lib/compress/zstd_lazy.c; 1s processwrapper-sandbox ... (3 actions, 2 running)
[1,125 / 16,739] Compiling src/third_party/zstandard/zstd/lib/compress/zstd_lazy.c; 2s processwrapper-sandbox ... (3 actions, 2 running)
[1,138 / 16,739] Compiling src/third_party/zstandard/zstd/lib/compress/zstd_lazy.c; 3s processwrapper-sandbox ... (3 actions, 2 running)
[1,146 / 16,739] Compiling src/third_party/zstandard/zstd/lib/compress/zstd_lazy.c; 4s processwrapper-sandbox ... (3 actions, 2 running)
[1,156 / 16,739] Compiling src/third_party/zstandard/zstd/lib/compress/zstd_lazy.c; 5s processwrapper-sandbox ... (3 actions, 2 running)
[1,162 / 16,739] Compiling src/third_party/zstandard/zstd/lib/compress/zstd_lazy.c; 6s processwrapper-sandbox ... (3 actions, 2 running)
[1,170 / 16,739] Compiling src/third_party/zstandard/zstd/lib/compress/zstd_lazy.c; 7s processwrapper-sandbox ... (3 actions, 2 running)
[1,181 / 16,739] Compiling src/third_party/zstandard/zstd/lib/compress/zstd_lazy.c; 8s processwrapper-sandbox ... (3 actions, 2 running)
[1,190 / 16,739] Compiling src/third_party/zstandard/zstd/lib/decompress/zstd_decompress_block.c; 0s processwrapper-sandbox ... (3 actions, 2 running)
[1,197 / 16,739] Compiling src/third_party/zstandard/zstd/lib/decompress/zstd_decompress_block.c; 1s processwrapper-sandbox ... (3 actions, 2 running)
[1,203 / 16,739] Compiling src/third_party/zstandard/zstd/lib/decompress/zstd_decompress_block.c; 3s processwrapper-sandbox ... (3 actions, 2 running)
[1,212 / 16,739] Compiling src/third_party/zstandard/zstd/lib/decompress/zstd_decompress.c; 0s processwrapper-sandbox ... (3 actions, 2 running)
[1,223 / 16,739] Compiling src/third_party/zstandard/zstd/lib/decompress/huf_decompress.c; 0s processwrapper-sandbox ... (3 actions running)
[1,229 / 16,739] Compiling src/third_party/zstandard/zstd/lib/decompress/huf_decompress.c; 1s processwrapper-sandbox ... (3 actions running)
[1,238 / 16,739] Compiling src/third_party/zstandard/zstd/lib/decompress/huf_decompress.c; 2s processwrapper-sandbox ... (3 actions, 2 running)
[1,245 / 16,739] Compiling src/third_party/zstandard/zstd/lib/compress/zstd_opt.c; 0s processwrapper-sandbox ... (3 actions, 2 running)
[1,254 / 16,739] Compiling src/third_party/zstandard/zstd/lib/compress/zstd_opt.c; 1s processwrapper-sandbox ... (3 actions, 2 running)
[1,264 / 16,739] Compiling src/third_party/zstandard/zstd/lib/decompress/zstd_decompress_block.c; 1s processwrapper-sandbox ... (3 actions, 2 running)
[1,271 / 16,739] Compiling src/third_party/zstandard/zstd/lib/decompress/zstd_decompress_block.c; 2s processwrapper-sandbox ... (3 actions, 2 running)
[1,282 / 16,739] Compiling src/third_party/zstandard/zstd/lib/compress/zstd_lazy.c; 2s processwrapper-sandbox ... (4 actions, 2 running)
[1,291 / 16,739] Compiling src/third_party/zstandard/zstd/lib/compress/zstd_lazy.c; 3s processwrapper-sandbox ... (3 actions, 2 running)
[1,297 / 16,739] Compiling src/third_party/zstandard/zstd/lib/compress/zstd_lazy.c; 4s processwrapper-sandbox ... (4 actions, 2 running)
[1,297 / 16,739] Compiling src/third_party/zstandard/zstd/lib/compress/zstd_lazy.c; 5s processwrapper-sandbox ... (4 actions, 3 running)
[1,298 / 16,739] Compiling src/third_party/zstandard/zstd/lib/compress/zstd_lazy.c; 6s processwrapper-sandbox ... (4 actions, 3 running)
[1,303 / 16,739] Compiling src/third_party/zstandard/zstd/lib/dictBuilder/zdict.c; 0s processwrapper-sandbox ... (3 actions, 2 running)
[1,308 / 16,739] Compiling src/third_party/zstandard/zstd/lib/compress/zstd_compress.c; 1s processwrapper-sandbox ... (3 actions, 2 running)
[1,317 / 16,739] Compiling src/third_party/zstandard/zstd/lib/compress/zstd_compress.c; 2s processwrapper-sandbox ... (3 actions, 2 running)
[1,340 / 16,739] Compiling src/third_party/tomcrypt-1.18.2/src/hashes/sha2/sha256.c; 0s processwrapper-sandbox ... (3 actions, 2 running)
[1,358 / 16,739] Compiling src/third_party/libstemmer_c/dist/libstemmer/libstemmer_utf8.c; 0s processwrapper-sandbox ... (4 actions, 2 running)
[1,373 / 16,739] Compiling src/third_party/fmt/dist/src/format.cc; 1s processwrapper-sandbox ... (4 actions, 2 running)
[1,382 / 16,739] Compiling src/third_party/fmt/dist/src/format.cc; 2s processwrapper-sandbox ... (4 actions, 2 running)
[1,395 / 16,739] Compiling src/third_party/fmt/dist/src/format.cc; 3s processwrapper-sandbox ... (3 actions, 2 running)
[1,395 / 16,739] Compiling src/third_party/fmt/dist/src/format.cc; 4s processwrapper-sandbox ... (4 actions, 3 running)
ERROR: /wrkdirs/usr/ports/databases/mongodb90/work-default/mongo-r9.0.4/src/third_party/fmt/BUILD.bazel:5:17: Compiling src/third_party/fmt/dist/src/os.cc failed: (Exit 1): clang failed: error executing CppCompile command (from target //src/third_party/fmt:fmt_with_debug)
(cd /wrkdirs/usr/ports/databases/mongodb90/work-default/bazel/7a35cfdf178effa2cffd7f5d37a512a7/sandbox/processwrapper-sandbox/669/execroot/_main && \
exec env - \
AR=llvm-ar \
CC=cc \
CXX=c++ \
PATH=/bin:/usr/bin/:/usr/local/bin \
PWD=/proc/self/cwd \
RESET_CACHE=A \
/usr/bin/clang -U_FORTIFY_SOURCE '-D_FORTIFY_SOURCE=1' -fstack-protector -Wall -fno-omit-frame-pointer -g0 -O2 -DNDEBUG -ffunction-sections -fdata-sections '-std=c++17' -MD -MF bazel-out/freebsd-opt/bin/src/third_party/fmt/_objs/fmt_with_debug/os.pic.d '-frandom-seed=bazel-out/freebsd-opt/bin/src/third_party/fmt/_objs/fmt_with_debug/os.pic.o' -fPIC -iquote . -iquote bazel-out/freebsd-opt/bin -isystem src/third_party/fmt/dist/include -isystem bazel-out/freebsd-opt/bin/src/third_party/fmt/dist/include -isystem/usr/local/include -isystem/usr/local/include -Iexternal/abseil-cpp~ -DBOOST_NO_CXX98_FUNCTION_BASE -Wno-unused-function -Wno-invalid-offsetof -Wno-defaulted-function-deleted -Wno-unknown-warning-option -Wno-macro-redefined -Wno-register -Isrc -Ibazel-out/freebsd-opt/bin/src -Ibazel-out/freebsd-opt/bin/src/mongo/db/modules/enterprise/src -Isrc/mongo/db/modules/enterprise/src -Isrc/third_party/valgrind/include -no-canonical-prefixes -Wno-builtin-macro-redefined '-D__DATE
__="redacted"' '-D__TIMESTAMP__="redacted"' '-D__TIME__="redacted"' -c src/third_party/fmt/dist/src/os.cc -o bazel-out/freebsd-opt/bin/src/third_party/fmt/_objs/fmt_with_debug/os.pic.o)
# Configuration: a70d7dd472d8309203da0978341fa63b9fcac7073e00303636d53ef9d665aa16
# Execution platform: @@_main~_repo_rules~internal_platforms_do_not_use//host:host
Use --sandbox_debug to see verbose messages from the sandbox and retain the sandbox build root for debugging
In file included from src/third_party/fmt/dist/src/os.cc:13:
In file included from src/third_party/fmt/dist/include/fmt/os.h:11:
src/third_party/fmt/dist/include/fmt/format.h:747:28: error: use of undeclared identifier 'malloc'
747 | T* p = static_cast<T*>(malloc(n * sizeof(T)));
| ^~~~~~
src/third_party/fmt/dist/include/fmt/format.h:752:35: error: use of undeclared identifier 'free'
752 | void deallocate(T* p, size_t) { free(p); }
| ^~~~
src/third_party/fmt/dist/include/fmt/format.h:812:46: note: in instantiation of member function 'fmt::detail::allocator<int>::deallocate' requested here
812 | if (old_data != self.store_) self.alloc_.deallocate(old_data, old_capacity);
| ^
src/third_party/fmt/dist/include/fmt/format.h:821:27: note: in instantiation of member function 'fmt::basic_memory_buffer<int>::grow' requested here
821 | : detail::buffer<T>(grow), alloc_(alloc) {
| ^
src/third_party/fmt/dist/include/fmt/format.h:752:35: error: use of undeclared identifier 'free'
752 | void deallocate(T* p, size_t) { free(p); }
| ^~~~
src/third_party/fmt/dist/include/fmt/format.h:812:46: note: in instantiation of member function 'fmt::detail::allocator<char>::deallocate' requested here
812 | if (old_data != self.store_) self.alloc_.deallocate(old_data, old_capacity);
| ^
src/third_party/fmt/dist/include/fmt/format.h:821:27: note: in instantiation of member function 'fmt::basic_memory_buffer<char>::grow' requested here
821 | : detail::buffer<T>(grow), alloc_(alloc) {
| ^
src/third_party/fmt/dist/include/fmt/format.h:752:35: error: use of undeclared identifier 'free'
752 | void deallocate(T* p, size_t) { free(p); }
| ^~~~
src/third_party/fmt/dist/include/fmt/format.h:812:46: note: in instantiation of member function 'fmt::detail::allocator<unsigned int>::deallocate' requested here
812 | if (old_data != self.store_) self.alloc_.deallocate(old_data, old_capacity);
| ^
src/third_party/fmt/dist/include/fmt/format.h:821:27: note: in instantiation of member function 'fmt::basic_memory_buffer<unsigned int, 32>::grow' requested here
821 | : detail::buffer<T>(grow), alloc_(alloc) {
| ^
4 errors generated.
Target //:install-core failed to build
ERROR: /wrkdirs/usr/ports/databases/mongodb90/work-default/mongo-r9.0.4/BUILD.bazel:200:14 MongoInstallRule install-core/bin/mongod failed: (Exit 1): clang failed: error executing CppCompile command (from target //src/third_party/fmt:fmt_with_debug)
(cd /wrkdirs/usr/ports/databases/mongodb90/work-default/bazel/7a35cfdf178effa2cffd7f5d37a512a7/sandbox/processwrapper-sandbox/669/execroot/_main && \
exec env - \
AR=llvm-ar \
CC=cc \
CXX=c++ \
PATH=/bin:/usr/bin/:/usr/local/bin \
PWD=/proc/self/cwd \
RESET_CACHE=A \
/usr/bin/clang -U_FORTIFY_SOURCE '-D_FORTIFY_SOURCE=1' -fstack-protector -Wall -fno-omit-frame-pointer -g0 -O2 -DNDEBUG -ffunction-sections -fdata-sections '-std=c++17' -MD -MF bazel-out/freebsd-opt/bin/src/third_party/fmt/_objs/fmt_with_debug/os.pic.d '-frandom-seed=bazel-out/freebsd-opt/bin/src/third_party/fmt/_objs/fmt_with_debug/os.pic.o' -fPIC -iquote . -iquote bazel-out/freebsd-opt/bin -isystem src/third_party/fmt/dist/include -isystem bazel-out/freebsd-opt/bin/src/third_party/fmt/dist/include -isystem/usr/local/include -isystem/usr/local/include -Iexternal/abseil-cpp~ -DBOOST_NO_CXX98_FUNCTION_BASE -Wno-unused-function -Wno-invalid-offsetof -Wno-defaulted-function-deleted -Wno-unknown-warning-option -Wno-macro-redefined -Wno-register -Isrc -Ibazel-out/freebsd-opt/bin/src -Ibazel-out/freebsd-opt/bin/src/mongo/db/modules/enterprise/src -Isrc/mongo/db/modules/enterprise/src -Isrc/third_party/valgrind/include -no-canonical-prefixes -Wno-builtin-macro-redefined '-D__DATE
__="redacted"' '-D__TIMESTAMP__="redacted"' '-D__TIME__="redacted"' -c src/third_party/fmt/dist/src/os.cc -o bazel-out/freebsd-opt/bin/src/third_party/fmt/_objs/fmt_with_debug/os.pic.o)
# Configuration: a70d7dd472d8309203da0978341fa63b9fcac7073e00303636d53ef9d665aa16
# Execution platform: @@_main~_repo_rules~internal_platforms_do_not_use//host:host
Use --sandbox_debug to see verbose messages from the sandbox and retain the sandbox build root for debugging
INFO: Elapsed time: 196.903s, Critical Path: 24.00s
INFO: 1399 processes: 733 internal, 23 local, 643 processwrapper-sandbox.
ERROR: Build did NOT complete successfully
*** Error code 1
Stop.
make: stopped making "build" in /usr/ports/databases/mongodb90