[package - main-amd64-default][net/dpdk-20.11] Failed for dpdk20.11-20.11.8.1600027 in build
- Go to: [ bottom of page ] [ top of archives ] [ this month ]
Date: Tue, 13 Oct 2026 05:31:58 UTC
You are receiving this mail as a port that you maintain
is failing to build on the FreeBSD package build server.
Please investigate the failure and submit a PR to fix
build.
Maintainer: bruce.richardson@intel.com
Log URL: https://pkg-status.freebsd.org/beefy24/data/main-amd64-default/p3a3ea9a0eb1f_s1ca7f66185/logs/dpdk20.11-20.11.8.1600027.log
Build URL: https://pkg-status.freebsd.org/beefy24/build.html?mastername=main-amd64-default&build=p3a3ea9a0eb1f_s1ca7f66185
Log:
=>> Building net/dpdk-20.11
build started at Tue Oct 13 05:26:15 UTC 2026
port directory: /usr/ports/net/dpdk-20.11
package name: dpdk20.11-20.11.8.1600027
building for: FreeBSD main-amd64-default-job-29 16.0-CURRENT FreeBSD 16.0-CURRENT 1600027 amd64
maintained by: bruce.richardson@intel.com
Makefile datestamp: -rw-r--r-- 1 root wheel 1682 Sep 30 2025 /usr/ports/net/dpdk-20.11/Makefile
Ports top last git commit: 3a3ea9a0eb1ff5e044373aac4a03e137ad4c878d
Ports top unclean checkout: no
Port dir last git commit: b64b73fd938d5b2788547d16ed6a76493acc9142
Port dir unclean checkout: no
Poudriere version: poudriere-git-3.4.8-3-gd92fb7c0
Host OSVERSION: 1600022
Jail OSVERSION: 1600027
Job Id: 29
!!! Jail is newer than host. (Jail: 1600027, Host: 1600022) !!!
!!! This is not supported. !!!
!!! Host kernel must be same or newer than jail. !!!
!!! Expect build failures. !!!
---Begin Environment---
SHELL=/bin/sh
OSVERSION=1600027
UNAME_v=FreeBSD 16.0-CURRENT 1600027
UNAME_r=16.0-CURRENT
BLOCKSIZE=K
MAIL=/var/mail/root
MM_CHARSET=UTF-8
LANG=C.UTF-8
STATUS=1
HOME=/root
PATH=/sbin:/bin:/usr/sbin:/usr/bin:/usr/local/sbin:/usr/local/bin:/root/bin
MAKE_OBJDIR_CHECK_WRITABLE=0
LOCALBASE=/usr/local
USER=root
POUDRIERE_NAME=poudriere-git
LIBEXECPREFIX=/usr/local/libexec/poudriere
POUDRIERE_VERSION=3.4.8-3-gd92fb7c0
MASTERMNT=/usr/local/poudriere/data/.m/main-amd64-default/ref
LC_COLLATE=C
POUDRIERE_BUILD_TYPE=bulk
PACKAGE_BUILDING=yes
SAVED_TERM=
OUTPUT_REDIRECTED_STDERR=4
OUTPUT_REDIRECTED=1
PWD=/usr/local/poudriere/data/.m/main-amd64-default/29/.p
OUTPUT_REDIRECTED_STDOUT=3
P_PORTS_FEATURES=FLAVORS SUBPACKAGES SELECTED_OPTIONS
MASTERNAME=main-amd64-default
SCRIPTPREFIX=/usr/local/share/poudriere
SCRIPTNAME=bulk.sh
OLDPWD=/usr/local/poudriere/data/.m/main-amd64-default/ref/.p/pool
POUDRIERE_PKGNAME=poudriere-git-3.4.8-3-gd92fb7c0
SCRIPTPATH=/usr/local/share/poudriere/bulk.sh
POUDRIEREPATH=/usr/local/bin/poudriere
---End Environment---
---Begin Poudriere Port Flags/Env---
PORT_FLAGS=
PKGENV=
FLAVOR=
MAKE_ARGS=
---End Poudriere Port Flags/Env---
---Begin OPTIONS List---
===> The following configuration options are available for dpdk20.11-20.11.8.1600027:
DEBUG=off: Debugging support (unoptimized build, impacts performance)
EXAMPLES=on: Build and/or install examples
TESTS=off: Build the automated unit test binary
TOOLS=on: Install tool scripts
===> Use 'make config' to modify these settings
---End OPTIONS List---
--MAINTAINER--
bruce.richardson@intel.com
--End MAINTAINER--
--CONFIGURE_ARGS--
setup --prefix /usr/local --localstatedir /var --infodir share/info --auto-features=enabled -Dpython.bytecompile=-1 -Db_colorout=never --buildtype release --optimization plain --strip -Ddefault_library=shared -Denable_kmods=true -Dc_link_args=-Wl,--undefined-version -Dmachine=default --buildtype=release -Dexamples=all -Dtests=false _build
--End CONFIGURE_ARGS--
--CONFIGURE_ENV--
PKG_CONFIG=pkgconf PYTHON="/usr/local/bin/python3.12" XDG_DATA_HOME=/wrkdirs/usr/ports/net/dpdk-20.11/work XDG_CONFIG_HOME=/wrkdirs/usr/ports/net/dpdk-20.11/work XDG_CACHE_HOME=/wrkdirs/usr/ports/net/dpdk-20.11/work/.cache HOME=/wrkdirs/usr/ports/net/dpdk-20.11/work TMPDIR="/tmp" PATH=/wrkdirs/usr/ports/net/dpdk-20.11/work/.bin:/sbin:/bin:/usr/sbin:/usr/bin:/usr/local/sbin:/usr/local/bin:/root/bin PKG_CONFIG_LIBDIR=/wrkdirs/usr/ports/net/dpdk-20.11/work/.pkgconfig:/usr/local/libdata/pkgconfig:/usr/local/share/pkgconfig:/usr/libdata/pkgconfig SHELL=/bin/sh CONFIG_SHELL=/bin/sh
--End CONFIGURE_ENV--
--MAKE_ENV--
KMODDIR="/boot/modules" SYSDIR="/usr/src/sys" NO_XREF=yes NINJA_STATUS="[%p %s/%t] " XDG_DATA_HOME=/wrkdirs/usr/ports/net/dpdk-20.11/work XDG_CONFIG_HOME=/wrkdirs/usr/ports/net/dpdk-20.11/work XDG_CACHE_HOME=/wrkdirs/usr/ports/net/dpdk-20.11/work/.cache HOME=/wrkdirs/usr/ports/net/dpdk-20.11/work TMPDIR="/tmp" PATH=/wrkdirs/usr/ports/net/dpdk-20.11/work/.bin:/sbin:/bin:/usr/sbin:/usr/bin:/usr/local/sbin:/usr/local/bin:/root/bin PKG_CONFIG_LIBDIR=/wrkdirs/usr/ports/net/dpdk-20.11/work/.pkgconfig:/usr/local/libdata/pkgconfig:/usr/local/share/pkgconfig:/usr/libdata/pkgconfig MK_DEBUG_FILES=no MK_KERNEL_SYMBOLS=no SHELL=/bin/sh NO_LINT=YES DESTDIR=/wrkdirs/usr/ports/net/dpdk-20.11/work/stage PREFIX=/usr/local LOCALBASE=/usr/local CC="cc" CFLAGS="-O2 -pipe -fno-strict-aliasing " CPP="cpp" CPPFLAGS="" LDFLAGS=" " LIBS="" CXX="c++" CXXFLAGS="-O2 -pipe -fno-strict-aliasing " BSD_INSTALL_PROGRAM="install -s -m 555" BSD_INSTALL_LIB="install -s -m 0644" BSD_INSTALL_SCRIP
T="install -m 555" BSD_INSTALL_DATA="install -m 0644" BSD_INSTALL_MAN="install -m 444"
--End MAKE_ENV--
--PLIST_SUB--
PORTEXAMPLES="" DEBUG="@comment " NO_DEBUG="" EXAMPLES="" NO_EXAMPLES="@comment " TESTS="@comment " NO_TESTS="" TOOLS="" NO_TOOLS="@comment " KMODDIR="boot/modules" PYTHON_INCLUDEDIR=include/python3.12 PYTHON_LIBDIR=lib/python3.12 PYTHON_PLATFORM=freebsd16 PYTHON_SITELIBDIR=lib/python3.12/site-packages PYTHON_SUFFIX=312 PYTHON_BASESUFFIX=312 PYTHON_TAG=.cpython-312 PYTHON_SOABI=.cpython-312 PYTHON_VER=3.12 PYTHON_BASEVER=3.12 PYTHON_VERSION=python3.12 PYTHON2="@comment " PYTHON3="" OSREL=16.0 PREFIX=%D LOCALBASE=/usr/local RESETPREFIX=/usr/local LIB32DIR=lib DOCSDIR="share/doc/dpdk" EXAMPLESDIR="share/examples/dpdk" DATADIR="share/dpdk" WWWDIR="www/dpdk" ETCDIR="etc/dpdk"
--End PLIST_SUB--
--SUB_LIST--
DEBUG="@comment " NO_DEBUG="" EXAMPLES="" NO_EXAMPLES="@comment " TESTS="@comment " NO_TESTS="" TOOLS="" NO_TOOLS="@comment " PYTHON_INCLUDEDIR=/usr/local/include/python3.12 PYTHON_LIBDIR=/usr/local/lib/python3.12 PYTHON_PLATFORM=freebsd16 PYTHON_SITELIBDIR=/usr/local/lib/python3.12/site-packages PYTHON_SUFFIX=312 PYTHON_BASESUFFIX=312 PYTHON_TAG=.cpython-312 PYTHON_SOABI=.cpython-312 PYTHON_VER=3.12 PYTHON_BASEVER=3.12 PYTHON_VERSION=python3.12 PYTHON2="@comment " PYTHON3="" PREFIX=/usr/local LOCALBASE=/usr/local DATADIR=/usr/local/share/dpdk DOCSDIR=/usr/local/share/doc/dpdk EXAMPLESDIR=/usr/local/share/examples/dpdk WWWDIR=/usr/local/www/dpdk ETCDIR=/usr/local/etc/dpdk
--End SUB_LIST--
---Begin make.conf---
USE_PACKAGE_DEPENDS=yes
BATCH=yes
WRKDIRPREFIX=/wrkdirs
PORTSDIR=/usr/ports
PACKAGES=/packages
DISTDIR=/distfiles
PACKAGE_BUILDING=yes
PACKAGE_BUILDING_FLAVORS=yes
#### ####
# XXX: We really need this but cannot use it while 'make checksum' does not
# try the next mirror on checksum failure. It currently retries the same
# failed mirror and then fails rather then trying another. It *does*
# try the next if the size is mismatched though.
#MASTER_SITE_FREEBSD=yes
# Build ALLOW_MAKE_JOBS_PACKAGES with 3 jobs
MAKE_JOBS_NUMBER=3
#### Misc Poudriere ####
.include "/etc/make.conf.ports_env"
GID=0
UID=0
---End make.conf---
--Resource limits--
cpu time (seconds, -t) unlimited
file size (512-blocks, -f) unlimited
data seg size (kbytes, -d) 33554432
stack size (kbytes, -s) 524288
core file size (512-blocks, -c) unlimited
max memory size (kbytes, -m) unlimited
locked memory (kbytes, -l) unlimited
max user processes (-u) 89999
open files (-n) 8192
virtual mem size (kbytes, -v) unlimited
swap limit (kbytes, -w) unlimited
socket buffer size (bytes, -b) unlimited
pseudo-terminals (-p) unlimited
kqueues (-k) unlimited
umtx shared locks (-o) unlimited
pipebuf (kbytes, -y) unlimited
virtual machines (-V) unlimited
--End resource limits--
=======================<phase: check-sanity >============================
===== env: NO_DEPENDS=yes USER=root UID=0 GID=0
===> License BSD3CLAUSE accepted by the user
===========================================================================
=======================<phase: pkg-depends >============================
===== env: USE_PACKAGE_DEPENDS_ONLY=1 USER=root UID=0 GID=0
===> dpdk20.11-20.11.8.1600027 depends on file: /usr/local/sbin/pkg - not found
===> Installing existing package /packages/All/pkg-2.8.4.pkg
[main-amd64-default-job-29] Installing pkg-2.8.4...
[main-amd64-default-job-29] Extracting pkg-2.8.4: .......... done
===> dpdk20.11-20.11.8.1600027 depends on file: /usr/local/sbin/pkg - found
===> Returning to build of dpdk20.11-20.11.8.1600027
===========================================================================
=======================<phase: fetch-depends >============================
===== env: USE_PACKAGE_DEPENDS_ONLY=1 USER=root UID=0 GID=0
===========================================================================
=======================<phase: fetch >============================
===== env: NO_DEPENDS=yes USER=root UID=0 GID=0
===> License BSD3CLAUSE accepted by the user
===> Fetching all distfiles required by dpdk20.11-20.11.8.1600027 for building
===========================================================================
=======================<phase: checksum >============================
===== env: NO_DEPENDS=yes USER=root UID=0 GID=0
===> License BSD3CLAUSE accepted by the user
===> Fetching all distfiles required by dpdk20.11-20.11.8.1600027 for building
=> SHA256 Checksum OK for dpdk-20.11.8.tar.xz.
===========================================================================
=======================<phase: extract-depends>============================
===== env: USE_PACKAGE_DEPENDS_ONLY=1 USER=root UID=0 GID=0
===========================================================================
=======================<phase: extract >============================
===== env: NO_DEPENDS=yes USER=root UID=0 GID=0
===> License BSD3CLAUSE accepted by the user
===> Fetching all distfiles required by dpdk20.11-20.11.8.1600027 for building
===> Extracting for dpdk20.11-20.11.8.1600027
=> SHA256 Checksum OK for dpdk-20.11.8.tar.xz.
===========================================================================
=======================<phase: patch-depends >============================
===== env: USE_PACKAGE_DEPENDS_ONLY=1 USER=root UID=0 GID=0
===========================================================================
=======================<phase: patch >============================
===== env: NO_DEPENDS=yes USER=root UID=0 GID=0
===> Patching for dpdk20.11-20.11.8.1600027
===> Applying FreeBSD patches for dpdk20.11-20.11.8.1600027 from /usr/ports/net/dpdk-20.11/files
===========================================================================
=======================<phase: build-depends >============================
===== env: USE_PACKAGE_DEPENDS_ONLY=1 USER=root UID=0 GID=0
===> dpdk20.11-20.11.8.1600027 depends on executable: objdump - found
===> dpdk20.11-20.11.8.1600027 depends on executable: meson - not found
===> Installing existing package /packages/All/meson-1.12.1,1.pkg
[main-amd64-default-job-29] Installing meson-1.12.1,1...
[main-amd64-default-job-29] `-- Installing ninja-1.13.2,4...
[main-amd64-default-job-29] | `-- Installing python312-3.12.14_1...
[main-amd64-default-job-29] | | `-- Installing expat-2.9.0...
[main-amd64-default-job-29] | | `-- Extracting expat-2.9.0: .......... done
<snip>
../lib/librte_ethdev/rte_flow.h:1129:9: warning: initializer-string for character array is too long, array size is 3 but initializer has size 4 (including the null terminating character); did you mean to use the 'nonstring' attribute? [-Wunterminated-string-initialization]
1129 | .vni = "\xff\xff\xff",
| ^~~~~~~~~~~~~~
../lib/librte_ethdev/rte_flow.h:1149:9: warning: initializer-string for character array is too long, array size is 3 but initializer has size 4 (including the null terminating character); did you mean to use the 'nonstring' attribute? [-Wunterminated-string-initialization]
1149 | .vni = "\xff\xff\xff",
| ^~~~~~~~~~~~~~
../lib/librte_ethdev/rte_flow.h:1174:20: warning: initializer-string for character array is too long, array size is 6 but initializer has size 7 (including the null terminating character); did you mean to use the 'nonstring' attribute? [-Wunterminated-string-initialization]
1174 | .sha.addr_bytes = "\xff\xff\xff\xff\xff\xff",
| ^~~~~~~~~~~~~~~~~~~~~~~~~~
../lib/librte_ethdev/rte_flow.h:1176:20: warning: initializer-string for character array is too long, array size is 6 but initializer has size 7 (including the null terminating character); did you mean to use the 'nonstring' attribute? [-Wunterminated-string-initialization]
1176 | .tha.addr_bytes = "\xff\xff\xff\xff\xff\xff",
| ^~~~~~~~~~~~~~~~~~~~~~~~~~
../lib/librte_ethdev/rte_flow.h:1254:3: warning: initializer-string for character array is too long, array size is 16 but initializer has size 17 (including the null terminating character); did you mean to use the 'nonstring' attribute? [-Wunterminated-string-initialization]
1254 | "\xff\xff\xff\xff\xff\xff\xff\xff"
| ^~~~~~~~~~~~~~~~~~~~~~~~~~~~~~~~~~
1255 | "\xff\xff\xff\xff\xff\xff\xff\xff",
| ~~~~~~~~~~~~~~~~~~~~~~~~~~~~~~~~~~
../lib/librte_ethdev/rte_flow.h:1281:3: warning: initializer-string for character array is too long, array size is 16 but initializer has size 17 (including the null terminating character); did you mean to use the 'nonstring' attribute? [-Wunterminated-string-initialization]
1281 | "\xff\xff\xff\xff\xff\xff\xff\xff"
| ^~~~~~~~~~~~~~~~~~~~~~~~~~~~~~~~~~
1282 | "\xff\xff\xff\xff\xff\xff\xff\xff",
| ~~~~~~~~~~~~~~~~~~~~~~~~~~~~~~~~~~
../lib/librte_ethdev/rte_flow.h:1331:20: warning: initializer-string for character array is too long, array size is 6 but initializer has size 7 (including the null terminating character); did you mean to use the 'nonstring' attribute? [-Wunterminated-string-initialization]
1331 | .sla.addr_bytes = "\xff\xff\xff\xff\xff\xff",
| ^~~~~~~~~~~~~~~~~~~~~~~~~~
../lib/librte_ethdev/rte_flow.h:1356:20: warning: initializer-string for character array is too long, array size is 6 but initializer has size 7 (including the null terminating character); did you mean to use the 'nonstring' attribute? [-Wunterminated-string-initialization]
1356 | .tla.addr_bytes = "\xff\xff\xff\xff\xff\xff",
| ^~~~~~~~~~~~~~~~~~~~~~~~~~
15 warnings generated.
[ 93% 1794/1924] cc -Iexamples/dpdk-vmdq.p -Iexamples -I../examples -Iexamples/vmdq -I../examples/vmdq -I. -I.. -Iconfig -I../config -Ilib/librte_eal/include -I../lib/librte_eal/include -Ilib/librte_eal/freebsd/include -I../lib/librte_eal/freebsd/include -Ilib/librte_eal/x86/include -I../lib/librte_eal/x86/include -Ilib/librte_eal/common -I../lib/librte_eal/common -Ilib/librte_eal -I../lib/librte_eal -Ilib/librte_kvargs -I../lib/librte_kvargs -Ilib/librte_metrics -I../lib/librte_metrics -Ilib/librte_telemetry -I../lib/librte_telemetry -Ilib/librte_mempool -I../lib/librte_mempool -Ilib/librte_ring -I../lib/librte_ring -Ilib/librte_net -I../lib/librte_net -Ilib/librte_mbuf -I../lib/librte_mbuf -Ilib/librte_ethdev -I../lib/librte_ethdev -Ilib/librte_meter -I../lib/librte_meter -Ilib/librte_cmdline -I../lib/librte_cmdline -fdiagnostics-color=never -D_FILE_OFFSET_BITS=64 -Wall -Winvalid-pch -Wextra -include rte_config.h -Wcast-qual -Wdeprecated -Wformat -Wformat-nonliteral -Wform
at-security -Wmissing-declarations -Wmissing-prototypes -Wnested-externs -Wold-style-definition -Wpointer-arith -Wsign-compare -Wstrict-prototypes -Wundef -Wwrite-strings -Wno-address-of-packed-member -Wno-missing-field-initializers -D_GNU_SOURCE -D__BSD_VISIBLE -O2 -pipe -fno-strict-aliasing -march=corei7 -Wno-format-truncation -DALLOW_EXPERIMENTAL_API -MD -MQ examples/dpdk-vmdq.p/vmdq_main.c.o -MF examples/dpdk-vmdq.p/vmdq_main.c.o.d -o examples/dpdk-vmdq.p/vmdq_main.c.o -c ../examples/vmdq/main.c
In file included from ../examples/vmdq/main.c:33:
In file included from ../lib/librte_ethdev/rte_ethdev.h:1226:
In file included from ../lib/librte_ethdev/rte_eth_ctrl.h:11:
../lib/librte_ethdev/rte_flow.h:747:20: warning: initializer-string for character array is too long, array size is 6 but initializer has size 7 (including the null terminating character); did you mean to use the 'nonstring' attribute? [-Wunterminated-string-initialization]
747 | .dst.addr_bytes = "\xff\xff\xff\xff\xff\xff",
| ^~~~~~~~~~~~~~~~~~~~~~~~~~
../lib/librte_ethdev/rte_flow.h:748:20: warning: initializer-string for character array is too long, array size is 6 but initializer has size 7 (including the null terminating character); did you mean to use the 'nonstring' attribute? [-Wunterminated-string-initialization]
748 | .src.addr_bytes = "\xff\xff\xff\xff\xff\xff",
| ^~~~~~~~~~~~~~~~~~~~~~~~~~
../lib/librte_ethdev/rte_flow.h:841:4: warning: initializer-string for character array is too long, array size is 16 but initializer has size 17 (including the null terminating character); did you mean to use the 'nonstring' attribute? [-Wunterminated-string-initialization]
841 | "\xff\xff\xff\xff\xff\xff\xff\xff"
| ^~~~~~~~~~~~~~~~~~~~~~~~~~~~~~~~~~
842 | "\xff\xff\xff\xff\xff\xff\xff\xff",
| ~~~~~~~~~~~~~~~~~~~~~~~~~~~~~~~~~~
../lib/librte_ethdev/rte_flow.h:844:4: warning: initializer-string for character array is too long, array size is 16 but initializer has size 17 (including the null terminating character); did you mean to use the 'nonstring' attribute? [-Wunterminated-string-initialization]
844 | "\xff\xff\xff\xff\xff\xff\xff\xff"
| ^~~~~~~~~~~~~~~~~~~~~~~~~~~~~~~~~~
845 | "\xff\xff\xff\xff\xff\xff\xff\xff",
| ~~~~~~~~~~~~~~~~~~~~~~~~~~~~~~~~~~
../lib/librte_ethdev/rte_flow.h:941:9: warning: initializer-string for character array is too long, array size is 3 but initializer has size 4 (including the null terminating character); did you mean to use the 'nonstring' attribute? [-Wunterminated-string-initialization]
941 | .vni = "\xff\xff\xff",
| ^~~~~~~~~~~~~~
../lib/librte_ethdev/rte_flow.h:994:9: warning: initializer-string for character array is too long, array size is 3 but initializer has size 4 (including the null terminating character); did you mean to use the 'nonstring' attribute? [-Wunterminated-string-initialization]
994 | .tni = "\xff\xff\xff",
| ^~~~~~~~~~~~~~
../lib/librte_ethdev/rte_flow.h:1014:16: warning: initializer-string for character array is too long, array size is 3 but initializer has size 4 (including the null terminating character); did you mean to use the 'nonstring' attribute? [-Wunterminated-string-initialization]
1014 | .label_tc_s = "\xff\xff\xf0",
| ^~~~~~~~~~~~~~
../lib/librte_ethdev/rte_flow.h:1129:9: warning: initializer-string for character array is too long, array size is 3 but initializer has size 4 (including the null terminating character); did you mean to use the 'nonstring' attribute? [-Wunterminated-string-initialization]
1129 | .vni = "\xff\xff\xff",
| ^~~~~~~~~~~~~~
../lib/librte_ethdev/rte_flow.h:1149:9: warning: initializer-string for character array is too long, array size is 3 but initializer has size 4 (including the null terminating character); did you mean to use the 'nonstring' attribute? [-Wunterminated-string-initialization]
1149 | .vni = "\xff\xff\xff",
| ^~~~~~~~~~~~~~
../lib/librte_ethdev/rte_flow.h:1174:20: warning: initializer-string for character array is too long, array size is 6 but initializer has size 7 (including the null terminating character); did you mean to use the 'nonstring' attribute? [-Wunterminated-string-initialization]
1174 | .sha.addr_bytes = "\xff\xff\xff\xff\xff\xff",
| ^~~~~~~~~~~~~~~~~~~~~~~~~~
../lib/librte_ethdev/rte_flow.h:1176:20: warning: initializer-string for character array is too long, array size is 6 but initializer has size 7 (including the null terminating character); did you mean to use the 'nonstring' attribute? [-Wunterminated-string-initialization]
1176 | .tha.addr_bytes = "\xff\xff\xff\xff\xff\xff",
| ^~~~~~~~~~~~~~~~~~~~~~~~~~
../lib/librte_ethdev/rte_flow.h:1254:3: warning: initializer-string for character array is too long, array size is 16 but initializer has size 17 (including the null terminating character); did you mean to use the 'nonstring' attribute? [-Wunterminated-string-initialization]
1254 | "\xff\xff\xff\xff\xff\xff\xff\xff"
| ^~~~~~~~~~~~~~~~~~~~~~~~~~~~~~~~~~
1255 | "\xff\xff\xff\xff\xff\xff\xff\xff",
| ~~~~~~~~~~~~~~~~~~~~~~~~~~~~~~~~~~
../lib/librte_ethdev/rte_flow.h:1281:3: warning: initializer-string for character array is too long, array size is 16 but initializer has size 17 (including the null terminating character); did you mean to use the 'nonstring' attribute? [-Wunterminated-string-initialization]
1281 | "\xff\xff\xff\xff\xff\xff\xff\xff"
| ^~~~~~~~~~~~~~~~~~~~~~~~~~~~~~~~~~
1282 | "\xff\xff\xff\xff\xff\xff\xff\xff",
| ~~~~~~~~~~~~~~~~~~~~~~~~~~~~~~~~~~
../lib/librte_ethdev/rte_flow.h:1331:20: warning: initializer-string for character array is too long, array size is 6 but initializer has size 7 (including the null terminating character); did you mean to use the 'nonstring' attribute? [-Wunterminated-string-initialization]
1331 | .sla.addr_bytes = "\xff\xff\xff\xff\xff\xff",
| ^~~~~~~~~~~~~~~~~~~~~~~~~~
../lib/librte_ethdev/rte_flow.h:1356:20: warning: initializer-string for character array is too long, array size is 6 but initializer has size 7 (including the null terminating character); did you mean to use the 'nonstring' attribute? [-Wunterminated-string-initialization]
1356 | .tla.addr_bytes = "\xff\xff\xff\xff\xff\xff",
| ^~~~~~~~~~~~~~~~~~~~~~~~~~
15 warnings generated.
[ 93% 1795/1924] rm -f lib/librte_net/libnet_crc_sse42_lib.a && llvm-ar csrDT lib/librte_net/libnet_crc_sse42_lib.a lib/librte_net/libnet_crc_sse42_lib.a.p/net_crc_sse.c.o
[ 93% 1796/1924] rm -f lib/librte_net/libnet_crc_avx512_lib.a && llvm-ar csrDT lib/librte_net/libnet_crc_avx512_lib.a lib/librte_net/libnet_crc_avx512_lib.a.p/net_crc_avx512.c.o
[ 93% 1797/1924] rm -f lib/librte_acl/libavx2_tmp.a && llvm-ar csrDT lib/librte_acl/libavx2_tmp.a lib/librte_acl/libavx2_tmp.a.p/acl_run_avx2.c.o
[ 93% 1798/1924] rm -f lib/librte_acl/libavx512_tmp.a && llvm-ar csrDT lib/librte_acl/libavx512_tmp.a lib/librte_acl/libavx512_tmp.a.p/acl_run_avx512.c.o
[ 93% 1799/1924] cc -Iexamples/dpdk-vmdq_dcb.p -Iexamples -I../examples -Iexamples/vmdq_dcb -I../examples/vmdq_dcb -I. -I.. -Iconfig -I../config -Ilib/librte_eal/include -I../lib/librte_eal/include -Ilib/librte_eal/freebsd/include -I../lib/librte_eal/freebsd/include -Ilib/librte_eal/x86/include -I../lib/librte_eal/x86/include -Ilib/librte_eal/common -I../lib/librte_eal/common -Ilib/librte_eal -I../lib/librte_eal -Ilib/librte_kvargs -I../lib/librte_kvargs -Ilib/librte_metrics -I../lib/librte_metrics -Ilib/librte_telemetry -I../lib/librte_telemetry -Ilib/librte_mempool -I../lib/librte_mempool -Ilib/librte_ring -I../lib/librte_ring -Ilib/librte_net -I../lib/librte_net -Ilib/librte_mbuf -I../lib/librte_mbuf -Ilib/librte_ethdev -I../lib/librte_ethdev -Ilib/librte_meter -I../lib/librte_meter -Ilib/librte_cmdline -I../lib/librte_cmdline -fdiagnostics-color=never -D_FILE_OFFSET_BITS=64 -Wall -Winvalid-pch -Wextra -include rte_config.h -Wcast-qual -Wdeprecated -Wformat -Wformat-nonli
teral -Wformat-security -Wmissing-declarations -Wmissing-prototypes -Wnested-externs -Wold-style-definition -Wpointer-arith -Wsign-compare -Wstrict-prototypes -Wundef -Wwrite-strings -Wno-address-of-packed-member -Wno-missing-field-initializers -D_GNU_SOURCE -D__BSD_VISIBLE -O2 -pipe -fno-strict-aliasing -march=corei7 -Wno-format-truncation -DALLOW_EXPERIMENTAL_API -MD -MQ examples/dpdk-vmdq_dcb.p/vmdq_dcb_main.c.o -MF examples/dpdk-vmdq_dcb.p/vmdq_dcb_main.c.o.d -o examples/dpdk-vmdq_dcb.p/vmdq_dcb_main.c.o -c ../examples/vmdq_dcb/main.c
In file included from ../examples/vmdq_dcb/main.c:33:
In file included from ../lib/librte_ethdev/rte_ethdev.h:1226:
In file included from ../lib/librte_ethdev/rte_eth_ctrl.h:11:
../lib/librte_ethdev/rte_flow.h:747:20: warning: initializer-string for character array is too long, array size is 6 but initializer has size 7 (including the null terminating character); did you mean to use the 'nonstring' attribute? [-Wunterminated-string-initialization]
747 | .dst.addr_bytes = "\xff\xff\xff\xff\xff\xff",
| ^~~~~~~~~~~~~~~~~~~~~~~~~~
../lib/librte_ethdev/rte_flow.h:748:20: warning: initializer-string for character array is too long, array size is 6 but initializer has size 7 (including the null terminating character); did you mean to use the 'nonstring' attribute? [-Wunterminated-string-initialization]
748 | .src.addr_bytes = "\xff\xff\xff\xff\xff\xff",
| ^~~~~~~~~~~~~~~~~~~~~~~~~~
../lib/librte_ethdev/rte_flow.h:841:4: warning: initializer-string for character array is too long, array size is 16 but initializer has size 17 (including the null terminating character); did you mean to use the 'nonstring' attribute? [-Wunterminated-string-initialization]
841 | "\xff\xff\xff\xff\xff\xff\xff\xff"
| ^~~~~~~~~~~~~~~~~~~~~~~~~~~~~~~~~~
842 | "\xff\xff\xff\xff\xff\xff\xff\xff",
| ~~~~~~~~~~~~~~~~~~~~~~~~~~~~~~~~~~
../lib/librte_ethdev/rte_flow.h:844:4: warning: initializer-string for character array is too long, array size is 16 but initializer has size 17 (including the null terminating character); did you mean to use the 'nonstring' attribute? [-Wunterminated-string-initialization]
844 | "\xff\xff\xff\xff\xff\xff\xff\xff"
| ^~~~~~~~~~~~~~~~~~~~~~~~~~~~~~~~~~
845 | "\xff\xff\xff\xff\xff\xff\xff\xff",
| ~~~~~~~~~~~~~~~~~~~~~~~~~~~~~~~~~~
../lib/librte_ethdev/rte_flow.h:941:9: warning: initializer-string for character array is too long, array size is 3 but initializer has size 4 (including the null terminating character); did you mean to use the 'nonstring' attribute? [-Wunterminated-string-initialization]
941 | .vni = "\xff\xff\xff",
| ^~~~~~~~~~~~~~
../lib/librte_ethdev/rte_flow.h:994:9: warning: initializer-string for character array is too long, array size is 3 but initializer has size 4 (including the null terminating character); did you mean to use the 'nonstring' attribute? [-Wunterminated-string-initialization]
994 | .tni = "\xff\xff\xff",
| ^~~~~~~~~~~~~~
../lib/librte_ethdev/rte_flow.h:1014:16: warning: initializer-string for character array is too long, array size is 3 but initializer has size 4 (including the null terminating character); did you mean to use the 'nonstring' attribute? [-Wunterminated-string-initialization]
1014 | .label_tc_s = "\xff\xff\xf0",
| ^~~~~~~~~~~~~~
../lib/librte_ethdev/rte_flow.h:1129:9: warning: initializer-string for character array is too long, array size is 3 but initializer has size 4 (including the null terminating character); did you mean to use the 'nonstring' attribute? [-Wunterminated-string-initialization]
1129 | .vni = "\xff\xff\xff",
| ^~~~~~~~~~~~~~
../lib/librte_ethdev/rte_flow.h:1149:9: warning: initializer-string for character array is too long, array size is 3 but initializer has size 4 (including the null terminating character); did you mean to use the 'nonstring' attribute? [-Wunterminated-string-initialization]
1149 | .vni = "\xff\xff\xff",
| ^~~~~~~~~~~~~~
../lib/librte_ethdev/rte_flow.h:1174:20: warning: initializer-string for character array is too long, array size is 6 but initializer has size 7 (including the null terminating character); did you mean to use the 'nonstring' attribute? [-Wunterminated-string-initialization]
1174 | .sha.addr_bytes = "\xff\xff\xff\xff\xff\xff",
| ^~~~~~~~~~~~~~~~~~~~~~~~~~
../lib/librte_ethdev/rte_flow.h:1176:20: warning: initializer-string for character array is too long, array size is 6 but initializer has size 7 (including the null terminating character); did you mean to use the 'nonstring' attribute? [-Wunterminated-string-initialization]
1176 | .tha.addr_bytes = "\xff\xff\xff\xff\xff\xff",
| ^~~~~~~~~~~~~~~~~~~~~~~~~~
../lib/librte_ethdev/rte_flow.h:1254:3: warning: initializer-string for character array is too long, array size is 16 but initializer has size 17 (including the null terminating character); did you mean to use the 'nonstring' attribute? [-Wunterminated-string-initialization]
1254 | "\xff\xff\xff\xff\xff\xff\xff\xff"
| ^~~~~~~~~~~~~~~~~~~~~~~~~~~~~~~~~~
1255 | "\xff\xff\xff\xff\xff\xff\xff\xff",
| ~~~~~~~~~~~~~~~~~~~~~~~~~~~~~~~~~~
../lib/librte_ethdev/rte_flow.h:1281:3: warning: initializer-string for character array is too long, array size is 16 but initializer has size 17 (including the null terminating character); did you mean to use the 'nonstring' attribute? [-Wunterminated-string-initialization]
1281 | "\xff\xff\xff\xff\xff\xff\xff\xff"
| ^~~~~~~~~~~~~~~~~~~~~~~~~~~~~~~~~~
1282 | "\xff\xff\xff\xff\xff\xff\xff\xff",
| ~~~~~~~~~~~~~~~~~~~~~~~~~~~~~~~~~~
../lib/librte_ethdev/rte_flow.h:1331:20: warning: initializer-string for character array is too long, array size is 6 but initializer has size 7 (including the null terminating character); did you mean to use the 'nonstring' attribute? [-Wunterminated-string-initialization]
1331 | .sla.addr_bytes = "\xff\xff\xff\xff\xff\xff",
| ^~~~~~~~~~~~~~~~~~~~~~~~~~
../lib/librte_ethdev/rte_flow.h:1356:20: warning: initializer-string for character array is too long, array size is 6 but initializer has size 7 (including the null terminating character); did you mean to use the 'nonstring' attribute? [-Wunterminated-string-initialization]
1356 | .tla.addr_bytes = "\xff\xff\xff\xff\xff\xff",
| ^~~~~~~~~~~~~~~~~~~~~~~~~~
15 warnings generated.
[ 93% 1800/1924] cc -o lib/librte_distributor.so.21.0 lib/librte_distributor.a.p/librte_distributor_rte_distributor.c.o lib/librte_distributor.a.p/librte_distributor_rte_distributor_single.c.o lib/librte_distributor.a.p/librte_distributor_rte_distributor_match_sse.c.o -Wl,--as-needed -Wl,--no-undefined -shared -fPIC -Wl,-soname,librte_distributor.so.21 -Wl,--no-as-needed -pthread -Wl,--start-group -lm -lexecinfo -Wl,--undefined-version -O2 -pipe -fno-strict-aliasing '-Wl,-rpath,$ORIGIN/' lib/librte_eal.so.21.0 lib/librte_kvargs.so.21.0 lib/librte_telemetry.so.21.0 lib/librte_mbuf.so.21.0 lib/librte_mempool.so.21.0 lib/librte_ring.so.21.0 -Wl,--end-group -Wl,--version-script=/wrkdirs/usr/ports/net/dpdk-20.11/work/dpdk-stable-20.11.8/lib/librte_distributor/version.map
[ 93% 1801/1924] rm -f lib/librte_fib/libdir24_8_avx512_tmp.a && llvm-ar csrDT lib/librte_fib/libdir24_8_avx512_tmp.a lib/librte_fib/libdir24_8_avx512_tmp.a.p/dir24_8_avx512.c.o
[ 93% 1802/1924] cc -o lib/librte_member.so.21.0 lib/librte_member.a.p/librte_member_rte_member.c.o lib/librte_member.a.p/librte_member_rte_member_ht.c.o lib/librte_member.a.p/librte_member_rte_member_vbf.c.o -Wl,--as-needed -Wl,--no-undefined -shared -fPIC -Wl,-soname,librte_member.so.21 -Wl,--no-as-needed -pthread -Wl,--start-group -lm -lexecinfo -Wl,--undefined-version -O2 -pipe -fno-strict-aliasing '-Wl,-rpath,$ORIGIN/' lib/librte_eal.so.21.0 lib/librte_kvargs.so.21.0 lib/librte_telemetry.so.21.0 lib/librte_hash.so.21.0 lib/librte_ring.so.21.0 lib/librte_rcu.so.21.0 -Wl,--end-group -Wl,--version-script=/wrkdirs/usr/ports/net/dpdk-20.11/work/dpdk-stable-20.11.8/lib/librte_member/version.map
[ 93% 1803/1924] rm -f lib/librte_fib/libtrie_avx512_tmp.a && llvm-ar csrDT lib/librte_fib/libtrie_avx512_tmp.a lib/librte_fib/libtrie_avx512_tmp.a.p/trie_avx512.c.o
[ 93% 1804/1924] rm -f drivers/common/sfc_efx/base/libsfc_base.a && llvm-ar csrDT drivers/common/sfc_efx/base/libsfc_base.a drivers/common/sfc_efx/base/libsfc_base.a.p/efx_bootcfg.c.o drivers/common/sfc_efx/base/libsfc_base.a.p/efx_crc32.c.o drivers/common/sfc_efx/base/libsfc_base.a.p/efx_ev.c.o drivers/common/sfc_efx/base/libsfc_base.a.p/efx_evb.c.o drivers/common/sfc_efx/base/libsfc_base.a.p/efx_filter.c.o drivers/common/sfc_efx/base/libsfc_base.a.p/efx_hash.c.o drivers/common/sfc_efx/base/libsfc_base.a.p/efx_intr.c.o drivers/common/sfc_efx/base/libsfc_base.a.p/efx_lic.c.o drivers/common/sfc_efx/base/libsfc_base.a.p/efx_mac.c.o drivers/common/sfc_efx/base/libsfc_base.a.p/efx_mae.c.o drivers/common/sfc_efx/base/libsfc_base.a.p/efx_mcdi.c.o drivers/common/sfc_efx/base/libsfc_base.a.p/efx_mon.c.o drivers/common/sfc_efx/base/libsfc_base.a.p/efx_nic.c.o drivers/common/sfc_efx/base/libsfc_base.a.p/efx_nvram.c.o drivers/common/sfc_efx/base/libsfc_base.a.p/efx_pci.c.o drivers/comm
on/sfc_efx/base/libsfc_base.a.p/efx_phy.c.o drivers/common/sfc_efx/base/libsfc_base.a.p/efx_port.c.o drivers/common/sfc_efx/base/libsfc_base.a.p/efx_proxy.c.o drivers/common/sfc_efx/base/libsfc_base.a.p/efx_rx.c.o drivers/common/sfc_efx/base/libsfc_base.a.p/efx_sram.c.o drivers/common/sfc_efx/base/libsfc_base.a.p/efx_tunnel.c.o drivers/common/sfc_efx/base/libsfc_base.a.p/efx_tx.c.o drivers/common/sfc_efx/base/libsfc_base.a.p/efx_vpd.c.o drivers/common/sfc_efx/base/libsfc_base.a.p/mcdi_mon.c.o drivers/common/sfc_efx/base/libsfc_base.a.p/siena_mac.c.o drivers/common/sfc_efx/base/libsfc_base.a.p/siena_mcdi.c.o drivers/common/sfc_efx/base/libsfc_base.a.p/siena_nic.c.o drivers/common/sfc_efx/base/libsfc_base.a.p/siena_nvram.c.o drivers/common/sfc_efx/base/libsfc_base.a.p/siena_phy.c.o drivers/common/sfc_efx/base/libsfc_base.a.p/siena_sram.c.o drivers/common/sfc_efx/base/libsfc_base.a.p/siena_vpd.c.o drivers/common/sfc_efx/base/libsfc_base.a.p/ef10_ev.c.o drivers/common/sfc_efx/ba
se/libsfc_base.a.p/ef10_evb.c.o drivers/common/sfc_efx/base/libsfc_base.a.p/ef10_filter.c.o drivers/common/sfc_efx/base/libsfc_base.a.p/ef10_image.c.o drivers/common/sfc_efx/base/libsfc_base.a.p/ef10_intr.c.o drivers/common/sfc_efx/base/libsfc_base.a.p/ef10_mac.c.o drivers/common/sfc_efx/base/libsfc_base.a.p/ef10_mcdi.c.o drivers/common/sfc_efx/base/libsfc_base.a.p/ef10_nic.c.o drivers/common/sfc_efx/base/libsfc_base.a.p/ef10_nvram.c.o drivers/common/sfc_efx/base/libsfc_base.a.p/ef10_phy.c.o drivers/common/sfc_efx/base/libsfc_base.a.p/ef10_proxy.c.o drivers/common/sfc_efx/base/libsfc_base.a.p/ef10_rx.c.o drivers/common/sfc_efx/base/libsfc_base.a.p/ef10_tx.c.o drivers/common/sfc_efx/base/libsfc_base.a.p/ef10_vpd.c.o drivers/common/sfc_efx/base/libsfc_base.a.p/hunt_nic.c.o drivers/common/sfc_efx/base/libsfc_base.a.p/medford_nic.c.o drivers/common/sfc_efx/base/libsfc_base.a.p/medford2_nic.c.o drivers/common/sfc_efx/base/libsfc_base.a.p/rhead_ev.c.o drivers/common/sfc_efx/base/l
ibsfc_base.a.p/rhead_intr.c.o drivers/common/sfc_efx/base/libsfc_base.a.p/rhead_nic.c.o drivers/common/sfc_efx/base/libsfc_base.a.p/rhead_pci.c.o drivers/common/sfc_efx/base/libsfc_base.a.p/rhead_rx.c.o drivers/common/sfc_efx/base/libsfc_base.a.p/rhead_tunnel.c.o drivers/common/sfc_efx/base/libsfc_base.a.p/rhead_tx.c.o
[ 93% 1805/1924] cc -o drivers/librte_common_cpt.so.21.0 drivers/librte_common_cpt.so.21.0.p/meson-generated_.._rte_common_cpt.pmd.c.o drivers/libtmp_rte_common_cpt.a.p/common_cpt_cpt_fpm_tables.c.o drivers/libtmp_rte_common_cpt.a.p/common_cpt_cpt_pmd_ops_helper.c.o -Wl,--as-needed -Wl,--no-undefined -shared -fPIC -Wl,-soname,librte_common_cpt.so.21 -Wl,--no-as-needed -pthread -Wl,--start-group -lm -lexecinfo -Wl,--undefined-version -O2 -pipe -fno-strict-aliasing '-Wl,-rpath,$ORIGIN/../lib' lib/librte_kvargs.so.21.0 lib/librte_pci.so.21.0 lib/librte_eal.so.21.0 lib/librte_telemetry.so.21.0 lib/librte_cryptodev.so.21.0 lib/librte_mbuf.so.21.0 lib/librte_mempool.so.21.0 lib/librte_ring.so.21.0 -Wl,--end-group -Wl,--version-script=/wrkdirs/usr/ports/net/dpdk-20.11/work/dpdk-stable-20.11.8/drivers/common/cpt/version.map
[ 93% 1806/1924] cc -o drivers/librte_bus_ifpga.so.21.0 drivers/librte_bus_ifpga.so.21.0.p/meson-generated_.._rte_bus_ifpga.pmd.c.o drivers/libtmp_rte_bus_ifpga.a.p/bus_ifpga_ifpga_common.c.o drivers/libtmp_rte_bus_ifpga.a.p/bus_ifpga_ifpga_bus.c.o -Wl,--as-needed -Wl,--no-undefined -shared -fPIC -Wl,-soname,librte_bus_ifpga.so.21 -Wl,--no-as-needed -pthread -Wl,--start-group -lm -lexecinfo -Wl,--undefined-version -O2 -pipe -fno-strict-aliasing '-Wl,-rpath,$ORIGIN/../lib' lib/librte_eal.so.21.0 lib/librte_kvargs.so.21.0 lib/librte_telemetry.so.21.0 lib/librte_pci.so.21.0 lib/librte_rawdev.so.21.0 -Wl,--end-group -Wl,--version-script=/wrkdirs/usr/ports/net/dpdk-20.11/work/dpdk-stable-20.11.8/drivers/bus/ifpga/version.map
[ 93% 1807/1924] cc -o drivers/librte_common_qat.so.21.0 drivers/librte_common_qat.so.21.0.p/meson-generated_.._rte_common_qat.pmd.c.o drivers/libtmp_rte_common_qat.a.p/common_qat_qat_common.c.o drivers/libtmp_rte_common_qat.a.p/common_qat_qat_qp.c.o drivers/libtmp_rte_common_qat.a.p/common_qat_qat_device.c.o drivers/libtmp_rte_common_qat.a.p/common_qat_qat_logs.c.o drivers/libtmp_rte_common_qat.a.p/compress_qat_qat_comp_pmd.c.o drivers/libtmp_rte_common_qat.a.p/compress_qat_qat_comp.c.o drivers/libtmp_rte_common_qat.a.p/crypto_qat_qat_sym_pmd.c.o drivers/libtmp_rte_common_qat.a.p/crypto_qat_qat_sym.c.o drivers/libtmp_rte_common_qat.a.p/crypto_qat_qat_sym_session.c.o drivers/libtmp_rte_common_qat.a.p/crypto_qat_qat_sym_hw_dp.c.o drivers/libtmp_rte_common_qat.a.p/crypto_qat_qat_asym_pmd.c.o drivers/libtmp_rte_common_qat.a.p/crypto_qat_qat_asym.c.o -Wl,--as-needed -Wl,--no-undefined -shared -fPIC -Wl,-soname,librte_common_qat.so.21 -Wl,--no-as-needed -pthread -Wl,--start-grou
p -lm -lexecinfo -Wl,--undefined-version -O2 -pipe -fno-strict-aliasing '-Wl,-rpath,$ORIGIN/:$ORIGIN/../lib' drivers/librte_bus_pci.so.21.0 lib/librte_eal.so.21.0 lib/librte_kvargs.so.21.0 lib/librte_telemetry.so.21.0 lib/librte_pci.so.21.0 lib/librte_cryptodev.so.21.0 lib/librte_mbuf.so.21.0 lib/librte_mempool.so.21.0 lib/librte_ring.so.21.0 lib/librte_net.so.21.0 lib/librte_compressdev.so.21.0 lib/librte_security.so.21.0 -Wl,--version-script=/wrkdirs/usr/ports/net/dpdk-20.11/work/dpdk-stable-20.11.8/drivers/common/qat/version.map /usr/lib/libcrypto.so -Wl,--end-group
[ 93% 1808/1924] cc -o drivers/librte_mempool_bucket.so.21.0 drivers/librte_mempool_bucket.so.21.0.p/meson-generated_.._rte_mempool_bucket.pmd.c.o drivers/libtmp_rte_mempool_bucket.a.p/mempool_bucket_rte_mempool_bucket.c.o -Wl,--as-needed -Wl,--no-undefined -shared -fPIC -Wl,-soname,librte_mempool_bucket.so.21 -Wl,--no-as-needed -pthread -Wl,--start-group -lm -lexecinfo -Wl,--undefined-version -O2 -pipe -fno-strict-aliasing '-Wl,-rpath,$ORIGIN/../lib' lib/librte_mempool.so.21.0 lib/librte_eal.so.21.0 lib/librte_kvargs.so.21.0 lib/librte_telemetry.so.21.0 lib/librte_ring.so.21.0 -Wl,--end-group -Wl,--version-script=/wrkdirs/usr/ports/net/dpdk-20.11/work/dpdk-stable-20.11.8/drivers/mempool/bucket/version.map
[ 93% 1809/1924] cc -o drivers/librte_mempool_stack.so.21.0 drivers/librte_mempool_stack.so.21.0.p/meson-generated_.._rte_mempool_stack.pmd.c.o drivers/libtmp_rte_mempool_stack.a.p/mempool_stack_rte_mempool_stack.c.o -Wl,--as-needed -Wl,--no-undefined -shared -fPIC -Wl,-soname,librte_mempool_stack.so.21 -Wl,--no-as-needed -pthread -Wl,--start-group -lm -lexecinfo -Wl,--undefined-version -O2 -pipe -fno-strict-aliasing '-Wl,-rpath,$ORIGIN/../lib' lib/librte_mempool.so.21.0 lib/librte_eal.so.21.0 lib/librte_kvargs.so.21.0 lib/librte_telemetry.so.21.0 lib/librte_ring.so.21.0 lib/librte_stack.so.21.0 -Wl,--end-group -Wl,--version-script=/wrkdirs/usr/ports/net/dpdk-20.11/work/dpdk-stable-20.11.8/drivers/mempool/stack/version.map
[ 93% 1810/1924] cc -o drivers/librte_mempool_ring.so.21.0 drivers/librte_mempool_ring.so.21.0.p/meson-generated_.._rte_mempool_ring.pmd.c.o drivers/libtmp_rte_mempool_ring.a.p/mempool_ring_rte_mempool_ring.c.o -Wl,--as-needed -Wl,--no-undefined -shared -fPIC -Wl,-soname,librte_mempool_ring.so.21 -Wl,--no-as-needed -pthread -Wl,--start-group -lm -lexecinfo -Wl,--undefined-version -O2 -pipe -fno-strict-aliasing '-Wl,-rpath,$ORIGIN/../lib' lib/librte_mempool.so.21.0 lib/librte_eal.so.21.0 lib/librte_kvargs.so.21.0 lib/librte_telemetry.so.21.0 lib/librte_ring.so.21.0 -Wl,--end-group -Wl,--version-script=/wrkdirs/usr/ports/net/dpdk-20.11/work/dpdk-stable-20.11.8/drivers/mempool/ring/version.map
[ 94% 1811/1924] cc -o drivers/librte_net_atlantic.so.21.0 drivers/librte_net_atlantic.so.21.0.p/meson-generated_.._rte_net_atlantic.pmd.c.o drivers/libtmp_rte_net_atlantic.a.p/net_atlantic_atl_rxtx.c.o drivers/libtmp_rte_net_atlantic.a.p/net_atlantic_atl_ethdev.c.o drivers/libtmp_rte_net_atlantic.a.p/net_atlantic_atl_hw_regs.c.o drivers/libtmp_rte_net_atlantic.a.p/net_atlantic_hw_atl_hw_atl_b0.c.o drivers/libtmp_rte_net_atlantic.a.p/net_atlantic_hw_atl_hw_atl_llh.c.o drivers/libtmp_rte_net_atlantic.a.p/net_atlantic_hw_atl_hw_atl_utils_fw2x.c.o drivers/libtmp_rte_net_atlantic.a.p/net_atlantic_hw_atl_hw_atl_utils.c.o drivers/libtmp_rte_net_atlantic.a.p/net_atlantic_rte_pmd_atlantic.c.o -Wl,--as-needed -Wl,--no-undefined -shared -fPIC -Wl,-soname,librte_net_atlantic.so.21 -Wl,--no-as-needed -pthread -Wl,--start-group -lm -lexecinfo -Wl,--undefined-version -O2 -pipe -fno-strict-aliasing '-Wl,-rpath,$ORIGIN/../lib:$ORIGIN/' lib/librte_ethdev.so.21.0 lib/librte_eal.so.21.0 lib/l
ibrte_kvargs.so.21.0 lib/librte_telemetry.so.21.0 lib/librte_net.so.21.0 lib/librte_mbuf.so.21.0 lib/librte_mempool.so.21.0 lib/librte_ring.so.21.0 lib/librte_meter.so.21.0 drivers/librte_bus_pci.so.21.0 lib/librte_pci.so.21.0 drivers/librte_bus_vdev.so.21.0 -Wl,--end-group -Wl,--version-script=/wrkdirs/usr/ports/net/dpdk-20.11/work/dpdk-stable-20.11.8/drivers/net/atlantic/version.map
[ 94% 1812/1924] cc -o drivers/librte_net_ark.so.21.0 drivers/librte_net_ark.so.21.0.p/meson-generated_.._rte_net_ark.pmd.c.o drivers/libtmp_rte_net_ark.a.p/net_ark_ark_ddm.c.o drivers/libtmp_rte_net_ark.a.p/net_ark_ark_ethdev.c.o drivers/libtmp_rte_net_ark.a.p/net_ark_ark_ethdev_rx.c.o drivers/libtmp_rte_net_ark.a.p/net_ark_ark_ethdev_tx.c.o drivers/libtmp_rte_net_ark.a.p/net_ark_ark_mpu.c.o drivers/libtmp_rte_net_ark.a.p/net_ark_ark_pktchkr.c.o drivers/libtmp_rte_net_ark.a.p/net_ark_ark_pktdir.c.o drivers/libtmp_rte_net_ark.a.p/net_ark_ark_pktgen.c.o drivers/libtmp_rte_net_ark.a.p/net_ark_ark_rqp.c.o drivers/libtmp_rte_net_ark.a.p/net_ark_ark_udm.c.o -Wl,--as-needed -Wl,--no-undefined -shared -fPIC -Wl,-soname,librte_net_ark.so.21 -Wl,--no-as-needed -pthread -Wl,--start-group -lm -lexecinfo -Wl,--undefined-version -O2 -pipe -fno-strict-aliasing '-Wl,-rpath,$ORIGIN/../lib:$ORIGIN/' lib/librte_ethdev.so.21.0 lib/librte_eal.so.21.0 lib/librte_kvargs.so.21.0 lib/librte_teleme
try.so.21.0 lib/librte_net.so.21.0 lib/librte_mbuf.so.21.0 lib/librte_mempool.so.21.0 lib/librte_ring.so.21.0 lib/librte_meter.so.21.0 drivers/librte_bus_pci.so.21.0 lib/librte_pci.so.21.0 drivers/librte_bus_vdev.so.21.0 -Wl,--end-group -Wl,--version-script=/wrkdirs/usr/ports/net/dpdk-20.11/work/dpdk-stable-20.11.8/drivers/net/ark/version.map
[ 94% 1813/1924] cc -o drivers/librte_net_bnx2x.so.21.0 drivers/librte_net_bnx2x.so.21.0.p/meson-generated_.._rte_net_bnx2x.pmd.c.o drivers/libtmp_rte_net_bnx2x.a.p/net_bnx2x_bnx2x.c.o drivers/libtmp_rte_net_bnx2x.a.p/net_bnx2x_bnx2x_ethdev.c.o drivers/libtmp_rte_net_bnx2x.a.p/net_bnx2x_bnx2x_rxtx.c.o drivers/libtmp_rte_net_bnx2x.a.p/net_bnx2x_bnx2x_stats.c.o drivers/libtmp_rte_net_bnx2x.a.p/net_bnx2x_bnx2x_vfpf.c.o drivers/libtmp_rte_net_bnx2x.a.p/net_bnx2x_ecore_sp.c.o drivers/libtmp_rte_net_bnx2x.a.p/net_bnx2x_elink.c.o -Wl,--as-needed -Wl,--no-undefined -shared -fPIC -Wl,-soname,librte_net_bnx2x.so.21 -Wl,--no-as-needed -pthread -Wl,--start-group -lm -lexecinfo -Wl,--undefined-version -O2 -pipe -fno-strict-aliasing '-Wl,-rpath,$ORIGIN/../lib:$ORIGIN/' lib/librte_ethdev.so.21.0 lib/librte_eal.so.21.0 lib/librte_kvargs.so.21.0 lib/librte_telemetry.so.21.0 lib/librte_net.so.21.0 lib/librte_mbuf.so.21.0 lib/librte_mempool.so.21.0 lib/librte_ring.so.21.0 lib/librte_meter.so.
21.0 drivers/librte_bus_pci.so.21.0 lib/librte_pci.so.21.0 drivers/librte_bus_vdev.so.21.0 -Wl,--version-script=/wrkdirs/usr/ports/net/dpdk-20.11/work/dpdk-stable-20.11.8/drivers/net/bnx2x/version.map /usr/lib/libz.so -Wl,--end-group
[ 94% 1814/1924] rm -f drivers/net/e1000/base/libe1000_base.a && llvm-ar csrDT drivers/net/e1000/base/libe1000_base.a drivers/net/e1000/base/libe1000_base.a.p/e1000_base.c.o drivers/net/e1000/base/libe1000_base.a.p/e1000_80003es2lan.c.o drivers/net/e1000/base/libe1000_base.a.p/e1000_82540.c.o drivers/net/e1000/base/libe1000_base.a.p/e1000_82541.c.o drivers/net/e1000/base/libe1000_base.a.p/e1000_82542.c.o drivers/net/e1000/base/libe1000_base.a.p/e1000_82543.c.o drivers/net/e1000/base/libe1000_base.a.p/e1000_82571.c.o drivers/net/e1000/base/libe1000_base.a.p/e1000_82575.c.o drivers/net/e1000/base/libe1000_base.a.p/e1000_api.c.o drivers/net/e1000/base/libe1000_base.a.p/e1000_i210.c.o drivers/net/e1000/base/libe1000_base.a.p/e1000_ich8lan.c.o drivers/net/e1000/base/libe1000_base.a.p/e1000_mac.c.o drivers/net/e1000/base/libe1000_base.a.p/e1000_manage.c.o drivers/net/e1000/base/libe1000_base.a.p/e1000_mbx.c.o drivers/net/e1000/base/libe1000_base.a.p/e1000_nvm.c.o drivers/net/e1000
/base/libe1000_base.a.p/e1000_osdep.c.o drivers/net/e1000/base/libe1000_base.a.p/e1000_phy.c.o drivers/net/e1000/base/libe1000_base.a.p/e1000_vf.c.o
[ 94% 1815/1924] cc -o drivers/librte_net_e1000.so.21.0 drivers/librte_net_e1000.so.21.0.p/meson-generated_.._rte_net_e1000.pmd.c.o drivers/net/e1000/base/libe1000_base.a.p/e1000_base.c.o drivers/net/e1000/base/libe1000_base.a.p/e1000_80003es2lan.c.o drivers/net/e1000/base/libe1000_base.a.p/e1000_82540.c.o drivers/net/e1000/base/libe1000_base.a.p/e1000_82541.c.o drivers/net/e1000/base/libe1000_base.a.p/e1000_82542.c.o drivers/net/e1000/base/libe1000_base.a.p/e1000_82543.c.o drivers/net/e1000/base/libe1000_base.a.p/e1000_82571.c.o drivers/net/e1000/base/libe1000_base.a.p/e1000_82575.c.o drivers/net/e1000/base/libe1000_base.a.p/e1000_api.c.o drivers/net/e1000/base/libe1000_base.a.p/e1000_i210.c.o drivers/net/e1000/base/libe1000_base.a.p/e1000_ich8lan.c.o drivers/net/e1000/base/libe1000_base.a.p/e1000_mac.c.o drivers/net/e1000/base/libe1000_base.a.p/e1000_manage.c.o drivers/net/e1000/base/libe1000_base.a.p/e1000_mbx.c.o drivers/net/e1000/base/libe1000_base.a.p/e1000_nvm.c.o dr
ivers/net/e1000/base/libe1000_base.a.p/e1000_osdep.c.o drivers/net/e1000/base/libe1000_base.a.p/e1000_phy.c.o drivers/net/e1000/base/libe1000_base.a.p/e1000_vf.c.o drivers/libtmp_rte_net_e1000.a.p/net_e1000_e1000_logs.c.o drivers/libtmp_rte_net_e1000.a.p/net_e1000_em_ethdev.c.o drivers/libtmp_rte_net_e1000.a.p/net_e1000_em_rxtx.c.o drivers/libtmp_rte_net_e1000.a.p/net_e1000_igb_ethdev.c.o drivers/libtmp_rte_net_e1000.a.p/net_e1000_igb_flow.c.o drivers/libtmp_rte_net_e1000.a.p/net_e1000_igb_pf.c.o drivers/libtmp_rte_net_e1000.a.p/net_e1000_igb_rxtx.c.o -Wl,--as-needed -Wl,--no-undefined -shared -fPIC -Wl,-soname,librte_net_e1000.so.21 -Wl,--no-as-needed -pthread -Wl,--start-group -lm -lexecinfo -Wl,--undefined-version -O2 -pipe -fno-strict-aliasing '-Wl,-rpath,$ORIGIN/../lib:$ORIGIN/' lib/librte_ethdev.so.21.0 lib/librte_eal.so.21.0 lib/librte_kvargs.so.21.0 lib/librte_telemetry.so.21.0 lib/librte_net.so.21.0 lib/librte_mbuf.so.21.0 lib/librte_mempool.so.21.0 lib/librte_ring.
so.21.0 lib/librte_meter.so.21.0 drivers/librte_bus_pci.so.21.0 lib/librte_pci.so.21.0 drivers/librte_bus_vdev.so.21.0 -Wl,--end-group -Wl,--version-script=/wrkdirs/usr/ports/net/dpdk-20.11/work/dpdk-stable-20.11.8/drivers/net/e1000/version.map
[ 94% 1816/1924] /usr/bin/make -f ../kernel/freebsd/BSDmakefile.meson KMOD_OBJDIR=kernel/freebsd KMOD_SRC=../kernel/freebsd/contigmem/contigmem.c KMOD=contigmem 'KMOD_CFLAGS=-I/wrkdirs/usr/ports/net/dpdk-20.11/work/dpdk-stable-20.11.8/_build -I/wrkdirs/usr/ports/net/dpdk-20.11/work/dpdk-stable-20.11.8/config -include rte_config.h' CC=clang
FAILED: [code=1] kernel/freebsd/contigmem.ko
/usr/bin/make -f ../kernel/freebsd/BSDmakefile.meson KMOD_OBJDIR=kernel/freebsd KMOD_SRC=../kernel/freebsd/contigmem/contigmem.c KMOD=contigmem 'KMOD_CFLAGS=-I/wrkdirs/usr/ports/net/dpdk-20.11/work/dpdk-stable-20.11.8/_build -I/wrkdirs/usr/ports/net/dpdk-20.11/work/dpdk-stable-20.11.8/config -include rte_config.h' CC=clang
machine -> /usr/src/sys/amd64/include
x86 -> /usr/src/sys/x86/include
i386 -> /usr/src/sys/i386/include
awk -f /usr/src/sys/tools/makeobjops.awk /usr/src/sys/kern/device_if.m -h
awk -f /usr/src/sys/tools/makeobjops.awk /usr/src/sys/kern/bus_if.m -h
awk -f /usr/src/sys/tools/makeobjops.awk /usr/src/sys/dev/pci/pci_if.m -h
touch opt_global.h
clang -O2 -pipe -fno-strict-aliasing -include rte_config.h -Werror -D_KERNEL -DKLD_MODULE -nostdinc -I/wrkdirs/usr/ports/net/dpdk-20.11/work/dpdk-stable-20.11.8/_build -I/wrkdirs/usr/ports/net/dpdk-20.11/work/dpdk-stable-20.11.8/config -include /wrkdirs/usr/ports/net/dpdk-20.11/work/dpdk-stable-20.11.8/_build/kernel/freebsd/opt_global.h -I. -I/usr/src/sys -I/usr/src/sys/contrib/ck/include -fno-common -fno-omit-frame-pointer -mno-omit-leaf-frame-pointer -fdebug-prefix-map=./machine=/usr/src/sys/amd64/include -fdebug-prefix-map=./x86=/usr/src/sys/x86/include -fdebug-prefix-map=./i386=/usr/src/sys/i386/include -MD -MF.depend.contigmem.o -MTcontigmem.o -mcmodel=kernel -mno-red-zone -mno-mmx -mno-sse -msoft-float -fno-asynchronous-unwind-tables -ffreestanding -fwrapv -fstack-protector-strong -Wall -Wstrict-prototypes -Wmissing-prototypes -Wpointer-arith -Wcast-qual -Wundef -Wno-pointer-sign -D__printf__=__freebsd_kprintf__ -Wmissing-include-dirs -fdiagnostics-show-optio
n -Wno-unknown-pragmas -Wswitch -Wno-error=tautological-compare -Wno-error=empty-body -Wno-error=parentheses-equality -Wno-error=unused-function -Wno-error=pointer-sign -Wno-error=shift-negative-value -Wno-address-of-packed-member -Wno-format-zero-length -mno-aes -mno-avx -std=gnu17 -c /wrkdirs/usr/ports/net/dpdk-20.11/work/dpdk-stable-20.11.8/kernel/freebsd/contigmem/contigmem.c -o contigmem.o
/wrkdirs/usr/ports/net/dpdk-20.11/work/dpdk-stable-20.11.8/kernel/freebsd/contigmem/contigmem.c:155:6: error: call to undeclared function 'SYSCTL_NODE_CHILDREN'; ISO C99 and later do not support implicit function declarations [-Werror,-Wimplicit-function-declaration]
155 | &SYSCTL_NODE_CHILDREN(_hw_contigmem, physaddr), OID_AUTO,
| ^
/wrkdirs/usr/ports/net/dpdk-20.11/work/dpdk-stable-20.11.8/kernel/freebsd/contigmem/contigmem.c:155:27: error: use of undeclared identifier '_hw_contigmem'
155 | &SYSCTL_NODE_CHILDREN(_hw_contigmem, physaddr), OID_AUTO,
| ^~~~~~~~~~~~~
/wrkdirs/usr/ports/net/dpdk-20.11/work/dpdk-stable-20.11.8/kernel/freebsd/contigmem/contigmem.c:155:42: error: use of undeclared identifier 'physaddr'
155 | &SYSCTL_NODE_CHILDREN(_hw_contigmem, physaddr), OID_AUTO,
| ^~~~~~~~
3 errors generated.
*** Error code 1
Stop.
make: stopped making "all" in /wrkdirs/usr/ports/net/dpdk-20.11/work/dpdk-stable-20.11.8/_build
[ 94% 1816/1924] cc -o drivers/librte_net_cxgbe.so.21.0 drivers/librte_net_cxgbe.so.21.0.p/meson-generated_.._rte_net_cxgbe.pmd.c.o drivers/libtmp_rte_net_cxgbe.a.p/net_cxgbe_cxgbe_ethdev.c.o drivers/libtmp_rte_net_cxgbe.a.p/net_cxgbe_cxgbe_main.c.o drivers/libtmp_rte_net_cxgbe.a.p/net_cxgbe_cxgbevf_ethdev.c.o drivers/libtmp_rte_net_cxgbe.a.p/net_cxgbe_cxgbevf_main.c.o drivers/libtmp_rte_net_cxgbe.a.p/net_cxgbe_sge.c.o drivers/libtmp_rte_net_cxgbe.a.p/net_cxgbe_cxgbe_filter.c.o drivers/libtmp_rte_net_cxgbe.a.p/net_cxgbe_cxgbe_flow.c.o drivers/libtmp_rte_net_cxgbe.a.p/net_cxgbe_clip_tbl.c.o drivers/libtmp_rte_net_cxgbe.a.p/net_cxgbe_mps_tcam.c.o drivers/libtmp_rte_net_cxgbe.a.p/net_cxgbe_l2t.c.o drivers/libtmp_rte_net_cxgbe.a.p/net_cxgbe_smt.c.o drivers/libtmp_rte_net_cxgbe.a.p/net_cxgbe_base_t4_hw.c.o drivers/libtmp_rte_net_cxgbe.a.p/net_cxgbe_base_t4vf_hw.c.o -Wl,--as-needed -Wl,--no-undefined -shared -fPIC -Wl,-soname,librte_net_cxgbe.so.21 -Wl,--no-as-needed -pthread -Wl
,--start-group -lm -lexecinfo -Wl,--undefined-version -O2 -pipe -fno-strict-aliasing '-Wl,-rpath,$ORIGIN/../lib:$ORIGIN/' lib/librte_ethdev.so.21.0 lib/librte_eal.so.21.0 lib/librte_kvargs.so.21.0 lib/librte_telemetry.so.21.0 lib/librte_net.so.21.0 lib/librte_mbuf.so.21.0 lib/librte_mempool.so.21.0 lib/librte_ring.so.21.0 lib/librte_meter.so.21.0 drivers/librte_bus_pci.so.21.0 lib/librte_pci.so.21.0 drivers/librte_bus_vdev.so.21.0 -Wl,--end-group -Wl,--version-script=/wrkdirs/usr/ports/net/dpdk-20.11/work/dpdk-stable-20.11.8/drivers/net/cxgbe/version.map
[ 94% 1816/1924] cc -o drivers/librte_net_ena.so.21.0 drivers/librte_net_ena.so.21.0.p/meson-generated_.._rte_net_ena.pmd.c.o drivers/libtmp_rte_net_ena.a.p/net_ena_ena_ethdev.c.o drivers/libtmp_rte_net_ena.a.p/net_ena_base_ena_com.c.o drivers/libtmp_rte_net_ena.a.p/net_ena_base_ena_eth_com.c.o -Wl,--as-needed -Wl,--no-undefined -shared -fPIC -Wl,-soname,librte_net_ena.so.21 -Wl,--no-as-needed -pthread -Wl,--start-group -lm -lexecinfo -Wl,--undefined-version -O2 -pipe -fno-strict-aliasing '-Wl,-rpath,$ORIGIN/../lib:$ORIGIN/' lib/librte_ethdev.so.21.0 lib/librte_eal.so.21.0 lib/librte_kvargs.so.21.0 lib/librte_telemetry.so.21.0 lib/librte_net.so.21.0 lib/librte_mbuf.so.21.0 lib/librte_mempool.so.21.0 lib/librte_ring.so.21.0 lib/librte_meter.so.21.0 drivers/librte_bus_pci.so.21.0 lib/librte_pci.so.21.0 drivers/librte_bus_vdev.so.21.0 lib/librte_timer.so.21.0 -Wl,--end-group -Wl,--version-script=/wrkdirs/usr/ports/net/dpdk-20.11/work/dpdk-stable-20.11.8/drivers/net/ena/version.map
ninja: build stopped: subcommand failed.
===> Compilation failed unexpectedly.
Try to set MAKE_JOBS_UNSAFE=yes and rebuild before reporting the failure to
the maintainer.
*** Error code 1
Stop.
make: stopped making "build" in /usr/ports/net/dpdk-20.11