[package - main-amd64-default][net/dpdk-20.11] Failed for dpdk20.11-20.11.8.1600027 in build
- Go to: [ bottom of page ] [ top of archives ] [ this month ]
Date: Tue, 06 Oct 2026 14:15:18 UTC
You are receiving this mail as a port that you maintain
is failing to build on the FreeBSD package build server.
Please investigate the failure and submit a PR to fix
build.
Maintainer: bruce.richardson@intel.com
Log URL: https://pkg-status.freebsd.org/beefy24/data/main-amd64-default/p0b23c55e5d2c_s1e595e959f/logs/dpdk20.11-20.11.8.1600027.log
Build URL: https://pkg-status.freebsd.org/beefy24/build.html?mastername=main-amd64-default&build=p0b23c55e5d2c_s1e595e959f
Log:
=>> Building net/dpdk-20.11
build started at Tue Oct 6 14:10:19 UTC 2026
port directory: /usr/ports/net/dpdk-20.11
package name: dpdk20.11-20.11.8.1600027
building for: FreeBSD main-amd64-default-job-15 16.0-CURRENT FreeBSD 16.0-CURRENT 1600027 amd64
maintained by: bruce.richardson@intel.com
Makefile datestamp: -rw-r--r-- 1 root wheel 1682 Sep 30 2025 /usr/ports/net/dpdk-20.11/Makefile
Ports top last git commit: 0b23c55e5d2cdcb4a5d8d11bfc2f9c56cc6348ab
Ports top unclean checkout: no
Port dir last git commit: b64b73fd938d5b2788547d16ed6a76493acc9142
Port dir unclean checkout: no
Poudriere version: poudriere-git-3.4.8-3-gd92fb7c0
Host OSVERSION: 1600022
Jail OSVERSION: 1600027
Job Id: 15
!!! Jail is newer than host. (Jail: 1600027, Host: 1600022) !!!
!!! This is not supported. !!!
!!! Host kernel must be same or newer than jail. !!!
!!! Expect build failures. !!!
---Begin Environment---
SHELL=/bin/sh
OSVERSION=1600027
UNAME_v=FreeBSD 16.0-CURRENT 1600027
UNAME_r=16.0-CURRENT
BLOCKSIZE=K
MAIL=/var/mail/root
MM_CHARSET=UTF-8
LANG=C.UTF-8
STATUS=1
HOME=/root
PATH=/sbin:/bin:/usr/sbin:/usr/bin:/usr/local/sbin:/usr/local/bin:/root/bin
MAKE_OBJDIR_CHECK_WRITABLE=0
LOCALBASE=/usr/local
USER=root
POUDRIERE_NAME=poudriere-git
LIBEXECPREFIX=/usr/local/libexec/poudriere
POUDRIERE_VERSION=3.4.8-3-gd92fb7c0
MASTERMNT=/usr/local/poudriere/data/.m/main-amd64-default/ref
LC_COLLATE=C
POUDRIERE_BUILD_TYPE=bulk
PACKAGE_BUILDING=yes
SAVED_TERM=
OUTPUT_REDIRECTED_STDERR=4
OUTPUT_REDIRECTED=1
PWD=/usr/local/poudriere/data/.m/main-amd64-default/15/.p
OUTPUT_REDIRECTED_STDOUT=3
P_PORTS_FEATURES=FLAVORS SUBPACKAGES SELECTED_OPTIONS
MASTERNAME=main-amd64-default
SCRIPTPREFIX=/usr/local/share/poudriere
SCRIPTNAME=bulk.sh
OLDPWD=/usr/local/poudriere/data/.m/main-amd64-default/ref/.p/pool
POUDRIERE_PKGNAME=poudriere-git-3.4.8-3-gd92fb7c0
SCRIPTPATH=/usr/local/share/poudriere/bulk.sh
POUDRIEREPATH=/usr/local/bin/poudriere
---End Environment---
---Begin Poudriere Port Flags/Env---
PORT_FLAGS=
PKGENV=
FLAVOR=
MAKE_ARGS=
---End Poudriere Port Flags/Env---
---Begin OPTIONS List---
===> The following configuration options are available for dpdk20.11-20.11.8.1600027:
DEBUG=off: Debugging support (unoptimized build, impacts performance)
EXAMPLES=on: Build and/or install examples
TESTS=off: Build the automated unit test binary
TOOLS=on: Install tool scripts
===> Use 'make config' to modify these settings
---End OPTIONS List---
--MAINTAINER--
bruce.richardson@intel.com
--End MAINTAINER--
--CONFIGURE_ARGS--
setup --prefix /usr/local --localstatedir /var --infodir share/info --auto-features=enabled -Dpython.bytecompile=-1 -Db_colorout=never --buildtype release --optimization plain --strip -Ddefault_library=shared -Denable_kmods=true -Dc_link_args=-Wl,--undefined-version -Dmachine=default --buildtype=release -Dexamples=all -Dtests=false _build
--End CONFIGURE_ARGS--
--CONFIGURE_ENV--
PKG_CONFIG=pkgconf PYTHON="/usr/local/bin/python3.12" XDG_DATA_HOME=/wrkdirs/usr/ports/net/dpdk-20.11/work XDG_CONFIG_HOME=/wrkdirs/usr/ports/net/dpdk-20.11/work XDG_CACHE_HOME=/wrkdirs/usr/ports/net/dpdk-20.11/work/.cache HOME=/wrkdirs/usr/ports/net/dpdk-20.11/work TMPDIR="/tmp" PATH=/wrkdirs/usr/ports/net/dpdk-20.11/work/.bin:/sbin:/bin:/usr/sbin:/usr/bin:/usr/local/sbin:/usr/local/bin:/root/bin PKG_CONFIG_LIBDIR=/wrkdirs/usr/ports/net/dpdk-20.11/work/.pkgconfig:/usr/local/libdata/pkgconfig:/usr/local/share/pkgconfig:/usr/libdata/pkgconfig SHELL=/bin/sh CONFIG_SHELL=/bin/sh
--End CONFIGURE_ENV--
--MAKE_ENV--
KMODDIR="/boot/modules" SYSDIR="/usr/src/sys" NO_XREF=yes NINJA_STATUS="[%p %s/%t] " XDG_DATA_HOME=/wrkdirs/usr/ports/net/dpdk-20.11/work XDG_CONFIG_HOME=/wrkdirs/usr/ports/net/dpdk-20.11/work XDG_CACHE_HOME=/wrkdirs/usr/ports/net/dpdk-20.11/work/.cache HOME=/wrkdirs/usr/ports/net/dpdk-20.11/work TMPDIR="/tmp" PATH=/wrkdirs/usr/ports/net/dpdk-20.11/work/.bin:/sbin:/bin:/usr/sbin:/usr/bin:/usr/local/sbin:/usr/local/bin:/root/bin PKG_CONFIG_LIBDIR=/wrkdirs/usr/ports/net/dpdk-20.11/work/.pkgconfig:/usr/local/libdata/pkgconfig:/usr/local/share/pkgconfig:/usr/libdata/pkgconfig MK_DEBUG_FILES=no MK_KERNEL_SYMBOLS=no SHELL=/bin/sh NO_LINT=YES DESTDIR=/wrkdirs/usr/ports/net/dpdk-20.11/work/stage PREFIX=/usr/local LOCALBASE=/usr/local CC="cc" CFLAGS="-O2 -pipe -fno-strict-aliasing " CPP="cpp" CPPFLAGS="" LDFLAGS=" " LIBS="" CXX="c++" CXXFLAGS="-O2 -pipe -fno-strict-aliasing " BSD_INSTALL_PROGRAM="install -s -m 555" BSD_INSTALL_LIB="install -s -m 0644" BSD_INSTALL_SCRIP
T="install -m 555" BSD_INSTALL_DATA="install -m 0644" BSD_INSTALL_MAN="install -m 444"
--End MAKE_ENV--
--PLIST_SUB--
PORTEXAMPLES="" DEBUG="@comment " NO_DEBUG="" EXAMPLES="" NO_EXAMPLES="@comment " TESTS="@comment " NO_TESTS="" TOOLS="" NO_TOOLS="@comment " KMODDIR="boot/modules" PYTHON_INCLUDEDIR=include/python3.12 PYTHON_LIBDIR=lib/python3.12 PYTHON_PLATFORM=freebsd16 PYTHON_SITELIBDIR=lib/python3.12/site-packages PYTHON_SUFFIX=312 PYTHON_BASESUFFIX=312 PYTHON_TAG=.cpython-312 PYTHON_SOABI=.cpython-312 PYTHON_VER=3.12 PYTHON_BASEVER=3.12 PYTHON_VERSION=python3.12 PYTHON2="@comment " PYTHON3="" OSREL=16.0 PREFIX=%D LOCALBASE=/usr/local RESETPREFIX=/usr/local LIB32DIR=lib DOCSDIR="share/doc/dpdk" EXAMPLESDIR="share/examples/dpdk" DATADIR="share/dpdk" WWWDIR="www/dpdk" ETCDIR="etc/dpdk"
--End PLIST_SUB--
--SUB_LIST--
DEBUG="@comment " NO_DEBUG="" EXAMPLES="" NO_EXAMPLES="@comment " TESTS="@comment " NO_TESTS="" TOOLS="" NO_TOOLS="@comment " PYTHON_INCLUDEDIR=/usr/local/include/python3.12 PYTHON_LIBDIR=/usr/local/lib/python3.12 PYTHON_PLATFORM=freebsd16 PYTHON_SITELIBDIR=/usr/local/lib/python3.12/site-packages PYTHON_SUFFIX=312 PYTHON_BASESUFFIX=312 PYTHON_TAG=.cpython-312 PYTHON_SOABI=.cpython-312 PYTHON_VER=3.12 PYTHON_BASEVER=3.12 PYTHON_VERSION=python3.12 PYTHON2="@comment " PYTHON3="" PREFIX=/usr/local LOCALBASE=/usr/local DATADIR=/usr/local/share/dpdk DOCSDIR=/usr/local/share/doc/dpdk EXAMPLESDIR=/usr/local/share/examples/dpdk WWWDIR=/usr/local/www/dpdk ETCDIR=/usr/local/etc/dpdk
--End SUB_LIST--
---Begin make.conf---
USE_PACKAGE_DEPENDS=yes
BATCH=yes
WRKDIRPREFIX=/wrkdirs
PORTSDIR=/usr/ports
PACKAGES=/packages
DISTDIR=/distfiles
PACKAGE_BUILDING=yes
PACKAGE_BUILDING_FLAVORS=yes
#### ####
# XXX: We really need this but cannot use it while 'make checksum' does not
# try the next mirror on checksum failure. It currently retries the same
# failed mirror and then fails rather then trying another. It *does*
# try the next if the size is mismatched though.
#MASTER_SITE_FREEBSD=yes
# Build ALLOW_MAKE_JOBS_PACKAGES with 3 jobs
MAKE_JOBS_NUMBER=3
#### Misc Poudriere ####
.include "/etc/make.conf.ports_env"
GID=0
UID=0
---End make.conf---
--Resource limits--
cpu time (seconds, -t) unlimited
file size (512-blocks, -f) unlimited
data seg size (kbytes, -d) 33554432
stack size (kbytes, -s) 524288
core file size (512-blocks, -c) unlimited
max memory size (kbytes, -m) unlimited
locked memory (kbytes, -l) unlimited
max user processes (-u) 89999
open files (-n) 8192
virtual mem size (kbytes, -v) unlimited
swap limit (kbytes, -w) unlimited
socket buffer size (bytes, -b) unlimited
pseudo-terminals (-p) unlimited
kqueues (-k) unlimited
umtx shared locks (-o) unlimited
pipebuf (kbytes, -y) unlimited
virtual machines (-V) unlimited
--End resource limits--
=======================<phase: check-sanity >============================
===== env: NO_DEPENDS=yes USER=root UID=0 GID=0
===> License BSD3CLAUSE accepted by the user
===========================================================================
=======================<phase: pkg-depends >============================
===== env: USE_PACKAGE_DEPENDS_ONLY=1 USER=root UID=0 GID=0
===> dpdk20.11-20.11.8.1600027 depends on file: /usr/local/sbin/pkg - not found
===> Installing existing package /packages/All/pkg-2.8.4.pkg
[main-amd64-default-job-15] Installing pkg-2.8.4...
[main-amd64-default-job-15] Extracting pkg-2.8.4: .......... done
===> dpdk20.11-20.11.8.1600027 depends on file: /usr/local/sbin/pkg - found
===> Returning to build of dpdk20.11-20.11.8.1600027
===========================================================================
=======================<phase: fetch-depends >============================
===== env: USE_PACKAGE_DEPENDS_ONLY=1 USER=root UID=0 GID=0
===========================================================================
=======================<phase: fetch >============================
===== env: NO_DEPENDS=yes USER=root UID=0 GID=0
===> License BSD3CLAUSE accepted by the user
===> Fetching all distfiles required by dpdk20.11-20.11.8.1600027 for building
===========================================================================
=======================<phase: checksum >============================
===== env: NO_DEPENDS=yes USER=root UID=0 GID=0
===> License BSD3CLAUSE accepted by the user
===> Fetching all distfiles required by dpdk20.11-20.11.8.1600027 for building
=> SHA256 Checksum OK for dpdk-20.11.8.tar.xz.
===========================================================================
=======================<phase: extract-depends>============================
===== env: USE_PACKAGE_DEPENDS_ONLY=1 USER=root UID=0 GID=0
===========================================================================
=======================<phase: extract >============================
===== env: NO_DEPENDS=yes USER=root UID=0 GID=0
===> License BSD3CLAUSE accepted by the user
===> Fetching all distfiles required by dpdk20.11-20.11.8.1600027 for building
===> Extracting for dpdk20.11-20.11.8.1600027
=> SHA256 Checksum OK for dpdk-20.11.8.tar.xz.
===========================================================================
=======================<phase: patch-depends >============================
===== env: USE_PACKAGE_DEPENDS_ONLY=1 USER=root UID=0 GID=0
===========================================================================
=======================<phase: patch >============================
===== env: NO_DEPENDS=yes USER=root UID=0 GID=0
===> Patching for dpdk20.11-20.11.8.1600027
===> Applying FreeBSD patches for dpdk20.11-20.11.8.1600027 from /usr/ports/net/dpdk-20.11/files
===========================================================================
=======================<phase: build-depends >============================
===== env: USE_PACKAGE_DEPENDS_ONLY=1 USER=root UID=0 GID=0
===> dpdk20.11-20.11.8.1600027 depends on executable: objdump - found
===> dpdk20.11-20.11.8.1600027 depends on executable: meson - not found
===> Installing existing package /packages/All/meson-1.12.1,1.pkg
[main-amd64-default-job-15] Installing meson-1.12.1,1...
[main-amd64-default-job-15] `-- Installing ninja-1.13.2,4...
[main-amd64-default-job-15] | `-- Installing python312-3.12.14_1...
[main-amd64-default-job-15] | | `-- Installing expat-2.8.5...
[main-amd64-default-job-15] | | `-- Extracting expat-2.8.5: .......... done
<snip>
| ^~~~~~~~~~~~~~~~~~~~~~~~~~
../lib/librte_ethdev/rte_flow.h:841:4: warning: initializer-string for character array is too long, array size is 16 but initializer has size 17 (including the null terminating character); did you mean to use the 'nonstring' attribute? [-Wunterminated-string-initialization]
841 | "\xff\xff\xff\xff\xff\xff\xff\xff"
| ^~~~~~~~~~~~~~~~~~~~~~~~~~~~~~~~~~
842 | "\xff\xff\xff\xff\xff\xff\xff\xff",
| ~~~~~~~~~~~~~~~~~~~~~~~~~~~~~~~~~~
../lib/librte_ethdev/rte_flow.h:844:4: warning: initializer-string for character array is too long, array size is 16 but initializer has size 17 (including the null terminating character); did you mean to use the 'nonstring' attribute? [-Wunterminated-string-initialization]
844 | "\xff\xff\xff\xff\xff\xff\xff\xff"
| ^~~~~~~~~~~~~~~~~~~~~~~~~~~~~~~~~~
845 | "\xff\xff\xff\xff\xff\xff\xff\xff",
| ~~~~~~~~~~~~~~~~~~~~~~~~~~~~~~~~~~
../lib/librte_ethdev/rte_flow.h:941:9: warning: initializer-string for character array is too long, array size is 3 but initializer has size 4 (including the null terminating character); did you mean to use the 'nonstring' attribute? [-Wunterminated-string-initialization]
941 | .vni = "\xff\xff\xff",
| ^~~~~~~~~~~~~~
../lib/librte_ethdev/rte_flow.h:994:9: warning: initializer-string for character array is too long, array size is 3 but initializer has size 4 (including the null terminating character); did you mean to use the 'nonstring' attribute? [-Wunterminated-string-initialization]
994 | .tni = "\xff\xff\xff",
| ^~~~~~~~~~~~~~
../lib/librte_ethdev/rte_flow.h:1014:16: warning: initializer-string for character array is too long, array size is 3 but initializer has size 4 (including the null terminating character); did you mean to use the 'nonstring' attribute? [-Wunterminated-string-initialization]
1014 | .label_tc_s = "\xff\xff\xf0",
| ^~~~~~~~~~~~~~
../lib/librte_ethdev/rte_flow.h:1129:9: warning: initializer-string for character array is too long, array size is 3 but initializer has size 4 (including the null terminating character); did you mean to use the 'nonstring' attribute? [-Wunterminated-string-initialization]
1129 | .vni = "\xff\xff\xff",
| ^~~~~~~~~~~~~~
../lib/librte_ethdev/rte_flow.h:1149:9: warning: initializer-string for character array is too long, array size is 3 but initializer has size 4 (including the null terminating character); did you mean to use the 'nonstring' attribute? [-Wunterminated-string-initialization]
1149 | .vni = "\xff\xff\xff",
| ^~~~~~~~~~~~~~
../lib/librte_ethdev/rte_flow.h:1174:20: warning: initializer-string for character array is too long, array size is 6 but initializer has size 7 (including the null terminating character); did you mean to use the 'nonstring' attribute? [-Wunterminated-string-initialization]
1174 | .sha.addr_bytes = "\xff\xff\xff\xff\xff\xff",
| ^~~~~~~~~~~~~~~~~~~~~~~~~~
../lib/librte_ethdev/rte_flow.h:1176:20: warning: initializer-string for character array is too long, array size is 6 but initializer has size 7 (including the null terminating character); did you mean to use the 'nonstring' attribute? [-Wunterminated-string-initialization]
1176 | .tha.addr_bytes = "\xff\xff\xff\xff\xff\xff",
| ^~~~~~~~~~~~~~~~~~~~~~~~~~
../lib/librte_ethdev/rte_flow.h:1254:3: warning: initializer-string for character array is too long, array size is 16 but initializer has size 17 (including the null terminating character); did you mean to use the 'nonstring' attribute? [-Wunterminated-string-initialization]
1254 | "\xff\xff\xff\xff\xff\xff\xff\xff"
| ^~~~~~~~~~~~~~~~~~~~~~~~~~~~~~~~~~
1255 | "\xff\xff\xff\xff\xff\xff\xff\xff",
| ~~~~~~~~~~~~~~~~~~~~~~~~~~~~~~~~~~
../lib/librte_ethdev/rte_flow.h:1281:3: warning: initializer-string for character array is too long, array size is 16 but initializer has size 17 (including the null terminating character); did you mean to use the 'nonstring' attribute? [-Wunterminated-string-initialization]
1281 | "\xff\xff\xff\xff\xff\xff\xff\xff"
| ^~~~~~~~~~~~~~~~~~~~~~~~~~~~~~~~~~
1282 | "\xff\xff\xff\xff\xff\xff\xff\xff",
| ~~~~~~~~~~~~~~~~~~~~~~~~~~~~~~~~~~
../lib/librte_ethdev/rte_flow.h:1331:20: warning: initializer-string for character array is too long, array size is 6 but initializer has size 7 (including the null terminating character); did you mean to use the 'nonstring' attribute? [-Wunterminated-string-initialization]
1331 | .sla.addr_bytes = "\xff\xff\xff\xff\xff\xff",
| ^~~~~~~~~~~~~~~~~~~~~~~~~~
../lib/librte_ethdev/rte_flow.h:1356:20: warning: initializer-string for character array is too long, array size is 6 but initializer has size 7 (including the null terminating character); did you mean to use the 'nonstring' attribute? [-Wunterminated-string-initialization]
1356 | .tla.addr_bytes = "\xff\xff\xff\xff\xff\xff",
| ^~~~~~~~~~~~~~~~~~~~~~~~~~
15 warnings generated.
[ 92% 1788/1924] cc -Iexamples/dpdk-timer.p -Iexamples -I../examples -Iexamples/timer -I../examples/timer -I. -I.. -Iconfig -I../config -Ilib/librte_eal/include -I../lib/librte_eal/include -Ilib/librte_eal/freebsd/include -I../lib/librte_eal/freebsd/include -Ilib/librte_eal/x86/include -I../lib/librte_eal/x86/include -Ilib/librte_eal/common -I../lib/librte_eal/common -Ilib/librte_eal -I../lib/librte_eal -Ilib/librte_kvargs -I../lib/librte_kvargs -Ilib/librte_metrics -I../lib/librte_metrics -Ilib/librte_telemetry -I../lib/librte_telemetry -Ilib/librte_mempool -I../lib/librte_mempool -Ilib/librte_ring -I../lib/librte_ring -Ilib/librte_net -I../lib/librte_net -Ilib/librte_mbuf -I../lib/librte_mbuf -Ilib/librte_ethdev -I../lib/librte_ethdev -Ilib/librte_meter -I../lib/librte_meter -Ilib/librte_cmdline -I../lib/librte_cmdline -Ilib/librte_timer -I../lib/librte_timer -fdiagnostics-color=never -D_FILE_OFFSET_BITS=64 -Wall -Winvalid-pch -Wextra -include rte_config.h -Wcast-qual -Wde
precated -Wformat -Wformat-nonliteral -Wformat-security -Wmissing-declarations -Wmissing-prototypes -Wnested-externs -Wold-style-definition -Wpointer-arith -Wsign-compare -Wstrict-prototypes -Wundef -Wwrite-strings -Wno-address-of-packed-member -Wno-missing-field-initializers -D_GNU_SOURCE -D__BSD_VISIBLE -O2 -pipe -fno-strict-aliasing -march=corei7 -Wno-format-truncation -DALLOW_EXPERIMENTAL_API -MD -MQ examples/dpdk-timer.p/timer_main.c.o -MF examples/dpdk-timer.p/timer_main.c.o.d -o examples/dpdk-timer.p/timer_main.c.o -c ../examples/timer/main.c
[ 92% 1789/1924] cc -Iexamples/dpdk-vmdq.p -Iexamples -I../examples -Iexamples/vmdq -I../examples/vmdq -I. -I.. -Iconfig -I../config -Ilib/librte_eal/include -I../lib/librte_eal/include -Ilib/librte_eal/freebsd/include -I../lib/librte_eal/freebsd/include -Ilib/librte_eal/x86/include -I../lib/librte_eal/x86/include -Ilib/librte_eal/common -I../lib/librte_eal/common -Ilib/librte_eal -I../lib/librte_eal -Ilib/librte_kvargs -I../lib/librte_kvargs -Ilib/librte_metrics -I../lib/librte_metrics -Ilib/librte_telemetry -I../lib/librte_telemetry -Ilib/librte_mempool -I../lib/librte_mempool -Ilib/librte_ring -I../lib/librte_ring -Ilib/librte_net -I../lib/librte_net -Ilib/librte_mbuf -I../lib/librte_mbuf -Ilib/librte_ethdev -I../lib/librte_ethdev -Ilib/librte_meter -I../lib/librte_meter -Ilib/librte_cmdline -I../lib/librte_cmdline -fdiagnostics-color=never -D_FILE_OFFSET_BITS=64 -Wall -Winvalid-pch -Wextra -include rte_config.h -Wcast-qual -Wdeprecated -Wformat -Wformat-nonliteral -Wform
at-security -Wmissing-declarations -Wmissing-prototypes -Wnested-externs -Wold-style-definition -Wpointer-arith -Wsign-compare -Wstrict-prototypes -Wundef -Wwrite-strings -Wno-address-of-packed-member -Wno-missing-field-initializers -D_GNU_SOURCE -D__BSD_VISIBLE -O2 -pipe -fno-strict-aliasing -march=corei7 -Wno-format-truncation -DALLOW_EXPERIMENTAL_API -MD -MQ examples/dpdk-vmdq.p/vmdq_main.c.o -MF examples/dpdk-vmdq.p/vmdq_main.c.o.d -o examples/dpdk-vmdq.p/vmdq_main.c.o -c ../examples/vmdq/main.c
In file included from ../examples/vmdq/main.c:33:
In file included from ../lib/librte_ethdev/rte_ethdev.h:1226:
In file included from ../lib/librte_ethdev/rte_eth_ctrl.h:11:
../lib/librte_ethdev/rte_flow.h:747:20: warning: initializer-string for character array is too long, array size is 6 but initializer has size 7 (including the null terminating character); did you mean to use the 'nonstring' attribute? [-Wunterminated-string-initialization]
747 | .dst.addr_bytes = "\xff\xff\xff\xff\xff\xff",
| ^~~~~~~~~~~~~~~~~~~~~~~~~~
../lib/librte_ethdev/rte_flow.h:748:20: warning: initializer-string for character array is too long, array size is 6 but initializer has size 7 (including the null terminating character); did you mean to use the 'nonstring' attribute? [-Wunterminated-string-initialization]
748 | .src.addr_bytes = "\xff\xff\xff\xff\xff\xff",
| ^~~~~~~~~~~~~~~~~~~~~~~~~~
../lib/librte_ethdev/rte_flow.h:841:4: warning: initializer-string for character array is too long, array size is 16 but initializer has size 17 (including the null terminating character); did you mean to use the 'nonstring' attribute? [-Wunterminated-string-initialization]
841 | "\xff\xff\xff\xff\xff\xff\xff\xff"
| ^~~~~~~~~~~~~~~~~~~~~~~~~~~~~~~~~~
842 | "\xff\xff\xff\xff\xff\xff\xff\xff",
| ~~~~~~~~~~~~~~~~~~~~~~~~~~~~~~~~~~
../lib/librte_ethdev/rte_flow.h:844:4: warning: initializer-string for character array is too long, array size is 16 but initializer has size 17 (including the null terminating character); did you mean to use the 'nonstring' attribute? [-Wunterminated-string-initialization]
844 | "\xff\xff\xff\xff\xff\xff\xff\xff"
| ^~~~~~~~~~~~~~~~~~~~~~~~~~~~~~~~~~
845 | "\xff\xff\xff\xff\xff\xff\xff\xff",
| ~~~~~~~~~~~~~~~~~~~~~~~~~~~~~~~~~~
../lib/librte_ethdev/rte_flow.h:941:9: warning: initializer-string for character array is too long, array size is 3 but initializer has size 4 (including the null terminating character); did you mean to use the 'nonstring' attribute? [-Wunterminated-string-initialization]
941 | .vni = "\xff\xff\xff",
| ^~~~~~~~~~~~~~
../lib/librte_ethdev/rte_flow.h:994:9: warning: initializer-string for character array is too long, array size is 3 but initializer has size 4 (including the null terminating character); did you mean to use the 'nonstring' attribute? [-Wunterminated-string-initialization]
994 | .tni = "\xff\xff\xff",
| ^~~~~~~~~~~~~~
../lib/librte_ethdev/rte_flow.h:1014:16: warning: initializer-string for character array is too long, array size is 3 but initializer has size 4 (including the null terminating character); did you mean to use the 'nonstring' attribute? [-Wunterminated-string-initialization]
1014 | .label_tc_s = "\xff\xff\xf0",
| ^~~~~~~~~~~~~~
../lib/librte_ethdev/rte_flow.h:1129:9: warning: initializer-string for character array is too long, array size is 3 but initializer has size 4 (including the null terminating character); did you mean to use the 'nonstring' attribute? [-Wunterminated-string-initialization]
1129 | .vni = "\xff\xff\xff",
| ^~~~~~~~~~~~~~
../lib/librte_ethdev/rte_flow.h:1149:9: warning: initializer-string for character array is too long, array size is 3 but initializer has size 4 (including the null terminating character); did you mean to use the 'nonstring' attribute? [-Wunterminated-string-initialization]
1149 | .vni = "\xff\xff\xff",
| ^~~~~~~~~~~~~~
../lib/librte_ethdev/rte_flow.h:1174:20: warning: initializer-string for character array is too long, array size is 6 but initializer has size 7 (including the null terminating character); did you mean to use the 'nonstring' attribute? [-Wunterminated-string-initialization]
1174 | .sha.addr_bytes = "\xff\xff\xff\xff\xff\xff",
| ^~~~~~~~~~~~~~~~~~~~~~~~~~
../lib/librte_ethdev/rte_flow.h:1176:20: warning: initializer-string for character array is too long, array size is 6 but initializer has size 7 (including the null terminating character); did you mean to use the 'nonstring' attribute? [-Wunterminated-string-initialization]
1176 | .tha.addr_bytes = "\xff\xff\xff\xff\xff\xff",
| ^~~~~~~~~~~~~~~~~~~~~~~~~~
../lib/librte_ethdev/rte_flow.h:1254:3: warning: initializer-string for character array is too long, array size is 16 but initializer has size 17 (including the null terminating character); did you mean to use the 'nonstring' attribute? [-Wunterminated-string-initialization]
1254 | "\xff\xff\xff\xff\xff\xff\xff\xff"
| ^~~~~~~~~~~~~~~~~~~~~~~~~~~~~~~~~~
1255 | "\xff\xff\xff\xff\xff\xff\xff\xff",
| ~~~~~~~~~~~~~~~~~~~~~~~~~~~~~~~~~~
../lib/librte_ethdev/rte_flow.h:1281:3: warning: initializer-string for character array is too long, array size is 16 but initializer has size 17 (including the null terminating character); did you mean to use the 'nonstring' attribute? [-Wunterminated-string-initialization]
1281 | "\xff\xff\xff\xff\xff\xff\xff\xff"
| ^~~~~~~~~~~~~~~~~~~~~~~~~~~~~~~~~~
1282 | "\xff\xff\xff\xff\xff\xff\xff\xff",
| ~~~~~~~~~~~~~~~~~~~~~~~~~~~~~~~~~~
../lib/librte_ethdev/rte_flow.h:1331:20: warning: initializer-string for character array is too long, array size is 6 but initializer has size 7 (including the null terminating character); did you mean to use the 'nonstring' attribute? [-Wunterminated-string-initialization]
1331 | .sla.addr_bytes = "\xff\xff\xff\xff\xff\xff",
| ^~~~~~~~~~~~~~~~~~~~~~~~~~
../lib/librte_ethdev/rte_flow.h:1356:20: warning: initializer-string for character array is too long, array size is 6 but initializer has size 7 (including the null terminating character); did you mean to use the 'nonstring' attribute? [-Wunterminated-string-initialization]
1356 | .tla.addr_bytes = "\xff\xff\xff\xff\xff\xff",
| ^~~~~~~~~~~~~~~~~~~~~~~~~~
15 warnings generated.
[ 92% 1790/1924] /usr/bin/make -f ../kernel/freebsd/BSDmakefile.meson KMOD_OBJDIR=kernel/freebsd KMOD_SRC=../kernel/freebsd/contigmem/contigmem.c KMOD=contigmem 'KMOD_CFLAGS=-I/wrkdirs/usr/ports/net/dpdk-20.11/work/dpdk-stable-20.11.8/_build -I/wrkdirs/usr/ports/net/dpdk-20.11/work/dpdk-stable-20.11.8/config -include rte_config.h' CC=clang
FAILED: [code=1] kernel/freebsd/contigmem.ko
/usr/bin/make -f ../kernel/freebsd/BSDmakefile.meson KMOD_OBJDIR=kernel/freebsd KMOD_SRC=../kernel/freebsd/contigmem/contigmem.c KMOD=contigmem 'KMOD_CFLAGS=-I/wrkdirs/usr/ports/net/dpdk-20.11/work/dpdk-stable-20.11.8/_build -I/wrkdirs/usr/ports/net/dpdk-20.11/work/dpdk-stable-20.11.8/config -include rte_config.h' CC=clang
machine -> /usr/src/sys/amd64/include
x86 -> /usr/src/sys/x86/include
i386 -> /usr/src/sys/i386/include
awk -f /usr/src/sys/tools/makeobjops.awk /usr/src/sys/kern/device_if.m -h
awk -f /usr/src/sys/tools/makeobjops.awk /usr/src/sys/kern/bus_if.m -h
awk -f /usr/src/sys/tools/makeobjops.awk /usr/src/sys/dev/pci/pci_if.m -h
touch opt_global.h
clang -O2 -pipe -fno-strict-aliasing -include rte_config.h -Werror -D_KERNEL -DKLD_MODULE -nostdinc -I/wrkdirs/usr/ports/net/dpdk-20.11/work/dpdk-stable-20.11.8/_build -I/wrkdirs/usr/ports/net/dpdk-20.11/work/dpdk-stable-20.11.8/config -include /wrkdirs/usr/ports/net/dpdk-20.11/work/dpdk-stable-20.11.8/_build/kernel/freebsd/opt_global.h -I. -I/usr/src/sys -I/usr/src/sys/contrib/ck/include -fno-common -fno-omit-frame-pointer -mno-omit-leaf-frame-pointer -fdebug-prefix-map=./machine=/usr/src/sys/amd64/include -fdebug-prefix-map=./x86=/usr/src/sys/x86/include -fdebug-prefix-map=./i386=/usr/src/sys/i386/include -MD -MF.depend.contigmem.o -MTcontigmem.o -mcmodel=kernel -mno-red-zone -mno-mmx -mno-sse -msoft-float -fno-asynchronous-unwind-tables -ffreestanding -fwrapv -fstack-protector-strong -Wall -Wstrict-prototypes -Wmissing-prototypes -Wpointer-arith -Wcast-qual -Wundef -Wno-pointer-sign -D__printf__=__freebsd_kprintf__ -Wmissing-include-dirs -fdiagnostics-show-optio
n -Wno-unknown-pragmas -Wswitch -Wno-error=tautological-compare -Wno-error=empty-body -Wno-error=parentheses-equality -Wno-error=unused-function -Wno-error=pointer-sign -Wno-error=shift-negative-value -Wno-address-of-packed-member -Wno-format-zero-length -mno-aes -mno-avx -std=gnu17 -c /wrkdirs/usr/ports/net/dpdk-20.11/work/dpdk-stable-20.11.8/kernel/freebsd/contigmem/contigmem.c -o contigmem.o
/wrkdirs/usr/ports/net/dpdk-20.11/work/dpdk-stable-20.11.8/kernel/freebsd/contigmem/contigmem.c:155:6: error: call to undeclared function 'SYSCTL_NODE_CHILDREN'; ISO C99 and later do not support implicit function declarations [-Werror,-Wimplicit-function-declaration]
155 | &SYSCTL_NODE_CHILDREN(_hw_contigmem, physaddr), OID_AUTO,
| ^
/wrkdirs/usr/ports/net/dpdk-20.11/work/dpdk-stable-20.11.8/kernel/freebsd/contigmem/contigmem.c:155:27: error: use of undeclared identifier '_hw_contigmem'
155 | &SYSCTL_NODE_CHILDREN(_hw_contigmem, physaddr), OID_AUTO,
| ^~~~~~~~~~~~~
/wrkdirs/usr/ports/net/dpdk-20.11/work/dpdk-stable-20.11.8/kernel/freebsd/contigmem/contigmem.c:155:42: error: use of undeclared identifier 'physaddr'
155 | &SYSCTL_NODE_CHILDREN(_hw_contigmem, physaddr), OID_AUTO,
| ^~~~~~~~
3 errors generated.
*** Error code 1
Stop.
make: stopped making "all" in /wrkdirs/usr/ports/net/dpdk-20.11/work/dpdk-stable-20.11.8/_build
[ 92% 1790/1924] cc -Iexamples/dpdk-vmdq_dcb.p -Iexamples -I../examples -Iexamples/vmdq_dcb -I../examples/vmdq_dcb -I. -I.. -Iconfig -I../config -Ilib/librte_eal/include -I../lib/librte_eal/include -Ilib/librte_eal/freebsd/include -I../lib/librte_eal/freebsd/include -Ilib/librte_eal/x86/include -I../lib/librte_eal/x86/include -Ilib/librte_eal/common -I../lib/librte_eal/common -Ilib/librte_eal -I../lib/librte_eal -Ilib/librte_kvargs -I../lib/librte_kvargs -Ilib/librte_metrics -I../lib/librte_metrics -Ilib/librte_telemetry -I../lib/librte_telemetry -Ilib/librte_mempool -I../lib/librte_mempool -Ilib/librte_ring -I../lib/librte_ring -Ilib/librte_net -I../lib/librte_net -Ilib/librte_mbuf -I../lib/librte_mbuf -Ilib/librte_ethdev -I../lib/librte_ethdev -Ilib/librte_meter -I../lib/librte_meter -Ilib/librte_cmdline -I../lib/librte_cmdline -fdiagnostics-color=never -D_FILE_OFFSET_BITS=64 -Wall -Winvalid-pch -Wextra -include rte_config.h -Wcast-qual -Wdeprecated -Wformat -Wformat-nonli
teral -Wformat-security -Wmissing-declarations -Wmissing-prototypes -Wnested-externs -Wold-style-definition -Wpointer-arith -Wsign-compare -Wstrict-prototypes -Wundef -Wwrite-strings -Wno-address-of-packed-member -Wno-missing-field-initializers -D_GNU_SOURCE -D__BSD_VISIBLE -O2 -pipe -fno-strict-aliasing -march=corei7 -Wno-format-truncation -DALLOW_EXPERIMENTAL_API -MD -MQ examples/dpdk-vmdq_dcb.p/vmdq_dcb_main.c.o -MF examples/dpdk-vmdq_dcb.p/vmdq_dcb_main.c.o.d -o examples/dpdk-vmdq_dcb.p/vmdq_dcb_main.c.o -c ../examples/vmdq_dcb/main.c
In file included from ../examples/vmdq_dcb/main.c:33:
In file included from ../lib/librte_ethdev/rte_ethdev.h:1226:
In file included from ../lib/librte_ethdev/rte_eth_ctrl.h:11:
../lib/librte_ethdev/rte_flow.h:747:20: warning: initializer-string for character array is too long, array size is 6 but initializer has size 7 (including the null terminating character); did you mean to use the 'nonstring' attribute? [-Wunterminated-string-initialization]
747 | .dst.addr_bytes = "\xff\xff\xff\xff\xff\xff",
| ^~~~~~~~~~~~~~~~~~~~~~~~~~
../lib/librte_ethdev/rte_flow.h:748:20: warning: initializer-string for character array is too long, array size is 6 but initializer has size 7 (including the null terminating character); did you mean to use the 'nonstring' attribute? [-Wunterminated-string-initialization]
748 | .src.addr_bytes = "\xff\xff\xff\xff\xff\xff",
| ^~~~~~~~~~~~~~~~~~~~~~~~~~
../lib/librte_ethdev/rte_flow.h:841:4: warning: initializer-string for character array is too long, array size is 16 but initializer has size 17 (including the null terminating character); did you mean to use the 'nonstring' attribute? [-Wunterminated-string-initialization]
841 | "\xff\xff\xff\xff\xff\xff\xff\xff"
| ^~~~~~~~~~~~~~~~~~~~~~~~~~~~~~~~~~
842 | "\xff\xff\xff\xff\xff\xff\xff\xff",
| ~~~~~~~~~~~~~~~~~~~~~~~~~~~~~~~~~~
../lib/librte_ethdev/rte_flow.h:844:4: warning: initializer-string for character array is too long, array size is 16 but initializer has size 17 (including the null terminating character); did you mean to use the 'nonstring' attribute? [-Wunterminated-string-initialization]
844 | "\xff\xff\xff\xff\xff\xff\xff\xff"
| ^~~~~~~~~~~~~~~~~~~~~~~~~~~~~~~~~~
845 | "\xff\xff\xff\xff\xff\xff\xff\xff",
| ~~~~~~~~~~~~~~~~~~~~~~~~~~~~~~~~~~
../lib/librte_ethdev/rte_flow.h:941:9: warning: initializer-string for character array is too long, array size is 3 but initializer has size 4 (including the null terminating character); did you mean to use the 'nonstring' attribute? [-Wunterminated-string-initialization]
941 | .vni = "\xff\xff\xff",
| ^~~~~~~~~~~~~~
../lib/librte_ethdev/rte_flow.h:994:9: warning: initializer-string for character array is too long, array size is 3 but initializer has size 4 (including the null terminating character); did you mean to use the 'nonstring' attribute? [-Wunterminated-string-initialization]
994 | .tni = "\xff\xff\xff",
| ^~~~~~~~~~~~~~
../lib/librte_ethdev/rte_flow.h:1014:16: warning: initializer-string for character array is too long, array size is 3 but initializer has size 4 (including the null terminating character); did you mean to use the 'nonstring' attribute? [-Wunterminated-string-initialization]
1014 | .label_tc_s = "\xff\xff\xf0",
| ^~~~~~~~~~~~~~
../lib/librte_ethdev/rte_flow.h:1129:9: warning: initializer-string for character array is too long, array size is 3 but initializer has size 4 (including the null terminating character); did you mean to use the 'nonstring' attribute? [-Wunterminated-string-initialization]
1129 | .vni = "\xff\xff\xff",
| ^~~~~~~~~~~~~~
../lib/librte_ethdev/rte_flow.h:1149:9: warning: initializer-string for character array is too long, array size is 3 but initializer has size 4 (including the null terminating character); did you mean to use the 'nonstring' attribute? [-Wunterminated-string-initialization]
1149 | .vni = "\xff\xff\xff",
| ^~~~~~~~~~~~~~
../lib/librte_ethdev/rte_flow.h:1174:20: warning: initializer-string for character array is too long, array size is 6 but initializer has size 7 (including the null terminating character); did you mean to use the 'nonstring' attribute? [-Wunterminated-string-initialization]
1174 | .sha.addr_bytes = "\xff\xff\xff\xff\xff\xff",
| ^~~~~~~~~~~~~~~~~~~~~~~~~~
../lib/librte_ethdev/rte_flow.h:1176:20: warning: initializer-string for character array is too long, array size is 6 but initializer has size 7 (including the null terminating character); did you mean to use the 'nonstring' attribute? [-Wunterminated-string-initialization]
1176 | .tha.addr_bytes = "\xff\xff\xff\xff\xff\xff",
| ^~~~~~~~~~~~~~~~~~~~~~~~~~
../lib/librte_ethdev/rte_flow.h:1254:3: warning: initializer-string for character array is too long, array size is 16 but initializer has size 17 (including the null terminating character); did you mean to use the 'nonstring' attribute? [-Wunterminated-string-initialization]
1254 | "\xff\xff\xff\xff\xff\xff\xff\xff"
| ^~~~~~~~~~~~~~~~~~~~~~~~~~~~~~~~~~
1255 | "\xff\xff\xff\xff\xff\xff\xff\xff",
| ~~~~~~~~~~~~~~~~~~~~~~~~~~~~~~~~~~
../lib/librte_ethdev/rte_flow.h:1281:3: warning: initializer-string for character array is too long, array size is 16 but initializer has size 17 (including the null terminating character); did you mean to use the 'nonstring' attribute? [-Wunterminated-string-initialization]
1281 | "\xff\xff\xff\xff\xff\xff\xff\xff"
| ^~~~~~~~~~~~~~~~~~~~~~~~~~~~~~~~~~
1282 | "\xff\xff\xff\xff\xff\xff\xff\xff",
| ~~~~~~~~~~~~~~~~~~~~~~~~~~~~~~~~~~
../lib/librte_ethdev/rte_flow.h:1331:20: warning: initializer-string for character array is too long, array size is 6 but initializer has size 7 (including the null terminating character); did you mean to use the 'nonstring' attribute? [-Wunterminated-string-initialization]
1331 | .sla.addr_bytes = "\xff\xff\xff\xff\xff\xff",
| ^~~~~~~~~~~~~~~~~~~~~~~~~~
../lib/librte_ethdev/rte_flow.h:1356:20: warning: initializer-string for character array is too long, array size is 6 but initializer has size 7 (including the null terminating character); did you mean to use the 'nonstring' attribute? [-Wunterminated-string-initialization]
1356 | .tla.addr_bytes = "\xff\xff\xff\xff\xff\xff",
| ^~~~~~~~~~~~~~~~~~~~~~~~~~
15 warnings generated.
[ 93% 1790/1924] cc -Ilib/librte_pipeline.a.p -Ilib -I../lib -Ilib/librte_pipeline -I../lib/librte_pipeline -I. -I.. -Iconfig -I../config -Ilib/librte_eal/include -I../lib/librte_eal/include -Ilib/librte_eal/freebsd/include -I../lib/librte_eal/freebsd/include -Ilib/librte_eal/x86/include -I../lib/librte_eal/x86/include -Ilib/librte_eal/common -I../lib/librte_eal/common -Ilib/librte_eal -I../lib/librte_eal -Ilib/librte_kvargs -I../lib/librte_kvargs -Ilib/librte_metrics -I../lib/librte_metrics -Ilib/librte_telemetry -I../lib/librte_telemetry -Ilib/librte_port -I../lib/librte_port -Ilib/librte_ethdev -I../lib/librte_ethdev -Ilib/librte_net -I../lib/librte_net -Ilib/librte_mbuf -I../lib/librte_mbuf -Ilib/librte_mempool -I../lib/librte_mempool -Ilib/librte_ring -I../lib/librte_ring -Ilib/librte_meter -I../lib/librte_meter -Ilib/librte_sched -I../lib/librte_sched -Ilib/librte_ip_frag -I../lib/librte_ip_frag -Ilib/librte_hash -I../lib/librte_hash -Ilib/librte_rcu -I../lib/librte_rc
u -Ilib/librte_cryptodev -I../lib/librte_cryptodev -Ilib/librte_eventdev -I../lib/librte_eventdev -Ilib/librte_timer -I../lib/librte_timer -Ilib/librte_table -I../lib/librte_table -Ilib/librte_lpm -I../lib/librte_lpm -Ilib/librte_acl -I../lib/librte_acl -fdiagnostics-color=never -D_FILE_OFFSET_BITS=64 -Wall -Winvalid-pch -Wextra -include rte_config.h -Wcast-qual -Wdeprecated -Wformat -Wformat-nonliteral -Wformat-security -Wmissing-declarations -Wmissing-prototypes -Wnested-externs -Wold-style-definition -Wpointer-arith -Wsign-compare -Wstrict-prototypes -Wundef -Wwrite-strings -Wno-address-of-packed-member -Wno-missing-field-initializers -D_GNU_SOURCE -D__BSD_VISIBLE -O2 -pipe -fno-strict-aliasing -fPIC -march=corei7 -DALLOW_EXPERIMENTAL_API -DALLOW_INTERNAL_API -Wno-format-truncation -MD -MQ lib/librte_pipeline.a.p/librte_pipeline_rte_table_action.c.o -MF lib/librte_pipeline.a.p/librte_pipeline_rte_table_action.c.o.d -o lib/librte_pipeline.a.p/librte_pipeline_rte_table_acti
on.c.o -c ../lib/librte_pipeline/rte_table_action.c
ninja: build stopped: subcommand failed.
===> Compilation failed unexpectedly.
Try to set MAKE_JOBS_UNSAFE=yes and rebuild before reporting the failure to
the maintainer.
*** Error code 1
Stop.
make: stopped making "build" in /usr/ports/net/dpdk-20.11