[package - 144i386-quarterly][net/rayfish] Failed for rayfish-0.5.3 in build
- Go to: [ bottom of page ] [ top of archives ] [ this month ]
Date: Mon, 05 Oct 2026 04:09:18 UTC
You are receiving this mail as a port that you maintain
is failing to build on the FreeBSD package build server.
Please investigate the failure and submit a PR to fix
build.
Maintainer: feld@FreeBSD.org
Log URL: https://pkg-status.freebsd.org/beefy19/data/144i386-quarterly/3a7a1297a515/logs/rayfish-0.5.3.log
Build URL: https://pkg-status.freebsd.org/beefy19/build.html?mastername=144i386-quarterly&build=3a7a1297a515
Log:
=>> Building net/rayfish
build started at Mon Oct 5 04:01:52 UTC 2026
port directory: /usr/ports/net/rayfish
package name: rayfish-0.5.3
building for: FreeBSD 144i386-quarterly-job-02 14.4-RELEASE-p10 FreeBSD 14.4-RELEASE-p10 i386
maintained by: feld@FreeBSD.org
Makefile datestamp: -rw-r--r-- 1 root wheel 319 Oct 4 01:01 /usr/ports/net/rayfish/Makefile
Ports top last git commit: 3a7a1297a515552d4aef02f06cd5ee1a92ed4583
Ports top unclean checkout: no
Port dir last git commit: 3a7a1297a515552d4aef02f06cd5ee1a92ed4583
Port dir unclean checkout: no
Poudriere version: poudriere-git-3.4.8-3-gd92fb7c0
Host OSVERSION: 1600022
Jail OSVERSION: 1404000
Job Id: 02
---Begin Environment---
SHELL=/bin/sh
BLOCKSIZE=K
MAIL=/var/mail/root
MM_CHARSET=UTF-8
LANG=C.UTF-8
OSVERSION=1404000
STATUS=1
HOME=/root
PATH=/sbin:/bin:/usr/sbin:/usr/bin:/usr/local/sbin:/usr/local/bin:/root/bin
MAKE_OBJDIR_CHECK_WRITABLE=0
UNAME_m=i386
UNAME_p=i386
UNAME_r=14.4-RELEASE-p10
LOCALBASE=/usr/local
UNAME_v=FreeBSD 14.4-RELEASE-p10
USER=root
POUDRIERE_NAME=poudriere-git
LIBEXECPREFIX=/usr/local/libexec/poudriere
POUDRIERE_VERSION=3.4.8-3-gd92fb7c0
MASTERMNT=/usr/local/poudriere/data/.m/144i386-quarterly/ref
LC_COLLATE=C
POUDRIERE_BUILD_TYPE=bulk
PACKAGE_BUILDING=yes
SAVED_TERM=
OUTPUT_REDIRECTED_STDERR=4
OUTPUT_REDIRECTED=1
PWD=/usr/local/poudriere/data/.m/144i386-quarterly/02/.p
OUTPUT_REDIRECTED_STDOUT=3
P_PORTS_FEATURES=FLAVORS SUBPACKAGES SELECTED_OPTIONS
MASTERNAME=144i386-quarterly
SCRIPTPREFIX=/usr/local/share/poudriere
SCRIPTNAME=bulk.sh
OLDPWD=/usr/local/poudriere/data/.m/144i386-quarterly/ref/.p/pool
POUDRIERE_PKGNAME=poudriere-git-3.4.8-3-gd92fb7c0
SCRIPTPATH=/usr/local/share/poudriere/bulk.sh
POUDRIEREPATH=/usr/local/bin/poudriere
---End Environment---
---Begin Poudriere Port Flags/Env---
PORT_FLAGS=
PKGENV=
FLAVOR=
MAKE_ARGS=
---End Poudriere Port Flags/Env---
---Begin OPTIONS List---
---End OPTIONS List---
--MAINTAINER--
feld@FreeBSD.org
--End MAINTAINER--
--CONFIGURE_ARGS--
--End CONFIGURE_ARGS--
--CONFIGURE_ENV--
PKG_CONFIG=pkgconf XDG_DATA_HOME=/wrkdirs/usr/ports/net/rayfish/work XDG_CONFIG_HOME=/wrkdirs/usr/ports/net/rayfish/work XDG_CACHE_HOME=/wrkdirs/usr/ports/net/rayfish/work/.cache HOME=/wrkdirs/usr/ports/net/rayfish/work TMPDIR="/wrkdirs/usr/ports/net/rayfish/work" PATH=/wrkdirs/usr/ports/net/rayfish/work/.bin:/sbin:/bin:/usr/sbin:/usr/bin:/usr/local/sbin:/usr/local/bin:/root/bin PKG_CONFIG_LIBDIR=/wrkdirs/usr/ports/net/rayfish/work/.pkgconfig:/usr/local/libdata/pkgconfig:/usr/local/share/pkgconfig:/usr/libdata/pkgconfig SHELL=/bin/sh CONFIG_SHELL=/bin/sh
--End CONFIGURE_ENV--
--MAKE_ENV--
XDG_DATA_HOME=/wrkdirs/usr/ports/net/rayfish/work XDG_CONFIG_HOME=/wrkdirs/usr/ports/net/rayfish/work XDG_CACHE_HOME=/wrkdirs/usr/ports/net/rayfish/work/.cache HOME=/wrkdirs/usr/ports/net/rayfish/work TMPDIR="/wrkdirs/usr/ports/net/rayfish/work" PATH=/wrkdirs/usr/ports/net/rayfish/work/.bin:/sbin:/bin:/usr/sbin:/usr/bin:/usr/local/sbin:/usr/local/bin:/root/bin PKG_CONFIG_LIBDIR=/wrkdirs/usr/ports/net/rayfish/work/.pkgconfig:/usr/local/libdata/pkgconfig:/usr/local/share/pkgconfig:/usr/libdata/pkgconfig MK_DEBUG_FILES=no MK_KERNEL_SYMBOLS=no SHELL=/bin/sh NO_LINT=YES PREFIX=/usr/local LOCALBASE=/usr/local CC="cc" CFLAGS="-O2 -pipe -fstack-protector-strong -fno-strict-aliasing " CPP="cpp" CPPFLAGS="" LDFLAGS=" " LIBS="" CXX="c++" CXXFLAGS="-O2 -pipe -fstack-protector-strong -fno-strict-aliasing " BSD_INSTALL_PROGRAM="install -s -m 555" BSD_INSTALL_LIB="install -s -m 0644" BSD_INSTALL_SCRIPT="install -m 555" BSD_INSTALL_DATA="install -m 0644" BSD_INSTALL_MAN="i
nstall -m 444"
--End MAKE_ENV--
--PLIST_SUB--
OSREL=14.4 PREFIX=%D LOCALBASE=/usr/local RESETPREFIX=/usr/local LIB32DIR=lib DOCSDIR="share/doc/rayfish" EXAMPLESDIR="share/examples/rayfish" DATADIR="share/rayfish" WWWDIR="www/rayfish" ETCDIR="etc/rayfish"
--End PLIST_SUB--
--SUB_LIST--
PREFIX=/usr/local LOCALBASE=/usr/local DATADIR=/usr/local/share/rayfish DOCSDIR=/usr/local/share/doc/rayfish EXAMPLESDIR=/usr/local/share/examples/rayfish WWWDIR=/usr/local/www/rayfish ETCDIR=/usr/local/etc/rayfish
--End SUB_LIST--
---Begin make.conf---
USE_PACKAGE_DEPENDS=yes
BATCH=yes
WRKDIRPREFIX=/wrkdirs
PORTSDIR=/usr/ports
PACKAGES=/packages
DISTDIR=/distfiles
PACKAGE_BUILDING=yes
PACKAGE_BUILDING_FLAVORS=yes
MACHINE=i386
MACHINE_ARCH=i386
ARCH=${MACHINE_ARCH}
#### ####
# XXX: We really need this but cannot use it while 'make checksum' does not
# try the next mirror on checksum failure. It currently retries the same
# failed mirror and then fails rather then trying another. It *does*
# try the next if the size is mismatched though.
#MASTER_SITE_FREEBSD=yes
# Build ALLOW_MAKE_JOBS_PACKAGES with 3 jobs
MAKE_JOBS_NUMBER=3
#### Misc Poudriere ####
.include "/etc/make.conf.ports_env"
GID=0
UID=0
---End make.conf---
--Resource limits--
cpu time (seconds, -t) unlimited
file size (512-blocks, -f) unlimited
data seg size (kbytes, -d) 524288
stack size (kbytes, -s) 65536
core file size (512-blocks, -c) unlimited
max memory size (kbytes, -m) unlimited
locked memory (kbytes, -l) unlimited
max user processes (-u) 89999
open files (-n) 8192
virtual mem size (kbytes, -v) unlimited
swap limit (kbytes, -w) unlimited
socket buffer size (bytes, -b) unlimited
pseudo-terminals (-p) unlimited
kqueues (-k) unlimited
umtx shared locks (-o) unlimited
pipebuf (-y) unlimited
--End resource limits--
=======================<phase: check-sanity >============================
===== env: NO_DEPENDS=yes USER=root UID=0 GID=0
===> License MPL20 accepted by the user
===========================================================================
=======================<phase: pkg-depends >============================
===== env: USE_PACKAGE_DEPENDS_ONLY=1 USER=root UID=0 GID=0
===> rayfish-0.5.3 depends on file: /usr/local/sbin/pkg - not found
===> Installing existing package /packages/All/pkg-2.8.4.pkg
[144i386-quarterly-job-02] Installing pkg-2.8.4...
[144i386-quarterly-job-02] Extracting pkg-2.8.4: .......... done
===> rayfish-0.5.3 depends on file: /usr/local/sbin/pkg - found
===> Returning to build of rayfish-0.5.3
===========================================================================
=======================<phase: fetch-depends >============================
===== env: USE_PACKAGE_DEPENDS_ONLY=1 USER=root UID=0 GID=0
===========================================================================
=======================<phase: fetch >============================
===== env: NO_DEPENDS=yes USER=root UID=0 GID=0
===> License MPL20 accepted by the user
=> rust/crates/acto-0.8.2.crate doesn't seem to exist in /portdistfiles.
=> Attempting to fetch https://static.crates.io/crates/acto/acto-0.8.2.crate?dummy=/rust/crates/acto-0.8.2.crate
rust/crates/acto-0.8.2.crate 18 kB 17 MBps 00s
=> rust/crates/argon2-0.6.0.crate doesn't seem to exist in /portdistfiles.
=> Attempting to fetch https://static.crates.io/crates/argon2/argon2-0.6.0.crate?dummy=/rust/crates/argon2-0.6.0.crate
rust/crates/argon2-0.6.0.crate 33 kB 27 MBps 00s
=> rust/crates/askama-0.13.1.crate doesn't seem to exist in /portdistfiles.
=> Attempting to fetch https://static.crates.io/crates/askama/askama-0.13.1.crate?dummy=/rust/crates/askama-0.13.1.crate
rust/crates/askama-0.13.1.crate 40 kB 630 kBps 00s
=> rust/crates/askama_derive-0.13.1.crate doesn't seem to exist in /portdistfiles.
=> Attempting to fetch https://static.crates.io/crates/askama_derive/askama_derive-0.13.1.crate?dummy=/rust/crates/askama_derive-0.13.1.crate
rust/crates/askama_derive-0.13.1.crate 62 kB 483 kBps 01s
=> rust/crates/askama_parser-0.13.0.crate doesn't seem to exist in /portdistfiles.
=> Attempting to fetch https://static.crates.io/crates/askama_parser/askama_parser-0.13.0.crate?dummy=/rust/crates/askama_parser-0.13.0.crate
rust/crates/askama_parser-0.13.0.crate 56 kB 832 kBps 00s
=> rust/crates/bao-tree-0.16.1.crate doesn't seem to exist in /portdistfiles.
=> Attempting to fetch https://static.crates.io/crates/bao-tree/bao-tree-0.16.1.crate?dummy=/rust/crates/bao-tree-0.16.1.crate
rust/crates/bao-tree-0.16.1.crate 242 kB 1160 kBps 01s
=> rust/crates/bcrypt-pbkdf-0.11.0.crate doesn't seem to exist in /portdistfiles.
=> Attempting to fetch https://static.crates.io/crates/bcrypt-pbkdf/bcrypt-pbkdf-0.11.0.crate?dummy=/rust/crates/bcrypt-pbkdf-0.11.0.crate
rust/crates/bcrypt-pbkdf-0.11.0.crate 12 kB 65 MBps 00s
=> rust/crates/blowfish-0.10.0.crate doesn't seem to exist in /portdistfiles.
=> Attempting to fetch https://static.crates.io/crates/blowfish/blowfish-0.10.0.crate?dummy=/rust/crates/blowfish-0.10.0.crate
rust/crates/blowfish-0.10.0.crate 18 kB 28 MBps 00s
=> rust/crates/borsh-1.8.1.crate doesn't seem to exist in /portdistfiles.
=> Attempting to fetch https://static.crates.io/crates/borsh/borsh-1.8.1.crate?dummy=/rust/crates/borsh-1.8.1.crate
rust/crates/borsh-1.8.1.crate 83 kB 642 kBps 00s
=> rust/crates/clocksource-0.8.3.crate doesn't seem to exist in /portdistfiles.
=> Attempting to fetch https://static.crates.io/crates/clocksource/clocksource-0.8.3.crate?dummy=/rust/crates/clocksource-0.8.3.crate
rust/crates/clocksource-0.8.3.crate 16 kB 23 MBps 00s
=> rust/crates/cordyceps-0.3.5.crate doesn't seem to exist in /portdistfiles.
=> Attempting to fetch https://static.crates.io/crates/cordyceps/cordyceps-0.3.5.crate?dummy=/rust/crates/cordyceps-0.3.5.crate
rust/crates/cordyceps-0.3.5.crate 62 kB 819 kBps 00s
=> rust/crates/cssparser-macros-0.7.1.crate doesn't seem to exist in /portdistfiles.
=> Attempting to fetch https://static.crates.io/crates/cssparser-macros/cssparser-macros-0.7.1.crate?dummy=/rust/crates/cssparser-macros-0.7.1.crate
rust/crates/cssparser-macros-0.7.1.crate 8197 B 52 MBps 00s
=> rust/crates/curve25519-dalek-5.0.0-rc.0.crate doesn't seem to exist in /portdistfiles.
=> Attempting to fetch https://static.crates.io/crates/curve25519-dalek/curve25519-dalek-5.0.0-rc.0.crate?dummy=/rust/crates/curve25519-dalek-5.0.0-rc.0.crate
rust/crates/curve25519-dalek-5.0.0-rc.0.crate 338 kB 1216 kBps 00s
=> rust/crates/dom_query-0.28.0.crate doesn't seem to exist in /portdistfiles.
=> Attempting to fetch https://static.crates.io/crates/dom_query/dom_query-0.28.0.crate?dummy=/rust/crates/dom_query-0.28.0.crate
rust/crates/dom_query-0.28.0.crate 92 kB 674 kBps 00s
=> rust/crates/ecdsa-0.17.0-rc.18.crate doesn't seem to exist in /portdistfiles.
=> Attempting to fetch https://static.crates.io/crates/ecdsa/ecdsa-0.17.0-rc.18.crate?dummy=/rust/crates/ecdsa-0.17.0-rc.18.crate
rust/crates/ecdsa-0.17.0-rc.18.crate 36 kB 538 kBps 00s
=> rust/crates/ed25519-dalek-3.0.0-rc.0.crate doesn't seem to exist in /portdistfiles.
=> Attempting to fetch https://static.crates.io/crates/ed25519-dalek/ed25519-dalek-3.0.0-rc.0.crate?dummy=/rust/crates/ed25519-dalek-3.0.0-rc.0.crate
rust/crates/ed25519-dalek-3.0.0-rc.0.crate 99 kB 720 kBps 00s
<snip>
|
2435 | ["Size of mmsghdr"][::std::mem::size_of::<mmsghdr>() - 56usize];
| ^^^^^^^^^^^^^^^^^^^^^^^^^^^^^^^^^^^^^^^^^^ evaluation of `unix_bsd::bind::_` failed here
error[E0080]: attempt to compute `128_usize - 136_usize`, which would overflow
--> /wrkdirs/usr/ports/net/rayfish/work/rayfish-0.5.3/cargo-crates/route_manager-0.2.13/src/unix_bsd/freebsd_bindings.rs:2734:27
|
2734 | ["Size of group_req"][::std::mem::size_of::<group_req>() - 136usize];
| ^^^^^^^^^^^^^^^^^^^^^^^^^^^^^^^^^^^^^^^^^^^^^ evaluation of `unix_bsd::bind::_` failed here
error[E0080]: attempt to compute `252_usize - 264_usize`, which would overflow
--> /wrkdirs/usr/ports/net/rayfish/work/rayfish-0.5.3/cargo-crates/route_manager-0.2.13/src/unix_bsd/freebsd_bindings.rs:2749:34
|
2749 | ["Size of group_source_req"][::std::mem::size_of::<group_source_req>() - 264usize];
| ^^^^^^^^^^^^^^^^^^^^^^^^^^^^^^^^^^^^^^^^^^^^^^^^^^^^ evaluation of `unix_bsd::bind::_` failed here
error[E0080]: attempt to compute `140_usize - 152_usize`, which would overflow
--> /wrkdirs/usr/ports/net/rayfish/work/rayfish-0.5.3/cargo-crates/route_manager-0.2.13/src/unix_bsd/freebsd_bindings.rs:2769:31
|
2769 | ["Size of __msfilterreq"][::std::mem::size_of::<__msfilterreq>() - 152usize];
| ^^^^^^^^^^^^^^^^^^^^^^^^^^^^^^^^^^^^^^^^^^^^^^^^^ evaluation of `unix_bsd::bind::_` failed here
error[E0080]: attempt to compute `48_usize - 64_usize`, which would overflow
--> /wrkdirs/usr/ports/net/rayfish/work/rayfish-0.5.3/cargo-crates/route_manager-0.2.13/src/unix_bsd/freebsd_bindings.rs:2918:27
|
2918 | ["Size of route_in6"][::std::mem::size_of::<route_in6>() - 64usize];
| ^^^^^^^^^^^^^^^^^^^^^^^^^^^^^^^^^^^^^^^^^^^^ evaluation of `unix_bsd::bind::_` failed here
error[E0080]: attempt to compute `36_usize - 48_usize`, which would overflow
--> /wrkdirs/usr/ports/net/rayfish/work/rayfish-0.5.3/cargo-crates/route_manager-0.2.13/src/unix_bsd/freebsd_bindings.rs:3252:23
|
3252 | ["Size of route"][::std::mem::size_of::<route>() - 48usize];
| ^^^^^^^^^^^^^^^^^^^^^^^^^^^^^^^^^^^^^^^^ evaluation of `unix_bsd::bind::_` failed here
error[E0080]: attempt to compute `56_usize - 112_usize`, which would overflow
--> /wrkdirs/usr/ports/net/rayfish/work/rayfish-0.5.3/cargo-crates/route_manager-0.2.13/src/unix_bsd/freebsd_bindings.rs:3282:28
|
3282 | ["Size of rt_metrics"][::std::mem::size_of::<rt_metrics>() - 112usize];
| ^^^^^^^^^^^^^^^^^^^^^^^^^^^^^^^^^^^^^^^^^^^^^^ evaluation of `unix_bsd::bind::_` failed here
error[E0080]: attempt to compute `4_usize - 8_usize`, which would overflow
--> /wrkdirs/usr/ports/net/rayfish/work/rayfish-0.5.3/cargo-crates/route_manager-0.2.13/src/unix_bsd/freebsd_bindings.rs:3328:29
|
3328 | ["Alignment of rtstat"][::std::mem::align_of::<rtstat>() - 8usize];
| ^^^^^^^^^^^^^^^^^^^^^^^^^^^^^^^^^^^^^^^^^ evaluation of `unix_bsd::bind::_` failed here
error[E0080]: attempt to compute `92_usize - 152_usize`, which would overflow
--> /wrkdirs/usr/ports/net/rayfish/work/rayfish-0.5.3/cargo-crates/route_manager-0.2.13/src/unix_bsd/freebsd_bindings.rs:3369:27
|
3369 | ["Size of rt_msghdr"][::std::mem::size_of::<rt_msghdr>() - 152usize];
| ^^^^^^^^^^^^^^^^^^^^^^^^^^^^^^^^^^^^^^^^^^^^^ evaluation of `unix_bsd::bind::_` failed here
error[E0080]: attempt to compute `68_usize - 128_usize`, which would overflow
--> /wrkdirs/usr/ports/net/rayfish/work/rayfish-0.5.3/cargo-crates/route_manager-0.2.13/src/unix_bsd/freebsd_bindings.rs:3422:29
|
3422 | ["Size of rt_addrinfo"][::std::mem::size_of::<rt_addrinfo>() - 128usize];
| ^^^^^^^^^^^^^^^^^^^^^^^^^^^^^^^^^^^^^^^^^^^^^^^ evaluation of `unix_bsd::bind::_` failed here
error[E0080]: attempt to compute `12_usize - 16_usize`, which would overflow
--> /wrkdirs/usr/ports/net/rayfish/work/rayfish-0.5.3/cargo-crates/route_manager-0.2.13/src/unix_bsd/freebsd_bindings.rs:3521:25
|
3521 | ["Size of bintime"][::std::mem::size_of::<bintime>() - 16usize];
| ^^^^^^^^^^^^^^^^^^^^^^^^^^^^^^^^^^^^^^^^^^ evaluation of `unix_bsd::bind::_` failed here
error[E0080]: attempt to compute `16_usize - 32_usize`, which would overflow
--> /wrkdirs/usr/ports/net/rayfish/work/rayfish-0.5.3/cargo-crates/route_manager-0.2.13/src/unix_bsd/freebsd_bindings.rs:3534:27
|
3534 | ["Size of itimerval"][::std::mem::size_of::<itimerval>() - 32usize];
| ^^^^^^^^^^^^^^^^^^^^^^^^^^^^^^^^^^^^^^^^^^^^ evaluation of `unix_bsd::bind::_` failed here
error[E0080]: attempt to compute `44_usize - 56_usize`, which would overflow
--> /wrkdirs/usr/ports/net/rayfish/work/rayfish-0.5.3/cargo-crates/route_manager-0.2.13/src/unix_bsd/freebsd_bindings.rs:3576:20
|
3576 | ["Size of tm"][::std::mem::size_of::<tm>() - 56usize];
| ^^^^^^^^^^^^^^^^^^^^^^^^^^^^^^^^^^^^^ evaluation of `unix_bsd::bind::_` failed here
error[E0080]: attempt to compute `12_usize - 16_usize`, which would overflow
--> /wrkdirs/usr/ports/net/rayfish/work/rayfish-0.5.3/cargo-crates/route_manager-0.2.13/src/unix_bsd/freebsd_bindings.rs:3799:29
|
3799 | ["Size of if_clonereq"][::std::mem::size_of::<if_clonereq>() - 16usize];
| ^^^^^^^^^^^^^^^^^^^^^^^^^^^^^^^^^^^^^^^^^^^^^^ evaluation of `unix_bsd::bind::_` failed here
error[E0080]: attempt to compute `4_usize - 8_usize`, which would overflow
--> /wrkdirs/usr/ports/net/rayfish/work/rayfish-0.5.3/cargo-crates/route_manager-0.2.13/src/unix_bsd/freebsd_bindings.rs:3847:10
|
3847 | [::std::mem::align_of::<if_data__bindgen_ty_1>() - 8usize];
| ^^^^^^^^^^^^^^^^^^^^^^^^^^^^^^^^^^^^^^^^^^^^^^^^^^^^^^^^ evaluation of `unix_bsd::bind::_` failed here
error[E0080]: attempt to compute `4_usize - 8_usize`, which would overflow
--> /wrkdirs/usr/ports/net/rayfish/work/rayfish-0.5.3/cargo-crates/route_manager-0.2.13/src/unix_bsd/freebsd_bindings.rs:3870:10
|
3870 | [::std::mem::align_of::<if_data__bindgen_ty_2__bindgen_ty_1>() - 8usize];
| ^^^^^^^^^^^^^^^^^^^^^^^^^^^^^^^^^^^^^^^^^^^^^^^^^^^^^^^^^^^^^^^^^^^^^^ evaluation of `unix_bsd::bind::_` failed here
error[E0080]: attempt to compute `4_usize - 8_usize`, which would overflow
--> /wrkdirs/usr/ports/net/rayfish/work/rayfish-0.5.3/cargo-crates/route_manager-0.2.13/src/unix_bsd/freebsd_bindings.rs:3880:10
|
3880 | [::std::mem::align_of::<if_data__bindgen_ty_2>() - 8usize];
| ^^^^^^^^^^^^^^^^^^^^^^^^^^^^^^^^^^^^^^^^^^^^^^^^^^^^^^^^ evaluation of `unix_bsd::bind::_` failed here
error[E0080]: attempt to compute `4_usize - 8_usize`, which would overflow
--> /wrkdirs/usr/ports/net/rayfish/work/rayfish-0.5.3/cargo-crates/route_manager-0.2.13/src/unix_bsd/freebsd_bindings.rs:3889:30
|
3889 | ["Alignment of if_data"][::std::mem::align_of::<if_data>() - 8usize];
| ^^^^^^^^^^^^^^^^^^^^^^^^^^^^^^^^^^^^^^^^^^ evaluation of `unix_bsd::bind::_` failed here
error[E0080]: attempt to compute `4_usize - 8_usize`, which would overflow
--> /wrkdirs/usr/ports/net/rayfish/work/rayfish-0.5.3/cargo-crates/route_manager-0.2.13/src/unix_bsd/freebsd_bindings.rs:3949:32
|
3949 | ["Alignment of if_msghdr"][::std::mem::align_of::<if_msghdr>() - 8usize];
| ^^^^^^^^^^^^^^^^^^^^^^^^^^^^^^^^^^^^^^^^^^^^ evaluation of `unix_bsd::bind::_` failed here
error[E0080]: attempt to compute `4_usize - 8_usize`, which would overflow
--> /wrkdirs/usr/ports/net/rayfish/work/rayfish-0.5.3/cargo-crates/route_manager-0.2.13/src/unix_bsd/freebsd_bindings.rs:3983:33
|
3983 | ["Alignment of if_msghdrl"][::std::mem::align_of::<if_msghdrl>() - 8usize];
| ^^^^^^^^^^^^^^^^^^^^^^^^^^^^^^^^^^^^^^^^^^^^^ evaluation of `unix_bsd::bind::_` failed here
error[E0080]: attempt to compute `4_usize - 8_usize`, which would overflow
--> /wrkdirs/usr/ports/net/rayfish/work/rayfish-0.5.3/cargo-crates/route_manager-0.2.13/src/unix_bsd/freebsd_bindings.rs:4057:34
|
4057 | ["Alignment of ifa_msghdrl"][::std::mem::align_of::<ifa_msghdrl>() - 8usize];
| ^^^^^^^^^^^^^^^^^^^^^^^^^^^^^^^^^^^^^^^^^^^^^^ evaluation of `unix_bsd::bind::_` failed here
error[E0080]: attempt to compute `8_usize - 16_usize`, which would overflow
--> /wrkdirs/usr/ports/net/rayfish/work/rayfish-0.5.3/cargo-crates/route_manager-0.2.13/src/unix_bsd/freebsd_bindings.rs:4146:30
|
4146 | ["Size of ifreq_buffer"][::std::mem::size_of::<ifreq_buffer>() - 16usize];
| ^^^^^^^^^^^^^^^^^^^^^^^^^^^^^^^^^^^^^^^^^^^^^^^ evaluation of `unix_bsd::bind::_` failed here
error[E0080]: attempt to compute `4_usize - 8_usize`, which would overflow
--> /wrkdirs/usr/ports/net/rayfish/work/rayfish-0.5.3/cargo-crates/route_manager-0.2.13/src/unix_bsd/freebsd_bindings.rs:4181:42
|
4181 | ["Alignment of ifreq__bindgen_ty_1"][::std::mem::align_of::<ifreq__bindgen_ty_1>() - 8usize];
| ^^^^^^^^^^^^^^^^^^^^^^^^^^^^^^^^^^^^^^^^^^^^^^^^^^^^^^ evaluation of `unix_bsd::bind::_` failed here
error[E0080]: attempt to compute `4_usize - 8_usize`, which would overflow
--> /wrkdirs/usr/ports/net/rayfish/work/rayfish-0.5.3/cargo-crates/route_manager-0.2.13/src/unix_bsd/freebsd_bindings.rs:4216:28
|
4216 | ["Alignment of ifreq"][::std::mem::align_of::<ifreq>() - 8usize];
| ^^^^^^^^^^^^^^^^^^^^^^^^^^^^^^^^^^^^^^^^ evaluation of `unix_bsd::bind::_` failed here
error[E0080]: attempt to compute `40_usize - 48_usize`, which would overflow
--> /wrkdirs/usr/ports/net/rayfish/work/rayfish-0.5.3/cargo-crates/route_manager-0.2.13/src/unix_bsd/freebsd_bindings.rs:4278:28
|
4278 | ["Size of ifmediareq"][::std::mem::size_of::<ifmediareq>() - 48usize];
| ^^^^^^^^^^^^^^^^^^^^^^^^^^^^^^^^^^^^^^^^^^^^^ evaluation of `unix_bsd::bind::_` failed here
error[E0080]: attempt to compute `28_usize - 40_usize`, which would overflow
--> /wrkdirs/usr/ports/net/rayfish/work/rayfish-0.5.3/cargo-crates/route_manager-0.2.13/src/unix_bsd/freebsd_bindings.rs:4305:23
|
4305 | ["Size of ifdrv"][::std::mem::size_of::<ifdrv>() - 40usize];
| ^^^^^^^^^^^^^^^^^^^^^^^^^^^^^^^^^^^^^^^^ evaluation of `unix_bsd::bind::_` failed here
error[E0080]: attempt to compute `4_usize - 8_usize`, which would overflow
--> /wrkdirs/usr/ports/net/rayfish/work/rayfish-0.5.3/cargo-crates/route_manager-0.2.13/src/unix_bsd/freebsd_bindings.rs:4339:38
|
4339 | ["Size of ifconf__bindgen_ty_1"][::std::mem::size_of::<ifconf__bindgen_ty_1>() - 8usize];
| ^^^^^^^^^^^^^^^^^^^^^^^^^^^^^^^^^^^^^^^^^^^^^^^^^^^^^^ evaluation of `unix_bsd::bind::_` failed here
error[E0080]: attempt to compute `8_usize - 16_usize`, which would overflow
--> /wrkdirs/usr/ports/net/rayfish/work/rayfish-0.5.3/cargo-crates/route_manager-0.2.13/src/unix_bsd/freebsd_bindings.rs:4348:24
|
4348 | ["Size of ifconf"][::std::mem::size_of::<ifconf>() - 16usize];
| ^^^^^^^^^^^^^^^^^^^^^^^^^^^^^^^^^^^^^^^^^ evaluation of `unix_bsd::bind::_` failed here
error[E0080]: attempt to compute `4_usize - 8_usize`, which would overflow
--> /wrkdirs/usr/ports/net/rayfish/work/rayfish-0.5.3/cargo-crates/route_manager-0.2.13/src/unix_bsd/freebsd_bindings.rs:4399:10
|
4399 | [::std::mem::align_of::<ifgroupreq__bindgen_ty_1>() - 8usize];
| ^^^^^^^^^^^^^^^^^^^^^^^^^^^^^^^^^^^^^^^^^^^^^^^^^^^^^^^^^^^ evaluation of `unix_bsd::bind::_` failed here
error[E0080]: attempt to compute `36_usize - 40_usize`, which would overflow
--> /wrkdirs/usr/ports/net/rayfish/work/rayfish-0.5.3/cargo-crates/route_manager-0.2.13/src/unix_bsd/freebsd_bindings.rs:4407:28
|
4407 | ["Size of ifgroupreq"][::std::mem::size_of::<ifgroupreq>() - 40usize];
| ^^^^^^^^^^^^^^^^^^^^^^^^^^^^^^^^^^^^^^^^^^^^^ evaluation of `unix_bsd::bind::_` failed here
error[E0080]: attempt to compute `8_usize - 16_usize`, which would overflow
--> /wrkdirs/usr/ports/net/rayfish/work/rayfish-0.5.3/cargo-crates/route_manager-0.2.13/src/unix_bsd/freebsd_bindings.rs:4511:30
|
4511 | ["Size of if_nameindex"][::std::mem::size_of::<if_nameindex>() - 16usize];
| ^^^^^^^^^^^^^^^^^^^^^^^^^^^^^^^^^^^^^^^^^^^^^^^ evaluation of `unix_bsd::bind::_` failed here
error[E0080]: attempt to compute `16_usize - 24_usize`, which would overflow
--> /wrkdirs/usr/ports/net/rayfish/work/rayfish-0.5.3/cargo-crates/route_manager-0.2.13/src/unix_bsd/freebsd_bindings.rs:4544:31
|
4544 | ["Size of __va_list_tag"][::std::mem::size_of::<__va_list_tag>() - 24usize];
| ^^^^^^^^^^^^^^^^^^^^^^^^^^^^^^^^^^^^^^^^^^^^^^^^ evaluation of `unix_bsd::bind::_` failed here
For more information about this error, try `rustc --explain E0080`.
error: could not compile `route_manager` (lib) due to 59 previous errors
Caused by:
process didn't exit successfully: `CARGO=/usr/local/bin/cargo CARGO_CRATE_NAME=route_manager CARGO_MANIFEST_DIR=/wrkdirs/usr/ports/net/rayfish/work/rayfish-0.5.3/cargo-crates/route_manager-0.2.13 CARGO_MANIFEST_PATH=/wrkdirs/usr/ports/net/rayfish/work/rayfish-0.5.3/cargo-crates/route_manager-0.2.13/Cargo.toml CARGO_PKG_AUTHORS='' CARGO_PKG_DESCRIPTION='Cross-platform route management interface' CARGO_PKG_HOMEPAGE='' CARGO_PKG_LICENSE=Apache-2.0 CARGO_PKG_LICENSE_FILE='' CARGO_PKG_NAME=route_manager CARGO_PKG_README=README.md CARGO_PKG_REPOSITORY='https://github.com/tun-rs/route_manager' CARGO_PKG_RUST_VERSION='' CARGO_PKG_VERSION=0.2.13 CARGO_PKG_VERSION_MAJOR=0 CARGO_PKG_VERSION_MINOR=2 CARGO_PKG_VERSION_PATCH=13 CARGO_PKG_VERSION_PRE='' LD_LIBRARY_PATH=/wrkdirs/usr/ports/net/rayfish/work/target/release/deps OUT_DIR=/wrkdirs/usr/ports/net/rayfish/work/target/release/build/route_manager-c0021d0a588efa97/out /usr/local/bin/rustc --crate-name route_manager --edition=2021 /wr
kdirs/usr/ports/net/rayfish/work/rayfish-0.5.3/cargo-crates/route_manager-0.2.13/src/lib.rs --error-format=json --json=diagnostic-rendered-ansi,artifacts,future-incompat --crate-type staticlib --crate-type cdylib --crate-type lib --emit=dep-info,link -C opt-level=3 -C panic=abort -C codegen-units=1 --cfg 'feature="default"' --check-cfg 'cfg(docsrs,test)' --check-cfg 'cfg(feature, values("async", "async-io", "async_io", "bindgen", "default", "shutdown", "tokio"))' -C metadata=c1f32a27e2b64458 -C extra-filename=-4a75505537a67b8b --out-dir /wrkdirs/usr/ports/net/rayfish/work/target/release/deps -C strip=symbols -L dependency=/wrkdirs/usr/ports/net/rayfish/work/target/release/deps --extern libc=/wrkdirs/usr/ports/net/rayfish/work/target/release/deps/liblibc-86bbd55cfb0415ae.rlib --cap-lints warn -C linker=cc` (exit status: 1)
warning: build failed, waiting for other jobs to finish...
*** Error code 101
Stop.
make: stopped making "build" in /usr/ports/net/rayfish