[package - main-amd64-default][databases/surrealdb] Failed for surrealdb-3.0.5_6 in build

From: <pkg-fallout_at_FreeBSD.org>
Date: Sun, 04 Oct 2026 01:36:25 UTC
You are receiving this mail as a port that you maintain
is failing to build on the FreeBSD package build server.
Please investigate the failure and submit a PR to fix
build.

Maintainer:     yuri@FreeBSD.org
Log URL:        https://pkg-status.freebsd.org/beefy24/data/main-amd64-default/p67f48ac8ea19_s6e1436d748/logs/surrealdb-3.0.5_6.log
Build URL:      https://pkg-status.freebsd.org/beefy24/build.html?mastername=main-amd64-default&build=p67f48ac8ea19_s6e1436d748
Log:

=>> Building databases/surrealdb
build started at Sun Oct  4 01:24:39 UTC 2026
port directory: /usr/ports/databases/surrealdb
package name: surrealdb-3.0.5_6
building for: FreeBSD main-amd64-default-job-36 16.0-CURRENT FreeBSD 16.0-CURRENT 1600022 amd64
maintained by: yuri@FreeBSD.org
Makefile datestamp: -rw-r--r--  1 root wheel 20778 Sep 10 01:01 /usr/ports/databases/surrealdb/Makefile
Ports top last git commit: 67f48ac8ea194f1746214ff18095e08c2e8244da
Ports top unclean checkout: no
Port dir last git commit: 7316461925010f8a4e9d9476ae39ec5a33d89f3d
Port dir unclean checkout: no
Poudriere version: poudriere-git-3.4.8-3-gd92fb7c0
Host OSVERSION: 1600022
Jail OSVERSION: 1600022
Job Id: 36

---Begin Environment---
SHELL=/bin/sh
OSVERSION=1600022
UNAME_v=FreeBSD 16.0-CURRENT 1600022
UNAME_r=16.0-CURRENT
BLOCKSIZE=K
MAIL=/var/mail/root
MM_CHARSET=UTF-8
LANG=C.UTF-8
STATUS=1
HOME=/root
PATH=/sbin:/bin:/usr/sbin:/usr/bin:/usr/local/sbin:/usr/local/bin:/root/bin
MAKE_OBJDIR_CHECK_WRITABLE=0
LOCALBASE=/usr/local
USER=root
POUDRIERE_NAME=poudriere-git
LIBEXECPREFIX=/usr/local/libexec/poudriere
POUDRIERE_VERSION=3.4.8-3-gd92fb7c0
MASTERMNT=/usr/local/poudriere/data/.m/main-amd64-default/ref
LC_COLLATE=C
POUDRIERE_BUILD_TYPE=bulk
PACKAGE_BUILDING=yes
SAVED_TERM=
OUTPUT_REDIRECTED_STDERR=4
OUTPUT_REDIRECTED=1
PWD=/usr/local/poudriere/data/.m/main-amd64-default/36/.p
OUTPUT_REDIRECTED_STDOUT=3
P_PORTS_FEATURES=FLAVORS SUBPACKAGES SELECTED_OPTIONS
MASTERNAME=main-amd64-default
SCRIPTPREFIX=/usr/local/share/poudriere
SCRIPTNAME=bulk.sh
OLDPWD=/usr/local/poudriere/data/.m/main-amd64-default/ref/.p/pool
POUDRIERE_PKGNAME=poudriere-git-3.4.8-3-gd92fb7c0
SCRIPTPATH=/usr/local/share/poudriere/bulk.sh
POUDRIEREPATH=/usr/local/bin/poudriere
---End Environment---

---Begin Poudriere Port Flags/Env---
PORT_FLAGS=
PKGENV=
FLAVOR=
MAKE_ARGS=
---End Poudriere Port Flags/Env---

---Begin OPTIONS List---
---End OPTIONS List---

--MAINTAINER--
yuri@FreeBSD.org
--End MAINTAINER--

--CONFIGURE_ARGS--

--End CONFIGURE_ARGS--

--CONFIGURE_ENV--
PKG_CONFIG=pkgconf XDG_DATA_HOME=/wrkdirs/usr/ports/databases/surrealdb/work  XDG_CONFIG_HOME=/wrkdirs/usr/ports/databases/surrealdb/work  XDG_CACHE_HOME=/wrkdirs/usr/ports/databases/surrealdb/work/.cache  HOME=/wrkdirs/usr/ports/databases/surrealdb/work TMPDIR="/wrkdirs/usr/ports/databases/surrealdb/work" PATH=/wrkdirs/usr/ports/databases/surrealdb/work/.bin:/sbin:/bin:/usr/sbin:/usr/bin:/usr/local/sbin:/usr/local/bin:/root/bin PKG_CONFIG_LIBDIR=/wrkdirs/usr/ports/databases/surrealdb/work/.pkgconfig:/usr/local/libdata/pkgconfig:/usr/local/share/pkgconfig:/usr/libdata/pkgconfig SHELL=/bin/sh CONFIG_SHELL=/bin/sh
--End CONFIGURE_ENV--

--MAKE_ENV--
XDG_DATA_HOME=/wrkdirs/usr/ports/databases/surrealdb/work  XDG_CONFIG_HOME=/wrkdirs/usr/ports/databases/surrealdb/work  XDG_CACHE_HOME=/wrkdirs/usr/ports/databases/surrealdb/work/.cache  HOME=/wrkdirs/usr/ports/databases/surrealdb/work TMPDIR="/wrkdirs/usr/ports/databases/surrealdb/work" PATH=/wrkdirs/usr/ports/databases/surrealdb/work/.bin:/sbin:/bin:/usr/sbin:/usr/bin:/usr/local/sbin:/usr/local/bin:/root/bin PKG_CONFIG_LIBDIR=/wrkdirs/usr/ports/databases/surrealdb/work/.pkgconfig:/usr/local/libdata/pkgconfig:/usr/local/share/pkgconfig:/usr/libdata/pkgconfig MK_DEBUG_FILES=no MK_KERNEL_SYMBOLS=no SHELL=/bin/sh NO_LINT=YES PREFIX=/usr/local  LOCALBASE=/usr/local  CC="/usr/local/llvm15/bin/clang" CFLAGS="-O2 -pipe  -fstack-protector-strong -fno-strict-aliasing "  CPP="/usr/local/llvm15/bin/clang-cpp" CPPFLAGS=""  LDFLAGS=" " LIBS=""  CXX="/usr/local/llvm15/bin/clang++" CXXFLAGS="-O2 -pipe -fstack-protector-strong -fno-strict-aliasing   " BSD_INSTALL_PROGRAM="install  -s -m 55
5"  BSD_INSTALL_LIB="install  -s -m 0644"  BSD_INSTALL_SCRIPT="install  -m 555"  BSD_INSTALL_DATA="install  -m 0644"  BSD_INSTALL_MAN="install  -m 444"
--End MAKE_ENV--

--PLIST_SUB--
OSREL=16.0 PREFIX=%D LOCALBASE=/usr/local  RESETPREFIX=/usr/local LIB32DIR=lib DOCSDIR="share/doc/surrealdb"  EXAMPLESDIR="share/examples/surrealdb"  DATADIR="share/surrealdb"  WWWDIR="www/surrealdb"  ETCDIR="etc/surrealdb"
--End PLIST_SUB--

--SUB_LIST--
PREFIX=/usr/local LOCALBASE=/usr/local  DATADIR=/usr/local/share/surrealdb DOCSDIR=/usr/local/share/doc/surrealdb EXAMPLESDIR=/usr/local/share/examples/surrealdb  WWWDIR=/usr/local/www/surrealdb ETCDIR=/usr/local/etc/surrealdb
--End SUB_LIST--

---Begin make.conf---
USE_PACKAGE_DEPENDS=yes
BATCH=yes
WRKDIRPREFIX=/wrkdirs
PORTSDIR=/usr/ports
PACKAGES=/packages
DISTDIR=/distfiles
PACKAGE_BUILDING=yes
PACKAGE_BUILDING_FLAVORS=yes
####  ####
# XXX: We really need this but cannot use it while 'make checksum' does not
# try the next mirror on checksum failure.  It currently retries the same
# failed mirror and then fails rather then trying another.  It *does*
# try the next if the size is mismatched though.
#MASTER_SITE_FREEBSD=yes
# Build ALLOW_MAKE_JOBS_PACKAGES with 3 jobs
MAKE_JOBS_NUMBER=3
#### Misc Poudriere ####
.include "/etc/make.conf.ports_env"
GID=0
UID=0
---End make.conf---
--Resource limits--
cpu time               (seconds, -t)  unlimited
file size           (512-blocks, -f)  unlimited
data seg size           (kbytes, -d)  33554432
stack size              (kbytes, -s)  524288
core file size      (512-blocks, -c)  unlimited
max memory size         (kbytes, -m)  unlimited
locked memory           (kbytes, -l)  unlimited
max user processes              (-u)  89999
open files                      (-n)  8192
virtual mem size        (kbytes, -v)  unlimited
swap limit              (kbytes, -w)  unlimited
socket buffer size       (bytes, -b)  unlimited
pseudo-terminals                (-p)  unlimited
kqueues                         (-k)  unlimited
umtx shared locks               (-o)  unlimited
pipebuf                 (kbytes, -y)  unlimited
virtual machines                (-V)  unlimited
--End resource limits--
=======================<phase: check-sanity   >============================
===== env: NO_DEPENDS=yes USER=root UID=0 GID=0
===>  License BSL11 accepted by the user
===========================================================================
=======================<phase: pkg-depends    >============================
===== env: USE_PACKAGE_DEPENDS_ONLY=1 USER=root UID=0 GID=0
===>   surrealdb-3.0.5_6 depends on file: /usr/local/sbin/pkg - not found
===>   Installing existing package /packages/All/pkg-2.8.4.pkg
[main-amd64-default-job-36] Installing pkg-2.8.4...
[main-amd64-default-job-36] Extracting pkg-2.8.4: .......... done
===>   surrealdb-3.0.5_6 depends on file: /usr/local/sbin/pkg - found
===>   Returning to build of surrealdb-3.0.5_6
===========================================================================
=======================<phase: fetch-depends  >============================
===== env: USE_PACKAGE_DEPENDS_ONLY=1 USER=root UID=0 GID=0
===========================================================================
=======================<phase: fetch          >============================
===== env: NO_DEPENDS=yes USER=root UID=0 GID=0
===>  License BSL11 accepted by the user
=> rust/crates/anstream-0.6.21.crate doesn't seem to exist in /portdistfiles.
=> Attempting to fetch https://static.crates.io/crates/anstream/anstream-0.6.21.crate?dummy=/rust/crates/anstream-0.6.21.crate
rust/crates/anstream-0.6.21.crate                       28 kB 3940 kBps    00s
=> rust/crates/anstyle-1.0.13.crate doesn't seem to exist in /portdistfiles.
=> Attempting to fetch https://static.crates.io/crates/anstyle/anstyle-1.0.13.crate?dummy=/rust/crates/anstyle-1.0.13.crate
rust/crates/anstyle-1.0.13.crate                        17 kB 6693 kBps    00s
=> rust/crates/anstyle-parse-0.2.7.crate doesn't seem to exist in /portdistfiles.
=> Attempting to fetch https://static.crates.io/crates/anstyle-parse/anstyle-parse-0.2.7.crate?dummy=/rust/crates/anstyle-parse-0.2.7.crate
rust/crates/anstyle-parse-0.2.7.crate                   21 kB 4458 kBps    00s
=> rust/crates/anyhow-1.0.100.crate doesn't seem to exist in /portdistfiles.
=> Attempting to fetch https://static.crates.io/crates/anyhow/anyhow-1.0.100.crate?dummy=/rust/crates/anyhow-1.0.100.crate
rust/crates/anyhow-1.0.100.crate                        52 kB 2935 kBps    00s
=> rust/crates/argon2-0.5.3.crate doesn't seem to exist in /portdistfiles.
=> Attempting to fetch https://static.crates.io/crates/argon2/argon2-0.5.3.crate?dummy=/rust/crates/argon2-0.5.3.crate
rust/crates/argon2-0.5.3.crate                          28 kB 4707 kBps    00s
=> rust/crates/async-lock-3.4.2.crate doesn't seem to exist in /portdistfiles.
=> Attempting to fetch https://static.crates.io/crates/async-lock/async-lock-3.4.2.crate?dummy=/rust/crates/async-lock-3.4.2.crate
rust/crates/async-lock-3.4.2.crate                      38 kB 4641 kBps    00s
=> rust/crates/async-stream-0.3.6.crate doesn't seem to exist in /portdistfiles.
=> Attempting to fetch https://static.crates.io/crates/async-stream/async-stream-0.3.6.crate?dummy=/rust/crates/async-stream-0.3.6.crate
rust/crates/async-stream-0.3.6.crate                    13 kB 6361 kBps    00s
=> rust/crates/async-stream-impl-0.3.6.crate doesn't seem to exist in /portdistfiles.
=> Attempting to fetch https://static.crates.io/crates/async-stream-impl/async-stream-impl-0.3.6.crate?dummy=/rust/crates/async-stream-impl-0.3.6.crate
rust/crates/async-stream-impl-0.3.6.crate             4312  B   33 MBps    00s
=> rust/crates/bitflags-2.10.0.crate doesn't seem to exist in /portdistfiles.
=> Attempting to fetch https://static.crates.io/crates/bitflags/bitflags-2.10.0.crate?dummy=/rust/crates/bitflags-2.10.0.crate
rust/crates/bitflags-2.10.0.crate                       47 kB 2786 kBps    00s
=> rust/crates/blowfish-0.9.1.crate doesn't seem to exist in /portdistfiles.
=> Attempting to fetch https://static.crates.io/crates/blowfish/blowfish-0.9.1.crate?dummy=/rust/crates/blowfish-0.9.1.crate
rust/crates/blowfish-0.9.1.crate                        16 kB  118 MBps    00s
=> rust/crates/borsh-1.6.0.crate doesn't seem to exist in /portdistfiles.
=> Attempting to fetch https://static.crates.io/crates/borsh/borsh-1.6.0.crate?dummy=/rust/crates/borsh-1.6.0.crate
rust/crates/borsh-1.6.0.crate                           80 kB 3274 kBps    00s
=> rust/crates/bumpalo-3.19.1.crate doesn't seem to exist in /portdistfiles.
=> Attempting to fetch https://static.crates.io/crates/bumpalo/bumpalo-3.19.1.crate?dummy=/rust/crates/bumpalo-3.19.1.crate
rust/crates/bumpalo-3.19.1.crate                        94 kB 3820 kBps    00s
=> rust/crates/bzip2-sys-0.1.13+1.0.8.crate doesn't seem to exist in /portdistfiles.
=> Attempting to fetch https://static.crates.io/crates/bzip2-sys/bzip2-sys-0.1.13+1.0.8.crate?dummy=/rust/crates/bzip2-sys-0.1.13+1.0.8.crate
rust/crates/bzip2-sys-0.1.13+1.0.8.crate               618 kB 7360 kBps    00s
=> rust/crates/chrono-0.4.43.crate doesn't seem to exist in /portdistfiles.
=> Attempting to fetch https://static.crates.io/crates/chrono/chrono-0.4.43.crate?dummy=/rust/crates/chrono-0.4.43.crate
rust/crates/chrono-0.4.43.crate                        234 kB 4918 kBps    00s
=> rust/crates/colorchoice-1.0.4.crate doesn't seem to exist in /portdistfiles.
=> Attempting to fetch https://static.crates.io/crates/colorchoice/colorchoice-1.0.4.crate?dummy=/rust/crates/colorchoice-1.0.4.crate
rust/crates/colorchoice-1.0.4.crate                   8196  B   58 MBps    00s
=> rust/crates/der-0.7.10.crate doesn't seem to exist in /portdistfiles.
=> Attempting to fetch https://static.crates.io/crates/der/der-0.7.10.crate?dummy=/rust/crates/der-0.7.10.crate
rust/crates/der-0.7.10.crate                            87 kB 3506 kBps    00s
=> rust/crates/deranged-0.5.5.crate doesn't seem to exist in /portdistfiles.
=> Attempting to fetch https://static.crates.io/crates/deranged/deranged-0.5.5.crate?dummy=/rust/crates/deranged-0.5.5.crate
rust/crates/deranged-0.5.5.crate                        23 kB 4221 kBps    00s
=> rust/crates/ed25519-dalek-2.2.0.crate doesn't seem to exist in /portdistfiles.
<snip>
  cargo:warning=In file included from /wrkdirs/usr/ports/databases/surrealdb/work/surrealdb-3.0.5/cargo-crates/cxx-1.0.192/src/cxx.cc:1:
  cargo:warning=In file included from /wrkdirs/usr/ports/databases/surrealdb/work/surrealdb-3.0.5/cargo-crates/cxx-1.0.192/src/../include/cxx.h:2:
  cargo:warning=In file included from /usr/include/c++/v1/algorithm:1845:
  cargo:warning=In file included from /usr/include/c++/v1/__algorithm/binary_search.h:14:
  cargo:warning=In file included from /usr/include/c++/v1/__algorithm/lower_bound.h:13:
  cargo:warning=In file included from /usr/include/c++/v1/__algorithm/half_positive.h:15:
  cargo:warning=/usr/include/c++/v1/__type_traits/make_unsigned.h:70:69: error: use of undeclared identifier '__remove_cv_t'
  cargo:warning=using __make_unsigned_t = __copy_cv_t<_Tp, typename __make_unsigned<__remove_cv_t<_Tp> >::type>;
  cargo:warning=                                                                    ^
  cargo:warning=/usr/include/c++/v1/__type_traits/make_unsigned.h:76:32: error: no template named '__make_unsigned_t'; did you mean '__make_unsigned'?
  cargo:warning=  using type _LIBCPP_NODEBUG = __make_unsigned_t<_Tp>;
  cargo:warning=                               ^
  cargo:warning=/usr/include/c++/v1/__type_traits/make_unsigned.h:46:8: note: '__make_unsigned' declared here
  cargo:warning=struct __make_unsigned{};
  cargo:warning=       ^
  cargo:warning=/usr/include/c++/v1/__type_traits/make_unsigned.h:85:41: error: no template named '__make_unsigned_t'; did you mean '__make_unsigned'?
  cargo:warning=_LIBCPP_HIDE_FROM_ABI _LIBCPP_CONSTEXPR __make_unsigned_t<_Tp> __to_unsigned_like(_Tp __x) _NOEXCEPT {
  cargo:warning=                                        ^
  cargo:warning=/usr/include/c++/v1/__type_traits/make_unsigned.h:46:8: note: '__make_unsigned' declared here
  cargo:warning=struct __make_unsigned{};
  cargo:warning=       ^
  cargo:warning=/usr/include/c++/v1/__type_traits/make_unsigned.h:86:22: error: no template named '__make_unsigned_t'; did you mean '__make_unsigned'?
  cargo:warning=  return static_cast<__make_unsigned_t<_Tp> >(__x);
  cargo:warning=                     ^
  cargo:warning=/usr/include/c++/v1/__type_traits/make_unsigned.h:46:8: note: '__make_unsigned' declared here
  cargo:warning=struct __make_unsigned{};
  cargo:warning=       ^
  cargo:warning=/usr/include/c++/v1/__type_traits/make_unsigned.h:90:84: error: use of undeclared identifier '__make_unsigned_t'
  cargo:warning=using __copy_unsigned_t _LIBCPP_NODEBUG = __conditional_t<is_unsigned<_Tp>::value, __make_unsigned_t<_Up>, _Up>;
  cargo:warning=                                                                                   ^
  cargo:warning=In file included from /wrkdirs/usr/ports/databases/surrealdb/work/surrealdb-3.0.5/cargo-crates/cxx-1.0.192/src/cxx.cc:1:
  cargo:warning=In file included from /wrkdirs/usr/ports/databases/surrealdb/work/surrealdb-3.0.5/cargo-crates/cxx-1.0.192/src/../include/cxx.h:2:
  cargo:warning=In file included from /usr/include/c++/v1/algorithm:1845:
  cargo:warning=In file included from /usr/include/c++/v1/__algorithm/binary_search.h:14:
  cargo:warning=In file included from /usr/include/c++/v1/__algorithm/lower_bound.h:13:
  cargo:warning=/usr/include/c++/v1/__algorithm/half_positive.h:27:45: error: no template named '__make_unsigned_t'; did you mean '__make_unsigned'?
  cargo:warning=  return static_cast<_Integral>(static_cast<__make_unsigned_t<_Integral> >(__value) / 2);
  cargo:warning=                                            ^
  cargo:warning=/usr/include/c++/v1/__type_traits/make_unsigned.h:46:8: note: '__make_unsigned' declared here
  cargo:warning=struct __make_unsigned{};
  cargo:warning=       ^
  cargo:warning=In file included from /wrkdirs/usr/ports/databases/surrealdb/work/surrealdb-3.0.5/cargo-crates/cxx-1.0.192/src/cxx.cc:1:
  cargo:warning=In file included from /wrkdirs/usr/ports/databases/surrealdb/work/surrealdb-3.0.5/cargo-crates/cxx-1.0.192/src/../include/cxx.h:2:
  cargo:warning=In file included from /usr/include/c++/v1/algorithm:1845:
  cargo:warning=In file included from /usr/include/c++/v1/__algorithm/binary_search.h:14:
  cargo:warning=In file included from /usr/include/c++/v1/__algorithm/lower_bound.h:14:
  cargo:warning=In file included from /usr/include/c++/v1/__algorithm/iterator_operations.h:13:
  cargo:warning=In file included from /usr/include/c++/v1/__algorithm/ranges_iterator_concept.h:13:
  cargo:warning=In file included from /usr/include/c++/v1/__iterator/concepts.h:13:
  cargo:warning=In file included from /usr/include/c++/v1/__concepts/arithmetic.h:13:
  cargo:warning=/usr/include/c++/v1/__type_traits/is_floating_point.h:30:82: error: use of undeclared identifier '__remove_cv_t'
  cargo:warning=struct _LIBCPP_NO_SPECIALIZATIONS is_floating_point : __libcpp_is_floating_point<__remove_cv_t<_Tp> > {};
  cargo:warning=                                                                                 ^
  cargo:warning=In file included from /wrkdirs/usr/ports/databases/surrealdb/work/surrealdb-3.0.5/cargo-crates/cxx-1.0.192/src/cxx.cc:1:
  cargo:warning=In file included from /wrkdirs/usr/ports/databases/surrealdb/work/surrealdb-3.0.5/cargo-crates/cxx-1.0.192/src/../include/cxx.h:2:
  cargo:warning=In file included from /usr/include/c++/v1/algorithm:1845:
  cargo:warning=In file included from /usr/include/c++/v1/__algorithm/binary_search.h:14:
  cargo:warning=In file included from /usr/include/c++/v1/__algorithm/lower_bound.h:14:
  cargo:warning=In file included from /usr/include/c++/v1/__algorithm/iterator_operations.h:13:
  cargo:warning=In file included from /usr/include/c++/v1/__algorithm/ranges_iterator_concept.h:13:
  cargo:warning=In file included from /usr/include/c++/v1/__iterator/concepts.h:14:
  cargo:warning=In file included from /usr/include/c++/v1/__concepts/assignable.h:12:
  cargo:warning=In file included from /usr/include/c++/v1/__concepts/common_reference_with.h:15:
  cargo:warning=In file included from /usr/include/c++/v1/__type_traits/common_reference.h:14:
  cargo:warning=In file included from /usr/include/c++/v1/__type_traits/common_type.h:16:
  cargo:warning=/usr/include/c++/v1/__type_traits/remove_cvref.h:30:42: error: unknown type name '__remove_cvref'
  cargo:warning=using __remove_cvref_t _LIBCPP_NODEBUG = __remove_cvref(_Tp);
  cargo:warning=                                         ^
  cargo:warning=In file included from /wrkdirs/usr/ports/databases/surrealdb/work/surrealdb-3.0.5/cargo-crates/cxx-1.0.192/src/cxx.cc:1:
  cargo:warning=In file included from /wrkdirs/usr/ports/databases/surrealdb/work/surrealdb-3.0.5/cargo-crates/cxx-1.0.192/src/../include/cxx.h:2:
  cargo:warning=In file included from /usr/include/c++/v1/algorithm:1845:
  cargo:warning=In file included from /usr/include/c++/v1/__algorithm/binary_search.h:14:
  cargo:warning=In file included from /usr/include/c++/v1/__algorithm/lower_bound.h:14:
  cargo:warning=In file included from /usr/include/c++/v1/__algorithm/iterator_operations.h:13:
  cargo:warning=In file included from /usr/include/c++/v1/__algorithm/ranges_iterator_concept.h:13:
  cargo:warning=In file included from /usr/include/c++/v1/__iterator/concepts.h:29:
  cargo:warning=In file included from /usr/include/c++/v1/__iterator/incrementable_traits.h:19:
  cargo:warning=/usr/include/c++/v1/__type_traits/make_signed.h:68:65: error: use of undeclared identifier '__remove_cv_t'
  cargo:warning=using __make_signed_t = __copy_cv_t<_Tp, typename __make_signed<__remove_cv_t<_Tp> >::type>;
  cargo:warning=                                                                ^
  cargo:warning=/usr/include/c++/v1/__type_traits/make_signed.h:74:32: error: no template named '__make_signed_t'; did you mean '__make_signed'?
  cargo:warning=  using type _LIBCPP_NODEBUG = __make_signed_t<_Tp>;
  cargo:warning=                               ^
  cargo:warning=/usr/include/c++/v1/__type_traits/make_signed.h:44:8: note: '__make_signed' declared here
  cargo:warning=struct __make_signed{};
  cargo:warning=       ^
  cargo:warning=In file included from /wrkdirs/usr/ports/databases/surrealdb/work/surrealdb-3.0.5/cargo-crates/cxx-1.0.192/src/cxx.cc:1:
  cargo:warning=In file included from /wrkdirs/usr/ports/databases/surrealdb/work/surrealdb-3.0.5/cargo-crates/cxx-1.0.192/src/../include/cxx.h:2:
  cargo:warning=In file included from /usr/include/c++/v1/algorithm:1845:
  cargo:warning=In file included from /usr/include/c++/v1/__algorithm/binary_search.h:14:
  cargo:warning=In file included from /usr/include/c++/v1/__algorithm/lower_bound.h:14:
  cargo:warning=In file included from /usr/include/c++/v1/__algorithm/iterator_operations.h:13:
  cargo:warning=In file included from /usr/include/c++/v1/__algorithm/ranges_iterator_concept.h:13:
  cargo:warning=In file included from /usr/include/c++/v1/__iterator/concepts.h:30:
  cargo:warning=In file included from /usr/include/c++/v1/__iterator/iter_move.h:15:
  cargo:warning=/usr/include/c++/v1/__iterator/iterator_traits.h:342:11: error: no template named '__remove_cv_t'
  cargo:warning=  typedef __remove_cv_t<_Tp> value_type;
  cargo:warning=          ^
  cargo:warning=In file included from /wrkdirs/usr/ports/databases/surrealdb/work/surrealdb-3.0.5/cargo-crates/cxx-1.0.192/src/cxx.cc:1:
  cargo:warning=In file included from /wrkdirs/usr/ports/databases/surrealdb/work/surrealdb-3.0.5/cargo-crates/cxx-1.0.192/src/../include/cxx.h:2:
  cargo:warning=In file included from /usr/include/c++/v1/algorithm:1845:
  cargo:warning=In file included from /usr/include/c++/v1/__algorithm/binary_search.h:14:
  cargo:warning=In file included from /usr/include/c++/v1/__algorithm/lower_bound.h:14:
  cargo:warning=In file included from /usr/include/c++/v1/__algorithm/iterator_operations.h:16:
  cargo:warning=In file included from /usr/include/c++/v1/__iterator/advance.h:26:
  cargo:warning=In file included from /usr/include/c++/v1/limits:524:
  cargo:warning=In file included from /usr/include/c++/v1/type_traits:484:
  cargo:warning=In file included from /usr/include/c++/v1/__type_traits/is_compound.h:14:
  cargo:warning=In file included from /usr/include/c++/v1/__type_traits/is_fundamental.h:14:
  cargo:warning=/usr/include/c++/v1/__type_traits/is_null_pointer.h:23:51: error: unknown type name '__remove_cv'
  cargo:warning=inline const bool __is_null_pointer_v = __is_same(__remove_cv(_Tp), nullptr_t);
  cargo:warning=                                                  ^
  cargo:warning=In file included from /wrkdirs/usr/ports/databases/surrealdb/work/surrealdb-3.0.5/cargo-crates/cxx-1.0.192/src/cxx.cc:1:
  cargo:warning=In file included from /wrkdirs/usr/ports/databases/surrealdb/work/surrealdb-3.0.5/cargo-crates/cxx-1.0.192/src/../include/cxx.h:2:
  cargo:warning=In file included from /usr/include/c++/v1/algorithm:1845:
  cargo:warning=In file included from /usr/include/c++/v1/__algorithm/binary_search.h:14:
  cargo:warning=In file included from /usr/include/c++/v1/__algorithm/lower_bound.h:14:
  cargo:warning=/usr/include/c++/v1/__algorithm/iterator_operations.h:148:62: error: no template named '__remove_cvref_t'; did you mean '__remove_const_t'?
  cargo:warning=  _LIBCPP_HIDE_FROM_ABI static _LIBCPP_CONSTEXPR_SINCE_CXX14 __remove_cvref_t<_Iter>
  cargo:warning=                                                             ^
  cargo:warning=/usr/include/c++/v1/__type_traits/remove_const.h:39:1: note: '__remove_const_t' declared here
  cargo:warning=using __remove_const_t = typename remove_const<_Tp>::type;
  cargo:warning=^
  cargo:warning=fatal error: too many errors emitted, stopping now [-ferror-limit=]
  cargo:warning=20 errors generated.

  --- stderr


  error occurred in cc-rs: command did not execute successfully (status code exit status: 1): LC_ALL="C" "/usr/local/llvm15/bin/clang++" "-O3" "-ffunction-sections" "-fdata-sections" "-fPIC" "-m64" "-stdlib=libc++" "--target=x86_64-unknown-freebsd" "-std=c++11" "-O2" "-pipe" "-fstack-protector-strong" "-fno-strict-aliasing" "-o" "/wrkdirs/usr/ports/databases/surrealdb/work/target/release/build/cxx-83c4b784b77f9ea0/out/c16f17691ff6f04b-cxx.o" "-c" "/wrkdirs/usr/ports/databases/surrealdb/work/surrealdb-3.0.5/cargo-crates/cxx-1.0.192/src/cxx.cc"


warning: build failed, waiting for other jobs to finish...
[libz-sys 1.1.23] cargo:rerun-if-env-changed=LIBZ_SYS_STATIC
[libz-sys 1.1.23] cargo:rerun-if-changed=build.rs
[libz-sys 1.1.23] cargo:rerun-if-changed=zng/cmake.rs
[libz-sys 1.1.23] cargo:rerun-if-changed=zng/cc.rs
[libz-sys 1.1.23] OPT_LEVEL = Some(3)
[libz-sys 1.1.23] TARGET = Some(x86_64-unknown-freebsd)
[libz-sys 1.1.23] CARGO_ENCODED_RUSTFLAGS = Some(--cfgsurrealdb_unstable-Clinker=/usr/local/llvm15/bin/clang)
[libz-sys 1.1.23] HOST = Some(x86_64-unknown-freebsd)
[libz-sys 1.1.23] cargo:rerun-if-env-changed=CC_x86_64-unknown-freebsd
[libz-sys 1.1.23] CC_x86_64-unknown-freebsd = None
[libz-sys 1.1.23] cargo:rerun-if-env-changed=CC_x86_64_unknown_freebsd
[libz-sys 1.1.23] CC_x86_64_unknown_freebsd = None
[libz-sys 1.1.23] cargo:rerun-if-env-changed=HOST_CC
[libz-sys 1.1.23] HOST_CC = None
[libz-sys 1.1.23] cargo:rerun-if-env-changed=CC
[libz-sys 1.1.23] CC = Some(/usr/local/llvm15/bin/clang)
[libz-sys 1.1.23] RUSTC_WRAPPER = None
[libz-sys 1.1.23] cargo:rerun-if-env-changed=CC_ENABLE_DEBUG_OUTPUT
[libz-sys 1.1.23] cargo:rerun-if-env-changed=CRATE_CC_NO_DEFAULTS
[libz-sys 1.1.23] CRATE_CC_NO_DEFAULTS = None
[libz-sys 1.1.23] DEBUG = Some(false)
[libz-sys 1.1.23] cargo:rerun-if-env-changed=CFLAGS
[libz-sys 1.1.23] CFLAGS = Some(-O2 -pipe  -fstack-protector-strong -fno-strict-aliasing )
[libz-sys 1.1.23] cargo:rerun-if-env-changed=CC_SHELL_ESCAPED_FLAGS
[libz-sys 1.1.23] CC_SHELL_ESCAPED_FLAGS = None
[libz-sys 1.1.23] cargo:rerun-if-env-changed=HOST_CFLAGS
[libz-sys 1.1.23] HOST_CFLAGS = None
[libz-sys 1.1.23] cargo:rerun-if-env-changed=CFLAGS_x86_64_unknown_freebsd
[libz-sys 1.1.23] CFLAGS_x86_64_unknown_freebsd = None
[libz-sys 1.1.23] cargo:rerun-if-env-changed=CFLAGS_x86_64-unknown-freebsd
[libz-sys 1.1.23] CFLAGS_x86_64-unknown-freebsd = None
[libz-sys 1.1.23] exit status: 0
[libz-sys 1.1.23] exit status: 0
[libz-sys 1.1.23] exit status: 0
[libz-sys 1.1.23] exit status: 0
[libz-sys 1.1.23] exit status: 0
[libz-sys 1.1.23] exit status: 0
[libz-sys 1.1.23] exit status: 0
[libz-sys 1.1.23] exit status: 0
[libz-sys 1.1.23] exit status: 0
[libz-sys 1.1.23] exit status: 0
[libz-sys 1.1.23] exit status: 0
[libz-sys 1.1.23] cargo:rerun-if-env-changed=AR_x86_64-unknown-freebsd
[libz-sys 1.1.23] AR_x86_64-unknown-freebsd = None
[libz-sys 1.1.23] cargo:rerun-if-env-changed=AR_x86_64_unknown_freebsd
[libz-sys 1.1.23] AR_x86_64_unknown_freebsd = None
[libz-sys 1.1.23] cargo:rerun-if-env-changed=HOST_AR
[libz-sys 1.1.23] HOST_AR = None
[libz-sys 1.1.23] cargo:rerun-if-env-changed=AR
[libz-sys 1.1.23] AR = None
[libz-sys 1.1.23] cargo:rerun-if-env-changed=ARFLAGS
[libz-sys 1.1.23] ARFLAGS = None
[libz-sys 1.1.23] cargo:rerun-if-env-changed=HOST_ARFLAGS
[libz-sys 1.1.23] HOST_ARFLAGS = None
[libz-sys 1.1.23] cargo:rerun-if-env-changed=ARFLAGS_x86_64_unknown_freebsd
[libz-sys 1.1.23] ARFLAGS_x86_64_unknown_freebsd = None
[libz-sys 1.1.23] cargo:rerun-if-env-changed=ARFLAGS_x86_64-unknown-freebsd
[libz-sys 1.1.23] ARFLAGS_x86_64-unknown-freebsd = None
[libz-sys 1.1.23] cargo:rustc-link-lib=static=z
[libz-sys 1.1.23] cargo:rustc-link-search=native=/wrkdirs/usr/ports/databases/surrealdb/work/target/release/build/libz-sys-5a7589a60522bec7/out/lib
[libz-sys 1.1.23] cargo:root=/wrkdirs/usr/ports/databases/surrealdb/work/target/release/build/libz-sys-5a7589a60522bec7/out
[libz-sys 1.1.23] cargo:rustc-link-search=native=/wrkdirs/usr/ports/databases/surrealdb/work/target/release/build/libz-sys-5a7589a60522bec7/out/lib
[libz-sys 1.1.23] cargo:include=/wrkdirs/usr/ports/databases/surrealdb/work/target/release/build/libz-sys-5a7589a60522bec7/out/include
*** Error code 101

Stop.
make: stopped making "build" in /usr/ports/databases/surrealdb