[package - 144i386-default][games/naev] Failed for naev-0.13.5_1 in build
- Go to: [ bottom of page ] [ top of archives ] [ this month ]
Date: Sat, 03 Oct 2026 01:38:49 UTC
You are receiving this mail as a port that you maintain
is failing to build on the FreeBSD package build server.
Please investigate the failure and submit a PR to fix
build.
Maintainer: acm@FreeBSD.org
Log URL: https://pkg-status.freebsd.org/beefy18/data/144i386-default/28a1681357b6/logs/naev-0.13.5_1.log
Build URL: https://pkg-status.freebsd.org/beefy18/build.html?mastername=144i386-default&build=28a1681357b6
Log:
=>> Building games/naev
build started at Sat Oct 3 01:36:20 UTC 2026
port directory: /usr/ports/games/naev
package name: naev-0.13.5_1
building for: FreeBSD 144i386-default-job-08 14.4-RELEASE-p10 FreeBSD 14.4-RELEASE-p10 i386
maintained by: acm@FreeBSD.org
Makefile datestamp: -rw-r--r-- 1 root wheel 2084 Sep 26 01:01 /usr/ports/games/naev/Makefile
Ports top last git commit: 28a1681357b67b5777b6ff6ce13eb199b0180597
Ports top unclean checkout: no
Port dir last git commit: 45e0861aac81bba08cdcbd221bb6f491a2e1ab72
Port dir unclean checkout: no
Poudriere version: poudriere-git-3.4.8-3-gd92fb7c0
Host OSVERSION: 1600022
Jail OSVERSION: 1404000
Job Id: 08
---Begin Environment---
SHELL=/bin/sh
BLOCKSIZE=K
MAIL=/var/mail/root
MM_CHARSET=UTF-8
LANG=C.UTF-8
OSVERSION=1404000
STATUS=1
HOME=/root
PATH=/sbin:/bin:/usr/sbin:/usr/bin:/usr/local/sbin:/usr/local/bin:/root/bin
MAKE_OBJDIR_CHECK_WRITABLE=0
UNAME_m=i386
UNAME_p=i386
UNAME_r=14.4-RELEASE-p10
LOCALBASE=/usr/local
UNAME_v=FreeBSD 14.4-RELEASE-p10
USER=root
POUDRIERE_NAME=poudriere-git
LIBEXECPREFIX=/usr/local/libexec/poudriere
POUDRIERE_VERSION=3.4.8-3-gd92fb7c0
MASTERMNT=/usr/local/poudriere/data/.m/144i386-default/ref
LC_COLLATE=C
POUDRIERE_BUILD_TYPE=bulk
PACKAGE_BUILDING=yes
SAVED_TERM=
OUTPUT_REDIRECTED_STDERR=4
OUTPUT_REDIRECTED=1
PWD=/usr/local/poudriere/data/.m/144i386-default/08/.p
OUTPUT_REDIRECTED_STDOUT=3
P_PORTS_FEATURES=FLAVORS SUBPACKAGES SELECTED_OPTIONS
MASTERNAME=144i386-default
SCRIPTPREFIX=/usr/local/share/poudriere
SCRIPTNAME=bulk.sh
OLDPWD=/usr/local/poudriere/data/.m/144i386-default/ref/.p/pool
POUDRIERE_PKGNAME=poudriere-git-3.4.8-3-gd92fb7c0
SCRIPTPATH=/usr/local/share/poudriere/bulk.sh
POUDRIEREPATH=/usr/local/bin/poudriere
---End Environment---
---Begin Poudriere Port Flags/Env---
PORT_FLAGS=
PKGENV=
FLAVOR=
MAKE_ARGS=
---End Poudriere Port Flags/Env---
---Begin OPTIONS List---
---End OPTIONS List---
--MAINTAINER--
acm@FreeBSD.org
--End MAINTAINER--
--CONFIGURE_ARGS--
setup --prefix /usr/local --localstatedir /var --infodir share/info --auto-features=enabled -Dpython.bytecompile=-1 -Db_colorout=never --buildtype release --optimization plain --strip -Ddocs_c=disabled -Ddocs_lua=disabled _build
--End CONFIGURE_ARGS--
--CONFIGURE_ENV--
PKG_CONFIG=pkgconf PYTHON="/usr/local/bin/python3.12" XDG_DATA_HOME=/wrkdirs/usr/ports/games/naev/work XDG_CONFIG_HOME=/wrkdirs/usr/ports/games/naev/work XDG_CACHE_HOME=/wrkdirs/usr/ports/games/naev/work/.cache HOME=/wrkdirs/usr/ports/games/naev/work TMPDIR="/tmp" PATH=/wrkdirs/usr/ports/games/naev/work/.bin:/sbin:/bin:/usr/sbin:/usr/bin:/usr/local/sbin:/usr/local/bin:/root/bin PKG_CONFIG_LIBDIR=/wrkdirs/usr/ports/games/naev/work/.pkgconfig:/usr/local/libdata/pkgconfig:/usr/local/share/pkgconfig:/usr/libdata/pkgconfig SHELL=/bin/sh CONFIG_SHELL=/bin/sh CMAKE_PREFIX_PATH="/usr/local"
--End CONFIGURE_ENV--
--MAKE_ENV--
NINJA_STATUS="[%p %s/%t] " XDG_DATA_HOME=/wrkdirs/usr/ports/games/naev/work XDG_CONFIG_HOME=/wrkdirs/usr/ports/games/naev/work XDG_CACHE_HOME=/wrkdirs/usr/ports/games/naev/work/.cache HOME=/wrkdirs/usr/ports/games/naev/work TMPDIR="/tmp" PATH=/wrkdirs/usr/ports/games/naev/work/.bin:/sbin:/bin:/usr/sbin:/usr/bin:/usr/local/sbin:/usr/local/bin:/root/bin PKG_CONFIG_LIBDIR=/wrkdirs/usr/ports/games/naev/work/.pkgconfig:/usr/local/libdata/pkgconfig:/usr/local/share/pkgconfig:/usr/libdata/pkgconfig MK_DEBUG_FILES=no MK_KERNEL_SYMBOLS=no SHELL=/bin/sh NO_LINT=YES DESTDIR=/wrkdirs/usr/ports/games/naev/work/stage PREFIX=/usr/local LOCALBASE=/usr/local CC="cc" CFLAGS="-O2 -pipe -fstack-protector-strong -isystem /usr/local/include -fno-strict-aliasing " CPP="cpp" CPPFLAGS="-isystem /usr/local/include" LDFLAGS=" -L/usr/local/lib " LIBS="" CXX="c++" CXXFLAGS="-O2 -pipe -fstack-protector-strong -isystem /usr/local/include -fno-strict-aliasing -isystem /usr/local/include " BSD_INS
TALL_PROGRAM="install -s -m 555" BSD_INSTALL_LIB="install -s -m 0644" BSD_INSTALL_SCRIPT="install -m 555" BSD_INSTALL_DATA="install -m 0644" BSD_INSTALL_MAN="install -m 444"
--End MAKE_ENV--
--PLIST_SUB--
GTK2_VERSION="2.10.0" GTK3_VERSION="3.0.0" GTK4_VERSION="4.0.0" PYTHON_INCLUDEDIR=include/python3.12 PYTHON_LIBDIR=lib/python3.12 PYTHON_PLATFORM=freebsd14 PYTHON_SITELIBDIR=lib/python3.12/site-packages PYTHON_SUFFIX=312 PYTHON_BASESUFFIX=312 PYTHON_TAG=.cpython-312 PYTHON_SOABI=.cpython-312 PYTHON_VER=3.12 PYTHON_BASEVER=3.12 PYTHON_VERSION=python3.12 PYTHON2="@comment " PYTHON3="" OSREL=14.4 PREFIX=%D LOCALBASE=/usr/local RESETPREFIX=/usr/local LIB32DIR=lib DOCSDIR="share/doc/naev" EXAMPLESDIR="share/examples/naev" DATADIR="share/naev" WWWDIR="www/naev" ETCDIR="etc/naev"
--End PLIST_SUB--
--SUB_LIST--
PYTHON_INCLUDEDIR=/usr/local/include/python3.12 PYTHON_LIBDIR=/usr/local/lib/python3.12 PYTHON_PLATFORM=freebsd14 PYTHON_SITELIBDIR=/usr/local/lib/python3.12/site-packages PYTHON_SUFFIX=312 PYTHON_BASESUFFIX=312 PYTHON_TAG=.cpython-312 PYTHON_SOABI=.cpython-312 PYTHON_VER=3.12 PYTHON_BASEVER=3.12 PYTHON_VERSION=python3.12 PYTHON2="@comment " PYTHON3="" PREFIX=/usr/local LOCALBASE=/usr/local DATADIR=/usr/local/share/naev DOCSDIR=/usr/local/share/doc/naev EXAMPLESDIR=/usr/local/share/examples/naev WWWDIR=/usr/local/www/naev ETCDIR=/usr/local/etc/naev
--End SUB_LIST--
---Begin make.conf---
USE_PACKAGE_DEPENDS=yes
BATCH=yes
WRKDIRPREFIX=/wrkdirs
PORTSDIR=/usr/ports
PACKAGES=/packages
DISTDIR=/distfiles
PACKAGE_BUILDING=yes
PACKAGE_BUILDING_FLAVORS=yes
MACHINE=i386
MACHINE_ARCH=i386
ARCH=${MACHINE_ARCH}
#### ####
# XXX: We really need this but cannot use it while 'make checksum' does not
# try the next mirror on checksum failure. It currently retries the same
# failed mirror and then fails rather then trying another. It *does*
# try the next if the size is mismatched though.
#MASTER_SITE_FREEBSD=yes
# Build ALLOW_MAKE_JOBS_PACKAGES with 3 jobs
MAKE_JOBS_NUMBER=3
#### Misc Poudriere ####
.include "/etc/make.conf.ports_env"
GID=0
UID=0
---End make.conf---
--Resource limits--
cpu time (seconds, -t) unlimited
file size (512-blocks, -f) unlimited
data seg size (kbytes, -d) 524288
stack size (kbytes, -s) 65536
core file size (512-blocks, -c) unlimited
max memory size (kbytes, -m) unlimited
locked memory (kbytes, -l) unlimited
max user processes (-u) 89999
open files (-n) 8192
virtual mem size (kbytes, -v) unlimited
swap limit (kbytes, -w) unlimited
socket buffer size (bytes, -b) unlimited
pseudo-terminals (-p) unlimited
kqueues (-k) unlimited
umtx shared locks (-o) unlimited
pipebuf (-y) unlimited
--End resource limits--
=======================<phase: check-sanity >============================
===== env: NO_DEPENDS=yes USER=root UID=0 GID=0
===> License GPLv2 GPLv3 CC-BY-3.0 CC-BY-SA-3.0 PD accepted by the user
===========================================================================
=======================<phase: pkg-depends >============================
===== env: USE_PACKAGE_DEPENDS_ONLY=1 USER=root UID=0 GID=0
===> naev-0.13.5_1 depends on file: /usr/local/sbin/pkg - not found
===> Installing existing package /packages/All/pkg-2.8.4.pkg
[144i386-default-job-08] Installing pkg-2.8.4...
[144i386-default-job-08] Extracting pkg-2.8.4: .......... done
===> naev-0.13.5_1 depends on file: /usr/local/sbin/pkg - found
===> Returning to build of naev-0.13.5_1
===========================================================================
=======================<phase: fetch-depends >============================
===== env: USE_PACKAGE_DEPENDS_ONLY=1 USER=root UID=0 GID=0
===========================================================================
=======================<phase: fetch >============================
===== env: NO_DEPENDS=yes USER=root UID=0 GID=0
===> License GPLv2 GPLv3 CC-BY-3.0 CC-BY-SA-3.0 PD accepted by the user
===> Fetching all distfiles required by naev-0.13.5_1 for building
===========================================================================
=======================<phase: checksum >============================
===== env: NO_DEPENDS=yes USER=root UID=0 GID=0
===> License GPLv2 GPLv3 CC-BY-3.0 CC-BY-SA-3.0 PD accepted by the user
===> Fetching all distfiles required by naev-0.13.5_1 for building
=> SHA256 Checksum OK for naev-0.13.5-source.tar.xz.
=> SHA256 Checksum OK for naev-cache-0.13.5.tar.gz.
===========================================================================
=======================<phase: extract-depends>============================
===== env: USE_PACKAGE_DEPENDS_ONLY=1 USER=root UID=0 GID=0
===========================================================================
=======================<phase: extract >============================
===== env: NO_DEPENDS=yes USER=root UID=0 GID=0
===> License GPLv2 GPLv3 CC-BY-3.0 CC-BY-SA-3.0 PD accepted by the user
===> Fetching all distfiles required by naev-0.13.5_1 for building
===> Extracting for naev-0.13.5_1
=> SHA256 Checksum OK for naev-0.13.5-source.tar.xz.
=> SHA256 Checksum OK for naev-cache-0.13.5.tar.gz.
===========================================================================
=======================<phase: patch-depends >============================
===== env: USE_PACKAGE_DEPENDS_ONLY=1 USER=root UID=0 GID=0
===========================================================================
=======================<phase: patch >============================
===== env: NO_DEPENDS=yes USER=root UID=0 GID=0
===> Patching for naev-0.13.5_1
===> Applying FreeBSD patches for naev-0.13.5_1 from /usr/ports/games/naev/files
===========================================================================
=======================<phase: build-depends >============================
===== env: USE_PACKAGE_DEPENDS_ONLY=1 USER=root UID=0 GID=0
===> naev-0.13.5_1 depends on package: py312-mutagen>0 - not found
===> Installing existing package /packages/All/py312-mutagen-1.48.1.pkg
[144i386-default-job-08] Installing py312-mutagen-1.48.1...
[144i386-default-job-08] `-- Installing python312-3.12.14_1...
[144i386-default-job-08] | `-- Installing expat-2.8.4...
[144i386-default-job-08] | `-- Extracting expat-2.8.4: .......... done
[144i386-default-job-08] | `-- Installing gettext-runtime-1.0_1...
[144i386-default-job-08] | | `-- Installing indexinfo-0.3.1_1...
[144i386-default-job-08] | | `-- Extracting indexinfo-0.3.1_1: .... done
[144i386-default-job-08] | `-- Extracting gettext-runtime-1.0_1: .......... done
[144i386-default-job-08] | `-- Installing libffi-3.8.0...
[144i386-default-job-08] | `-- Extracting libffi-3.8.0: .......... done
[144i386-default-job-08] | `-- Installing mpdecimal-4.0.1...
[144i386-default-job-08] | `-- Extracting mpdecimal-4.0.1: .......... done
[144i386-default-job-08] | `-- Installing readline-8.3.6...
[144i386-default-job-08] | `-- Extracting readline-8.3.6: .......... done
[144i386-default-job-08] `-- Extracting python312-3.12.14_1: .......... done
[144i386-default-job-08] Extracting py312-mutagen-1.48.1: .......... done
<snip>
Compiling byteorder-lite v0.1.0
Compiling zune-inflate v0.2.54
Compiling jobserver v0.1.35
Compiling ttf-parser v0.25.1
Compiling syn v2.0.119
Compiling syn v3.0.4
Compiling flate2 v1.1.9
Compiling cfg-expr v0.20.9
Compiling toml v1.1.4+spec-1.1.0
Compiling fontconfig-parser v0.5.8
Compiling loop9 v0.1.5
Compiling lilt v0.8.2
Compiling avif-serialize v0.8.9
Compiling bitreader v0.3.11
Compiling naga v27.0.3
Compiling simd_helpers v0.1.0
Compiling image-webp v0.2.4
Compiling glam v0.25.0
Compiling lebe v0.5.3
Compiling byteorder v1.5.0
Compiling khronos-egl v6.0.0
Compiling fax v0.2.7
Compiling pxfm v0.1.30
Compiling zune-core v0.5.3
Compiling cc v1.4.4
Compiling errno v0.3.14
Compiling mio v1.2.2
Compiling socket2 v0.6.5
Compiling memmap2 v0.9.11
Compiling wayland-scanner v0.31.11
Compiling rav1e v0.8.1
Compiling foldhash v0.1.5
Compiling bit_field v0.10.3
Compiling ash v0.38.0+1.3.281
Compiling writeable v0.6.4
Compiling litemap v0.8.3
Compiling system-deps v7.0.8
Compiling png v0.18.1
Compiling zune-jpeg v0.5.15
Compiling gif v0.14.2
Compiling gpu-alloc-types v0.3.1
Compiling gpu-descriptor-types v0.2.0
Compiling parking_lot v0.12.5
Compiling wgpu-hal v27.0.4
Compiling spirv v0.3.0+sdk-1.3.268.0
Compiling hashbrown v0.15.5
Compiling utf8_iter v1.0.4
Compiling float-cmp v0.9.0
Compiling yazi v0.2.1
Compiling icu_normalizer_data v2.3.0
Compiling glow v0.16.0
Compiling tokio v1.53.1
Compiling num-integer v0.1.47
Compiling pic-scale-safe v0.1.12
Compiling icu_properties_data v2.3.0
Compiling xkeysym v0.2.1
Compiling zeno v0.3.3
Compiling xcursor v0.3.11
Compiling jpeg-encoder v0.6.1
Compiling cursor-icon v1.2.0
Compiling ordered-float v5.4.0
Compiling strict-num v0.1.1
Compiling rayon v1.12.0
Compiling gpu-alloc v0.6.2
Compiling num-bigint v0.4.8
Compiling primal-check v0.3.4
Compiling transpose v0.2.3
Compiling http v1.5.0
Compiling aho-corasick v1.1.5
Compiling arrayref v0.3.9
Compiling rustix v0.38.44
Compiling linebender_resource_handle v0.1.1
Compiling typeid v1.0.3
Compiling sys-locale v0.3.2
Compiling renderdoc-sys v1.1.0
Compiling typenum v1.20.1
Compiling regex-syntax v0.8.11
Compiling rangemap v1.8.0
Compiling bstr v1.13.1
Compiling gpu-descriptor v0.3.2
Compiling self_cell v1.3.0
Compiling dav1d-sys v0.8.3
Compiling unicode-linebreak v0.1.5
Compiling unicode-segmentation v1.13.3
Compiling proc-macro-error-attr2 v2.0.0
Compiling wgpu-core v27.0.3
Compiling litrs v1.0.0
Compiling erased-serde v0.4.10
Compiling mutate_once v0.1.2
Compiling sdl3-sys v0.5.12+SDL3-3.2.30
Compiling rustversion v1.0.23
Compiling kamadak-exif v0.6.1
Compiling ordered-float v2.10.1
Compiling euclid v0.22.14
Compiling fontdb v0.23.0
Compiling http-body v1.1.0
Compiling png v0.17.16
Compiling nix v0.30.1
Compiling wgpu v27.0.1
Compiling smithay-client-toolkit v0.20.0
Compiling httparse v1.10.1
Compiling zeroize v1.9.0
Compiling svg_fmt v0.4.5
Compiling base64 v0.22.1
Compiling naevc v0.13.5 (/wrkdirs/usr/ports/games/naev/work/naev-0.13.5/_build/naevc)
Compiling document-features v0.2.12
Compiling getrandom v0.2.17
Compiling form_urlencoded v1.2.2
Compiling num-rational v0.4.2
Compiling wayland-backend v0.3.17
Compiling openssl-sys v0.9.117
Compiling mlua-sys v0.10.0
Compiling ring v0.17.14
Compiling libz-sys v1.1.29
Compiling rustls-pki-types v1.15.1
Compiling fs-err v3.3.1
Compiling untrusted v0.9.0
Compiling fnv v1.0.7
Compiling x11rb-protocol v0.13.2
Compiling extended v0.1.0
Compiling foreign-types-shared v0.1.1
Compiling atomic-waker v1.1.2
Compiling smithay-client-toolkit v0.19.2
Compiling tower-service v0.3.3
Compiling moxcms v0.7.11
Compiling sdl3 v0.16.4
Compiling option-ext v0.2.0
Compiling as-raw-xcb-connection v1.0.1
Compiling try-lock v0.2.5
Compiling openssl v0.10.81
Compiling foreign-types v0.3.2
Compiling etagere v0.2.15
Compiling dirs-sys v0.5.0
Compiling want v0.3.1
Compiling libssh2-sys v0.3.2
Compiling owned_ttf_parser v0.25.1
error[E0080]: attempt to compute `16_usize - 24_usize`, which would overflow
--> naevc/naevc.rs:3671:29
|
3671 | ["Size of max_align_t"][::std::mem::size_of::<max_align_t>() - 24usize];
| ^^^^^^^^^^^^^^^^^^^^^^^^^^^^^^^^^^^^^^^^^^^^^^ evaluation of `_` failed here
error[E0080]: attempt to compute `16_usize - 20_usize`, which would overflow
--> naevc/naevc.rs:3777:31
|
3777 | ["Size of __max_align_t"][::std::mem::size_of::<__max_align_t>() - 20usize];
| ^^^^^^^^^^^^^^^^^^^^^^^^^^^^^^^^^^^^^^^^^^^^^^^^ evaluation of `_` failed here
Compiling polling v3.11.0
Compiling gethostname v1.1.0
Compiling semver v1.0.28
Compiling convert_case v0.10.0
Compiling approx v0.5.1
Compiling x11-dl v2.21.0
Compiling matrixmultiply v0.3.11
Compiling regex-automata v0.4.18
Compiling generic-array v0.14.7
Compiling maybe-rayon v0.1.1
Compiling siphasher v1.0.3
Compiling ab_glyph_rasterizer v0.1.10
Compiling lru v0.16.4
Compiling formatx v0.2.4
Compiling iana-time-zone v0.1.65
Compiling rustls v0.23.43
Compiling unicode-xid v0.2.6
Compiling synstructure v0.13.2
Compiling proc-macro-error2 v2.0.1
Compiling encase_derive_impl v0.12.1
Compiling typewit v1.15.2
Compiling native-tls v0.2.18
Compiling ab_glyph v0.2.32
Compiling directories v6.0.0
Compiling guillotiere v0.6.2
Compiling toml_datetime v0.7.5+spec-1.1.0
Compiling proc-macro-error-attr v1.0.4
Compiling winit v0.30.13
Compiling winnow v0.7.15
Compiling wayland-csd-frame v0.3.0
Compiling const_panic v0.2.17
Compiling subtle v2.6.1
Compiling pulldown-cmark v0.12.2
Compiling ipnet v2.12.1
Compiling openssl-probe v0.2.1
Compiling rawpointer v0.2.1
Compiling toml_writer v1.1.2+spec-1.1.0
For more information about this error, try `rustc --explain E0080`.
Compiling syn v1.0.109
error: could not compile `naevc` (lib) due to 2 previous errors
warning: build failed, waiting for other jobs to finish...
[ 99% 773/776] /usr/local/bin/msgfmt -o po/ca/LC_MESSAGES/naev.mo ../po/ca.po
FAILED: [code=101] src
/usr/bin/env CARGO_HOME=/wrkdirs/usr/ports/games/naev/work/cargo-home /usr/local/bin/cargo build --offline --manifest-path Cargo.toml --profile release --target-dir /wrkdirs/usr/ports/games/naev/work/naev-0.13.5/_build/src
ninja: build stopped: subcommand failed.
===> Compilation failed unexpectedly.
Try to set MAKE_JOBS_UNSAFE=yes and rebuild before reporting the failure to
the maintainer.
*** Error code 1
Stop.
make: stopped making "build" in /usr/ports/games/naev