[package - main-amd64-default][science/sirius] Failed for sirius-quantum-chemistry-7.11.0 in build

From: <pkg-fallout_at_FreeBSD.org>
Date: Tue, 05 May 2026 06:06:25 UTC
You are receiving this mail as a port that you maintain
is failing to build on the FreeBSD package build server.
Please investigate the failure and submit a PR to fix
build.

Maintainer:     yuri@FreeBSD.org
Log URL:        https://pkg-status.freebsd.org/beefy24/data/main-amd64-default/p22900861d4f4_s03e9e83f358/logs/sirius-quantum-chemistry-7.11.0.log
Build URL:      https://pkg-status.freebsd.org/beefy24/build.html?mastername=main-amd64-default&build=p22900861d4f4_s03e9e83f358
Log:

=>> Building science/sirius
build started at Tue May  5 06:05:51 UTC 2026
port directory: /usr/ports/science/sirius
package name: sirius-quantum-chemistry-7.11.0
building for: FreeBSD main-amd64-default-job-21 16.0-CURRENT FreeBSD 16.0-CURRENT 1600018 amd64
maintained by: yuri@FreeBSD.org
Makefile datestamp: -rw-r--r--  1 root wheel 1613 Apr 25 01:01 /usr/ports/science/sirius/Makefile
Ports top last git commit: 22900861d4f436eea9abeb9f32e5d9a1482237f0
Ports top unclean checkout: no
Port dir last git commit: 8935903b2f9d142970c8276d09fc61c88fe87404
Port dir unclean checkout: no
Poudriere version: poudriere-git-3.4.8
Host OSVERSION: 1600014
Jail OSVERSION: 1600018
Job Id: 21




!!! Jail is newer than host. (Jail: 1600018, Host: 1600014) !!!
!!! This is not supported. !!!
!!! Host kernel must be same or newer than jail. !!!
!!! Expect build failures. !!!



---Begin Environment---
SHELL=/bin/sh
OSVERSION=1600018
UNAME_v=FreeBSD 16.0-CURRENT 1600018
UNAME_r=16.0-CURRENT
BLOCKSIZE=K
MAIL=/var/mail/root
MM_CHARSET=UTF-8
LANG=C.UTF-8
STATUS=1
HOME=/root
PATH=/sbin:/bin:/usr/sbin:/usr/bin:/usr/local/sbin:/usr/local/bin:/root/bin
MAKE_OBJDIR_CHECK_WRITABLE=0
LOCALBASE=/usr/local
USER=root
POUDRIERE_NAME=poudriere-git
LIBEXECPREFIX=/usr/local/libexec/poudriere
POUDRIERE_VERSION=3.4.8
MASTERMNT=/usr/local/poudriere/data/.m/main-amd64-default/ref
LC_COLLATE=C
POUDRIERE_BUILD_TYPE=bulk
PACKAGE_BUILDING=yes
SAVED_TERM=
OUTPUT_REDIRECTED_STDERR=4
OUTPUT_REDIRECTED=1
PWD=/usr/local/poudriere/data/.m/main-amd64-default/21/.p
OUTPUT_REDIRECTED_STDOUT=3
P_PORTS_FEATURES=FLAVORS SUBPACKAGES SELECTED_OPTIONS
MASTERNAME=main-amd64-default
SCRIPTPREFIX=/usr/local/share/poudriere
SCRIPTNAME=bulk.sh
OLDPWD=/usr/local/poudriere/data/.m/main-amd64-default/ref/.p/pool
POUDRIERE_PKGNAME=poudriere-git-3.4.8
SCRIPTPATH=/usr/local/share/poudriere/bulk.sh
POUDRIEREPATH=/usr/local/bin/poudriere
---End Environment---

---Begin Poudriere Port Flags/Env---
PORT_FLAGS=
PKGENV=
FLAVOR=
MAKE_ARGS=
---End Poudriere Port Flags/Env---

---Begin OPTIONS List---
===> The following configuration options are available for sirius-quantum-chemistry-7.11.0:
     NLCGLIB=off: Enable nlcglib
====> MPI (Message Passing Interface) support: you have to select exactly one of them
     MPICH=on: Parallel processing support via MPICH
     OPENMPI=off: Parallel processing support via Open MPI
===> Use 'make config' to modify these settings
---End OPTIONS List---

--MAINTAINER--
yuri@FreeBSD.org
--End MAINTAINER--

--CONFIGURE_ARGS--

--End CONFIGURE_ARGS--

--CONFIGURE_ENV--
F77="gfortran14" F90="gfortran14" FC="gfortran14"	 FFLAGS="-O -Wl,-rpath=/usr/local/lib/gcc14" F90FLAGS="-O -Wl,-rpath=/usr/local/lib/gcc14" FCFLAGS="-Wl,-rpath=/usr/local/lib/gcc14" PKG_CONFIG=pkgconf XDG_DATA_HOME=/wrkdirs/usr/ports/science/sirius/work  XDG_CONFIG_HOME=/wrkdirs/usr/ports/science/sirius/work  XDG_CACHE_HOME=/wrkdirs/usr/ports/science/sirius/work/.cache  HOME=/wrkdirs/usr/ports/science/sirius/work TMPDIR="/tmp" PATH=/wrkdirs/usr/ports/science/sirius/work/.bin:/sbin:/bin:/usr/sbin:/usr/bin:/usr/local/sbin:/usr/local/bin:/root/bin PKG_CONFIG_LIBDIR=/wrkdirs/usr/ports/science/sirius/work/.pkgconfig:/usr/local/libdata/pkgconfig:/usr/local/share/pkgconfig:/usr/libdata/pkgconfig SHELL=/bin/sh CONFIG_SHELL=/bin/sh
--End CONFIGURE_ENV--

--MAKE_ENV--
F77="gfortran14" F90="gfortran14" FC="gfortran14"	 FFLAGS="-O -Wl,-rpath=/usr/local/lib/gcc14" F90FLAGS="-O -Wl,-rpath=/usr/local/lib/gcc14" FCFLAGS="-Wl,-rpath=/usr/local/lib/gcc14" XDG_DATA_HOME=/wrkdirs/usr/ports/science/sirius/work  XDG_CONFIG_HOME=/wrkdirs/usr/ports/science/sirius/work  XDG_CACHE_HOME=/wrkdirs/usr/ports/science/sirius/work/.cache  HOME=/wrkdirs/usr/ports/science/sirius/work TMPDIR="/tmp" PATH=/wrkdirs/usr/ports/science/sirius/work/.bin:/sbin:/bin:/usr/sbin:/usr/bin:/usr/local/sbin:/usr/local/bin:/root/bin PKG_CONFIG_LIBDIR=/wrkdirs/usr/ports/science/sirius/work/.pkgconfig:/usr/local/libdata/pkgconfig:/usr/local/share/pkgconfig:/usr/libdata/pkgconfig MK_DEBUG_FILES=no MK_KERNEL_SYMBOLS=no SHELL=/bin/sh NO_LINT=YES ADDR2LINE="/usr/local/bin/addr2line" AR="/usr/local/bin/ar" AS="/usr/local/bin/as" CPPFILT="/usr/local/bin/c++filt" GPROF="/usr/local/bin/gprof" LD="/usr/local/bin/ld" NM="/usr/local/bin/nm" OBJCOPY="/usr/local/bin/objcopy" OBJDUMP="/usr/local/
bin/objdump" RANLIB="/usr/local/bin/ranlib" READELF="/usr/local/bin/readelf" SIZE="/usr/local/bin/size" STRINGS="/usr/local/bin/strings" STRIP="/usr/local/bin/strip" PREFIX=/usr/local  LOCALBASE=/usr/local  CC="cc" CFLAGS="-O2 -pipe  -fstack-protector-strong -fno-strict-aliasing "  CPP="cpp" CPPFLAGS=""  LDFLAGS=" -Wl,-rpath=/usr/local/lib/gcc14  -L/usr/local/lib/gcc14 " LIBS=""  CXX="c++" CXXFLAGS="-O2 -pipe -fstack-protector-strong -fno-strict-aliasing   " BSD_INSTALL_PROGRAM="install  -s -m 555"  BSD_INSTALL_LIB="install  -s -m 0644"  BSD_INSTALL_SCRIPT="install  -m 555"  BSD_INSTALL_DATA="install  -m 0644"  BSD_INSTALL_MAN="install  -m 444"
--End MAKE_ENV--

--PLIST_SUB--
 CMAKE_BUILD_TYPE="release" OSREL=16.0 PREFIX=%D LOCALBASE=/usr/local  RESETPREFIX=/usr/local LIB32DIR=lib DOCSDIR="share/doc/sirius"  EXAMPLESDIR="share/examples/sirius"  DATADIR="share/sirius"  WWWDIR="www/sirius"  ETCDIR="etc/sirius"
--End PLIST_SUB--

--SUB_LIST--
 PREFIX=/usr/local LOCALBASE=/usr/local  DATADIR=/usr/local/share/sirius DOCSDIR=/usr/local/share/doc/sirius EXAMPLESDIR=/usr/local/share/examples/sirius  WWWDIR=/usr/local/www/sirius ETCDIR=/usr/local/etc/sirius
--End SUB_LIST--

---Begin make.conf---
USE_PACKAGE_DEPENDS=yes
BATCH=yes
WRKDIRPREFIX=/wrkdirs
PORTSDIR=/usr/ports
PACKAGES=/packages
DISTDIR=/distfiles
PACKAGE_BUILDING=yes
PACKAGE_BUILDING_FLAVORS=yes
####  ####
# XXX: We really need this but cannot use it while 'make checksum' does not
# try the next mirror on checksum failure.  It currently retries the same
# failed mirror and then fails rather then trying another.  It *does*
# try the next if the size is mismatched though.
#MASTER_SITE_FREEBSD=yes
# Build ALLOW_MAKE_JOBS_PACKAGES with 3 jobs
MAKE_JOBS_NUMBER=3
#### Misc Poudriere ####
.include "/etc/make.conf.ports_env"
GID=0
UID=0
---End make.conf---
--Resource limits--
cpu time               (seconds, -t)  unlimited
file size           (512-blocks, -f)  unlimited
data seg size           (kbytes, -d)  33554432
stack size              (kbytes, -s)  524288
core file size      (512-blocks, -c)  unlimited
max memory size         (kbytes, -m)  unlimited
locked memory           (kbytes, -l)  unlimited
max user processes              (-u)  89999
open files                      (-n)  8192
virtual mem size        (kbytes, -v)  unlimited
swap limit              (kbytes, -w)  unlimited
socket buffer size       (bytes, -b)  unlimited
pseudo-terminals                (-p)  unlimited
kqueues                         (-k)  unlimited
umtx shared locks               (-o)  unlimited
pipebuf                         (-y)  unlimited
--End resource limits--
=======================<phase: check-sanity   >============================
===== env: NO_DEPENDS=yes USER=root UID=0 GID=0
===>  License BSD3CLAUSE accepted by the user
===========================================================================
=======================<phase: pkg-depends    >============================
===== env: USE_PACKAGE_DEPENDS_ONLY=1 USER=root UID=0 GID=0
===>   sirius-quantum-chemistry-7.11.0 depends on file: /usr/local/sbin/pkg - not found
===>   Installing existing package /packages/All/pkg-2.7.5.pkg
[main-amd64-default-job-21] Installing pkg-2.7.5...
[main-amd64-default-job-21] Extracting pkg-2.7.5: .......... done
===>   sirius-quantum-chemistry-7.11.0 depends on file: /usr/local/sbin/pkg - found
===>   Returning to build of sirius-quantum-chemistry-7.11.0
===========================================================================
=======================<phase: fetch-depends  >============================
===== env: USE_PACKAGE_DEPENDS_ONLY=1 USER=root UID=0 GID=0
===========================================================================
=======================<phase: fetch          >============================
===== env: NO_DEPENDS=yes USER=root UID=0 GID=0
===>  License BSD3CLAUSE accepted by the user
===> Fetching all distfiles required by sirius-quantum-chemistry-7.11.0 for building
===========================================================================
=======================<phase: checksum       >============================
===== env: NO_DEPENDS=yes USER=root UID=0 GID=0
===>  License BSD3CLAUSE accepted by the user
===> Fetching all distfiles required by sirius-quantum-chemistry-7.11.0 for building
=> SHA256 Checksum OK for electronic-structure-SIRIUS-v7.11.0_GH0.tar.gz.
===========================================================================
=======================<phase: extract-depends>============================
===== env: USE_PACKAGE_DEPENDS_ONLY=1 USER=root UID=0 GID=0
===========================================================================
=======================<phase: extract        >============================
===== env: NO_DEPENDS=yes USER=root UID=0 GID=0
===>  License BSD3CLAUSE accepted by the user
===> Fetching all distfiles required by sirius-quantum-chemistry-7.11.0 for building
===>  Extracting for sirius-quantum-chemistry-7.11.0
=> SHA256 Checksum OK for electronic-structure-SIRIUS-v7.11.0_GH0.tar.gz.
===========================================================================
=======================<phase: patch-depends  >============================
===== env: USE_PACKAGE_DEPENDS_ONLY=1 USER=root UID=0 GID=0
===========================================================================
=======================<phase: patch          >============================
===== env: NO_DEPENDS=yes USER=root UID=0 GID=0
===>  Patching for sirius-quantum-chemistry-7.11.0
===========================================================================
=======================<phase: build-depends  >============================
===== env: USE_PACKAGE_DEPENDS_ONLY=1 USER=root UID=0 GID=0
===>   sirius-quantum-chemistry-7.11.0 depends on file: /usr/local/bin/cmake - not found
===>   Installing existing package /packages/All/cmake-core-3.31.10_1.pkg
[main-amd64-default-job-21] Installing cmake-core-3.31.10_1...
[main-amd64-default-job-21] `-- Installing expat-2.8.0...
[main-amd64-default-job-21] `-- Extracting expat-2.8.0: .......... done
[main-amd64-default-job-21] `-- Installing jsoncpp-1.9.6_1...
[main-amd64-default-job-21] `-- Extracting jsoncpp-1.9.6_1: .......... done
[main-amd64-default-job-21] `-- Installing libidn2-2.3.8...
[main-amd64-default-job-21] |   `-- Installing indexinfo-0.3.1_1...
[main-amd64-default-job-21] |   `-- Extracting indexinfo-0.3.1_1: .... done
<snip>
      |             ^
--- src/CMakeFiles/sirius_cxx.dir/hamiltonian/local_operator.cpp.o ---
In file included from /wrkdirs/usr/ports/science/sirius/work/SIRIUS-7.11.0/src/hamiltonian/local_operator.cpp:15:
In file included from /wrkdirs/usr/ports/science/sirius/work/SIRIUS-7.11.0/src/potential/potential.hpp:17:
In file included from /wrkdirs/usr/ports/science/sirius/work/SIRIUS-7.11.0/src/density/density.hpp:18:
In file included from /wrkdirs/usr/ports/science/sirius/work/SIRIUS-7.11.0/src/function3d/field4d.hpp:21:
In file included from /wrkdirs/usr/ports/science/sirius/work/SIRIUS-7.11.0/src/function3d/periodic_function.hpp:17:
In file included from /wrkdirs/usr/ports/science/sirius/work/SIRIUS-7.11.0/src/context/simulation_context.hpp:22:
/wrkdirs/usr/ports/science/sirius/work/SIRIUS-7.11.0/src/core/hdf5_tree.hpp:396:22: warning: variable length arrays in C++ are a Clang extension [-Wvla-cxx-extension]
  396 |         hsize_t dims[ndims];
      |                      ^~~~~
/wrkdirs/usr/ports/science/sirius/work/SIRIUS-7.11.0/src/core/hdf5_tree.hpp:396:22: note: read of non-const variable 'ndims' is not allowed in a constant expression
/wrkdirs/usr/ports/science/sirius/work/SIRIUS-7.11.0/src/core/hdf5_tree.hpp:390:13: note: declared here
  390 |         int ndims = H5Sget_simple_extent_ndims(dataspace_id);
      |             ^
--- src/CMakeFiles/sirius_cxx.dir/hamiltonian/hamiltonian_k.cpp.o ---
In file included from /wrkdirs/usr/ports/science/sirius/work/SIRIUS-7.11.0/src/hamiltonian/hamiltonian_k.cpp:14:
In file included from /wrkdirs/usr/ports/science/sirius/work/SIRIUS-7.11.0/src/context/simulation_context.hpp:29:
In file included from /wrkdirs/usr/ports/science/sirius/work/SIRIUS-7.11.0/src/radial/radial_integrals.hpp:17:
In file included from /wrkdirs/usr/ports/science/sirius/work/SIRIUS-7.11.0/src/unit_cell/unit_cell.hpp:19:
In file included from /wrkdirs/usr/ports/science/sirius/work/SIRIUS-7.11.0/src/unit_cell/atom.hpp:19:
In file included from /wrkdirs/usr/ports/science/sirius/work/SIRIUS-7.11.0/src/unit_cell/atom_symmetry_class.hpp:17:
In file included from /wrkdirs/usr/ports/science/sirius/work/SIRIUS-7.11.0/src/unit_cell/atom_type.hpp:18:
/wrkdirs/usr/ports/science/sirius/work/SIRIUS-7.11.0/src/radial/radial_solver.hpp:1295:50: warning: lambda capture 'this' is not used [-Wunused-lambda-capture]
 1295 |                                                 [this, &denu, sd, &surface_deriv, &p](int iter, int nn, double& enu) {
      |                                                  ^~~~~
/wrkdirs/usr/ports/science/sirius/work/SIRIUS-7.11.0/src/radial/radial_solver.hpp:1295:84: warning: lambda capture 'p' is not used [-Wunused-lambda-capture]
 1295 |                                                 [this, &denu, sd, &surface_deriv, &p](int iter, int nn, double& enu) {
      |                                                                                 ~~~^
/wrkdirs/usr/ports/science/sirius/work/SIRIUS-7.11.0/src/radial/radial_solver.hpp:1309:46: warning: lambda capture 'this' is not used [-Wunused-lambda-capture]
 1309 |                                             [this, &e1, &e2, sd, &surface_deriv](int iter, int nn, double& enu) {
      |                                              ^~~~~
--- src/CMakeFiles/sirius_cxx.dir/hamiltonian/hamiltonian.cpp.o ---
In file included from /wrkdirs/usr/ports/science/sirius/work/SIRIUS-7.11.0/src/hamiltonian/hamiltonian.cpp:14:
In file included from /wrkdirs/usr/ports/science/sirius/work/SIRIUS-7.11.0/src/potential/potential.hpp:17:
In file included from /wrkdirs/usr/ports/science/sirius/work/SIRIUS-7.11.0/src/density/density.hpp:18:
In file included from /wrkdirs/usr/ports/science/sirius/work/SIRIUS-7.11.0/src/function3d/field4d.hpp:21:
In file included from /wrkdirs/usr/ports/science/sirius/work/SIRIUS-7.11.0/src/function3d/periodic_function.hpp:17:
In file included from /wrkdirs/usr/ports/science/sirius/work/SIRIUS-7.11.0/src/context/simulation_context.hpp:29:
In file included from /wrkdirs/usr/ports/science/sirius/work/SIRIUS-7.11.0/src/radial/radial_integrals.hpp:17:
In file included from /wrkdirs/usr/ports/science/sirius/work/SIRIUS-7.11.0/src/unit_cell/unit_cell.hpp:19:
In file included from /wrkdirs/usr/ports/science/sirius/work/SIRIUS-7.11.0/src/unit_cell/atom.hpp:19:
In file included from /wrkdirs/usr/ports/science/sirius/work/SIRIUS-7.11.0/src/unit_cell/atom_symmetry_class.hpp:17:
In file included from /wrkdirs/usr/ports/science/sirius/work/SIRIUS-7.11.0/src/unit_cell/atom_type.hpp:18:
/wrkdirs/usr/ports/science/sirius/work/SIRIUS-7.11.0/src/radial/radial_solver.hpp:1295:50: warning: lambda capture 'this' is not used [-Wunused-lambda-capture]
 1295 |                                                 [this, &denu, sd, &surface_deriv, &p](int iter, int nn, double& enu) {
      |                                                  ^~~~~
/wrkdirs/usr/ports/science/sirius/work/SIRIUS-7.11.0/src/radial/radial_solver.hpp:1295:84: warning: lambda capture 'p' is not used [-Wunused-lambda-capture]
 1295 |                                                 [this, &denu, sd, &surface_deriv, &p](int iter, int nn, double& enu) {
      |                                                                                 ~~~^
/wrkdirs/usr/ports/science/sirius/work/SIRIUS-7.11.0/src/radial/radial_solver.hpp:1309:46: warning: lambda capture 'this' is not used [-Wunused-lambda-capture]
 1309 |                                             [this, &e1, &e2, sd, &surface_deriv](int iter, int nn, double& enu) {
      |                                              ^~~~~
--- src/CMakeFiles/sirius_cxx.dir/hamiltonian/local_operator.cpp.o ---
In file included from /wrkdirs/usr/ports/science/sirius/work/SIRIUS-7.11.0/src/hamiltonian/local_operator.cpp:15:
In file included from /wrkdirs/usr/ports/science/sirius/work/SIRIUS-7.11.0/src/potential/potential.hpp:17:
In file included from /wrkdirs/usr/ports/science/sirius/work/SIRIUS-7.11.0/src/density/density.hpp:18:
In file included from /wrkdirs/usr/ports/science/sirius/work/SIRIUS-7.11.0/src/function3d/field4d.hpp:21:
In file included from /wrkdirs/usr/ports/science/sirius/work/SIRIUS-7.11.0/src/function3d/periodic_function.hpp:17:
In file included from /wrkdirs/usr/ports/science/sirius/work/SIRIUS-7.11.0/src/context/simulation_context.hpp:29:
In file included from /wrkdirs/usr/ports/science/sirius/work/SIRIUS-7.11.0/src/radial/radial_integrals.hpp:17:
In file included from /wrkdirs/usr/ports/science/sirius/work/SIRIUS-7.11.0/src/unit_cell/unit_cell.hpp:19:
In file included from /wrkdirs/usr/ports/science/sirius/work/SIRIUS-7.11.0/src/unit_cell/atom.hpp:19:
In file included from /wrkdirs/usr/ports/science/sirius/work/SIRIUS-7.11.0/src/unit_cell/atom_symmetry_class.hpp:17:
In file included from /wrkdirs/usr/ports/science/sirius/work/SIRIUS-7.11.0/src/unit_cell/atom_type.hpp:18:
/wrkdirs/usr/ports/science/sirius/work/SIRIUS-7.11.0/src/radial/radial_solver.hpp:1295:50: warning: lambda capture 'this' is not used [-Wunused-lambda-capture]
 1295 |                                                 [this, &denu, sd, &surface_deriv, &p](int iter, int nn, double& enu) {
      |                                                  ^~~~~
/wrkdirs/usr/ports/science/sirius/work/SIRIUS-7.11.0/src/radial/radial_solver.hpp:1295:84: warning: lambda capture 'p' is not used [-Wunused-lambda-capture]
 1295 |                                                 [this, &denu, sd, &surface_deriv, &p](int iter, int nn, double& enu) {
      |                                                                                 ~~~^
/wrkdirs/usr/ports/science/sirius/work/SIRIUS-7.11.0/src/radial/radial_solver.hpp:1309:46: warning: lambda capture 'this' is not used [-Wunused-lambda-capture]
 1309 |                                             [this, &e1, &e2, sd, &surface_deriv](int iter, int nn, double& enu) {
      |                                              ^~~~~
--- src/CMakeFiles/sirius_cxx.dir/hamiltonian/hamiltonian_k.cpp.o ---
/wrkdirs/usr/ports/science/sirius/work/SIRIUS-7.11.0/src/hamiltonian/hamiltonian_k.cpp:866:30: warning: lambda capture 'this' is not used [-Wunused-lambda-capture]
  866 |     auto apply_omt_apw_lo = [this, &ctx, &phi__, &b__, &spl_atoms](wf::Wave_functions_mt<T>& o_apw_lo__) {
      |                              ^
/wrkdirs/usr/ports/science/sirius/work/SIRIUS-7.11.0/src/hamiltonian/hamiltonian_k.cpp:1405:16: note: in instantiation of member function 'sirius::Hamiltonian_k<double>::apply_fv_h_o' requested here
 1405 | template class Hamiltonian_k<double>;
      |                ^
/wrkdirs/usr/ports/science/sirius/work/SIRIUS-7.11.0/src/hamiltonian/hamiltonian_k.cpp:920:28: warning: lambda capture 'this' is not used [-Wunused-lambda-capture]
  920 |     auto appy_omt_lo_lo = [this, &ctx, &phi__, &b__, &spl_atoms](wf::Wave_functions<T>& ophi__) {
      |                            ^
/wrkdirs/usr/ports/science/sirius/work/SIRIUS-7.11.0/src/hamiltonian/hamiltonian_k.cpp:1002:30: warning: lambda capture 'this' is not used [-Wunused-lambda-capture]
 1002 |     auto apply_omt_lo_apw = [this, &ctx, mem, &b__, &spl_atoms](wf::Wave_functions_mt<T> const& alm_phi__,
      |                              ^
/wrkdirs/usr/ports/science/sirius/work/SIRIUS-7.11.0/src/hamiltonian/hamiltonian_k.cpp:1002:42: warning: lambda capture 'mem' is not used [-Wunused-lambda-capture]
 1002 |     auto apply_omt_lo_apw = [this, &ctx, mem, &b__, &spl_atoms](wf::Wave_functions_mt<T> const& alm_phi__,
      |                                          ^
DeclRefExpr for Decl not entered in LocalDeclMap?
UNREACHABLE executed at /usr/local/poudriere/jails/main-amd64/usr/src/contrib/llvm-project/clang/lib/CodeGen/CGExpr.cpp:3260!
PLEASE submit a bug report to https://bugs.freebsd.org/submit/ and include the crash backtrace, preprocessed source, and associated run script.
Stack dump:
0.	Program arguments: /usr/bin/c++ -DFMT_SHARED -DH5_BUILT_AS_DYNAMIC_LIB -DSIRIUS_GPU_MEMORY_ALIGMENT= -DSIRIUS_PROFILE -Dsirius_cxx_EXPORTS -I/wrkdirs/usr/ports/science/sirius/work/SIRIUS-7.11.0/src -I/wrkdirs/usr/ports/science/sirius/work/.build/src -isystem /usr/local/include -isystem /usr/local/include/spfft -isystem /usr/local/include/json-c -isystem /usr/local/include/gcc14 -isystem /usr/local/include/spla -O2 -pipe -fstack-protector-strong -fno-strict-aliasing -Wall -O3 -DNDEBUG -std=gnu++20 -fPIC -fopenmp=libomp -MD -MT src/CMakeFiles/sirius_cxx.dir/hamiltonian/hamiltonian_k.cpp.o -MF CMakeFiles/sirius_cxx.dir/hamiltonian/hamiltonian_k.cpp.o.d -o CMakeFiles/sirius_cxx.dir/hamiltonian/hamiltonian_k.cpp.o -c /wrkdirs/usr/ports/science/sirius/work/SIRIUS-7.11.0/src/hamiltonian/hamiltonian_k.cpp
1.	<eof> parser at end of file
2.	Per-file LLVM IR generation
3.	/wrkdirs/usr/ports/science/sirius/work/SIRIUS-7.11.0/src/hamiltonian/hamiltonian_k.cpp:840:29: Generating code for declaration 'sirius::Hamiltonian_k<double>::apply_fv_h_o(bool, bool, wf::band_range, wf::Wave_functions<double> &, wf::Wave_functions<double> *, wf::Wave_functions<double> *)::(anonymous class)::operator()'
 #0 0x0000381258390846 llvm::sys::PrintStackTrace(llvm::raw_ostream&, int) (/usr/lib/libprivatellvm.so.21+0x4390846)
 #1 0x000038125838e283 llvm::sys::RunSignalHandlers() (/usr/lib/libprivatellvm.so.21+0x438e283)
 #2 0x00003812583322e2 (/usr/lib/libprivatellvm.so.21+0x43322e2)
 #3 0x000038125c680a6c (/lib/libthr.so.3+0x1aa6c)
 #4 0x000038125c68008b (/lib/libthr.so.3+0x1a08b)
 #5 0x000038124d6672d3 ([vdso]+0x2d3)
 #6 0x000038125f08fd4a _thr_kill (/lib/libsys.so.7+0x19d4a)
 #7 0x000038125da790e4 raise (/lib/libc.so.7+0xc90e4)
 #8 0x000038125db2b149 abort (/lib/libc.so.7+0x17b149)
 #9 0x00003812583455d2 (/usr/lib/libprivatellvm.so.21+0x43455d2)
#10 0x0000381251004af4 clang::CodeGen::CodeGenFunction::EmitDeclRefLValue(clang::DeclRefExpr const*) (/usr/lib/libprivateclang.so.21+0x2004af4)
#11 0x0000381251001b1c clang::CodeGen::CodeGenFunction::EmitLValueHelper(clang::Expr const*, clang::CodeGen::KnownNonNull_t) (/usr/lib/libprivateclang.so.21+0x2001b1c)
#12 0x0000381251020791 (/usr/lib/libprivateclang.so.21+0x2020791)
#13 0x0000381250e387bf clang::StackExhaustionHandler::runWithSufficientStackSpace(clang::SourceLocation, llvm::function_ref<void ()>) (/usr/lib/libprivateclang.so.21+0x1e387bf)
#14 0x0000381250ff5612 clang::CodeGen::CodeGenFunction::EmitLValue(clang::Expr const*, clang::CodeGen::KnownNonNull_t) (/usr/lib/libprivateclang.so.21+0x1ff5612)
#15 0x0000381251032c26 clang::CodeGen::CodeGenFunction::EmitCXXMemberOrOperatorMemberCallExpr(clang::CallExpr const*, clang::CXXMethodDecl const*, clang::CodeGen::ReturnValueSlot, bool, clang::NestedNameSpecifier*, bool, clang::Expr const*, llvm::CallBase**) (/usr/lib/libprivateclang.so.21+0x2032c26)
#16 0x0000381251033e74 clang::CodeGen::CodeGenFunction::EmitCXXOperatorMemberCallExpr(clang::CXXOperatorCallExpr const*, clang::CXXMethodDecl const*, clang::CodeGen::ReturnValueSlot, llvm::CallBase**) (/usr/lib/libprivateclang.so.21+0x2033e74)
#17 0x000038125101a4bb clang::CodeGen::CodeGenFunction::EmitCallExpr(clang::CallExpr const*, clang::CodeGen::ReturnValueSlot, llvm::CallBase**) (/usr/lib/libprivateclang.so.21+0x201a4bb)
#18 0x00003812510738c9 (/usr/lib/libprivateclang.so.21+0x20738c9)
#19 0x00003812510606bc clang::CodeGen::CodeGenFunction::EmitScalarExpr(clang::Expr const*, bool) (/usr/lib/libprivateclang.so.21+0x20606bc)
#20 0x0000381250ff4d89 clang::CodeGen::CodeGenFunction::EvaluateExprAsBool(clang::Expr const*) (/usr/lib/libprivateclang.so.21+0x1ff4d89)
#21 0x000038125122900f clang::CodeGen::CodeGenFunction::EmitBranchOnBoolExpr(clang::Expr const*, llvm::BasicBlock*, llvm::BasicBlock*, unsigned long, clang::Stmt::Likelihood, clang::Expr const*, clang::VarDecl const*) (/usr/lib/libprivateclang.so.21+0x222900f)
#22 0x00003812511d28ea (/usr/lib/libprivateclang.so.21+0x21d28ea)
#23 0x00003812511d0441 clang::CodeGen::CodeGenFunction::EmitOMPWorksharingLoop(clang::OMPLoopDirective const&, clang::Expr*, llvm::function_ref<std::__1::pair<clang::CodeGen::LValue, clang::CodeGen::LValue> (clang::CodeGen::CodeGenFunction&, clang::OMPExecutableDirective const&)> const&, llvm::function_ref<std::__1::pair<llvm::Value*, llvm::Value*> (clang::CodeGen::CodeGenFunction&, clang::OMPExecutableDirective const&, clang::CodeGen::Address, clang::CodeGen::Address)> const&) (/usr/lib/libprivateclang.so.21+0x21d0441)
#24 0x00003812511ecb67 (/usr/lib/libprivateclang.so.21+0x21ecb67)
#25 0x000038125112abb8 clang::CodeGen::RegionCodeGenTy::operator()(clang::CodeGen::CodeGenFunction&) const (/usr/lib/libprivateclang.so.21+0x212abb8)
#26 0x0000381251162cde (/usr/lib/libprivateclang.so.21+0x2162cde)
#27 0x00003812511bbf50 clang::CodeGen::CodeGenFunction::GenerateOpenMPCapturedStmtFunction(clang::CapturedStmt const&, clang::SourceLocation) (/usr/lib/libprivateclang.so.21+0x21bbf50)
#28 0x0000381251130914 (/usr/lib/libprivateclang.so.21+0x2130914)
#29 0x00003812511306c8 clang::CodeGen::CGOpenMPRuntime::emitParallelOutlinedFunction(clang::CodeGen::CodeGenFunction&, clang::OMPExecutableDirective const&, clang::VarDecl const*, llvm::omp::Directive, clang::CodeGen::RegionCodeGenTy const&) (/usr/lib/libprivateclang.so.21+0x21306c8)
#30 0x00003812511c6a4a (/usr/lib/libprivateclang.so.21+0x21c6a4a)
#31 0x00003812511d55a5 clang::CodeGen::CodeGenFunction::EmitOMPParallelForDirective(clang::OMPParallelForDirective const&) (/usr/lib/libprivateclang.so.21+0x21d55a5)
#32 0x00003812511a8319 clang::CodeGen::CodeGenFunction::EmitStmt(clang::Stmt const*, llvm::ArrayRef<clang::Attr const*>) (/usr/lib/libprivateclang.so.21+0x21a8319)
#33 0x00003812511b403c clang::CodeGen::CodeGenFunction::EmitCompoundStmtWithoutScope(clang::CompoundStmt const&, bool, clang::CodeGen::AggValueSlot) (/usr/lib/libprivateclang.so.21+0x21b403c)
#34 0x00003812512278d5 clang::CodeGen::CodeGenFunction::GenerateCode(clang::GlobalDecl, llvm::Function*, clang::CodeGen::CGFunctionInfo const&) (/usr/lib/libprivateclang.so.21+0x22278d5)
#35 0x000038125124f8ec clang::CodeGen::CodeGenModule::EmitGlobalFunctionDefinition(clang::GlobalDecl, llvm::GlobalValue*) (/usr/lib/libprivateclang.so.21+0x224f8ec)
#36 0x00003812512480a8 clang::CodeGen::CodeGenModule::EmitGlobalDefinition(clang::GlobalDecl, llvm::GlobalValue*) (/usr/lib/libprivateclang.so.21+0x22480a8)
#37 0x000038125123a4e6 clang::CodeGen::CodeGenModule::EmitDeferred() (/usr/lib/libprivateclang.so.21+0x223a4e6)
#38 0x000038125123a512 clang::CodeGen::CodeGenModule::EmitDeferred() (/usr/lib/libprivateclang.so.21+0x223a512)
#39 0x000038125123722b clang::CodeGen::CodeGenModule::Release() (/usr/lib/libprivateclang.so.21+0x223722b)
#40 0x00003812513093be (/usr/lib/libprivateclang.so.21+0x23093be)
#41 0x0000381251214a65 clang::BackendConsumer::HandleTranslationUnit(clang::ASTContext&) (/usr/lib/libprivateclang.so.21+0x2214a65)
#42 0x00003812519bb7d9 clang::ParseAST(clang::Sema&, bool, bool) (/usr/lib/libprivateclang.so.21+0x29bb7d9)
#43 0x0000381251826c78 clang::FrontendAction::Execute() (/usr/lib/libprivateclang.so.21+0x2826c78)
#44 0x00003812517a76fd clang::CompilerInstance::ExecuteAction(clang::FrontendAction&) (/usr/lib/libprivateclang.so.21+0x27a76fd)
#45 0x00003812518c70d5 clang::ExecuteCompilerInvocation(clang::CompilerInstance*) (/usr/lib/libprivateclang.so.21+0x28c70d5)
#46 0x0000380a2be10434 (/usr/bin/c+++0xe434)
#47 0x0000380a2be1e2b5 (/usr/bin/c+++0x1c2b5)
#48 0x00003812514687be (/usr/lib/libprivateclang.so.21+0x24687be)
#49 0x0000381258331f3c llvm::CrashRecoveryContext::RunSafely(llvm::function_ref<void ()>) (/usr/lib/libprivatellvm.so.21+0x4331f3c)
#50 0x0000381251467d3a clang::driver::CC1Command::Execute(llvm::ArrayRef<std::__1::optional<llvm::StringRef>>, std::__1::basic_string<char, std::__1::char_traits<char>, std::__1::allocator<char>>*, bool*) const (/usr/lib/libprivateclang.so.21+0x2467d3a)
#51 0x0000381251427674 clang::driver::Compilation::ExecuteCommand(clang::driver::Command const&, clang::driver::Command const*&, bool) const (/usr/lib/libprivateclang.so.21+0x2427674)
#52 0x00003812514278fc clang::driver::Compilation::ExecuteJobs(clang::driver::JobList const&, llvm::SmallVectorImpl<std::__1::pair<int, clang::driver::Command const*>>&, bool) const (/usr/lib/libprivateclang.so.21+0x24278fc)
#53 0x0000381251446fb6 clang::driver::Driver::ExecuteCompilation(clang::driver::Compilation&, llvm::SmallVectorImpl<std::__1::pair<int, clang::driver::Command const*>>&) (/usr/lib/libprivateclang.so.21+0x2446fb6)
#54 0x0000380a2be1d97c (/usr/bin/c+++0x1b97c)
#55 0x0000380a2be1c032 (/usr/bin/c+++0x1a032)
#56 0x000038125da4db8f __libc_start1 (/lib/libc.so.7+0x9db8f)
c++: error: clang frontend command failed with exit code 134 (use -v to see invocation)
FreeBSD clang version 21.1.8 (https://github.com/llvm/llvm-project.git llvmorg-21.1.8-0-g2078da43e25a)
Target: x86_64-unknown-freebsd16.0
Thread model: posix
InstalledDir: /usr/bin
Build config: +assertions
c++: note: diagnostic msg: 
********************

PLEASE ATTACH THE FOLLOWING FILES TO THE BUG REPORT:
Preprocessed source(s) and associated run script(s) are located at:
c++: note: diagnostic msg: /tmp/hamiltonian_k-4d0f3d.cpp
c++: note: diagnostic msg: /tmp/hamiltonian_k-4d0f3d.sh
c++: note: diagnostic msg: 

********************
*** [src/CMakeFiles/sirius_cxx.dir/hamiltonian/hamiltonian_k.cpp.o] Error code 1

make[2]: stopped making "src/CMakeFiles/sirius_cxx.dir/build" in /wrkdirs/usr/ports/science/sirius/work/.build
--- src/CMakeFiles/sirius_cxx.dir/hamiltonian/hamiltonian.cpp.o ---
4 warnings generated.
--- src/CMakeFiles/sirius_cxx.dir/hamiltonian/local_operator.cpp.o ---
4 warnings generated.
make[2]: 1 error

make[2]: stopped making "src/CMakeFiles/sirius_cxx.dir/build" in /wrkdirs/usr/ports/science/sirius/work/.build
*** [src/CMakeFiles/sirius_cxx.dir/all] Error code 2

make[1]: stopped making "all" in /wrkdirs/usr/ports/science/sirius/work/.build
make[1]: 1 error

make[1]: stopped making "all" in /wrkdirs/usr/ports/science/sirius/work/.build
*** [all] Error code 2

make: stopped making "all" in /wrkdirs/usr/ports/science/sirius/work/.build
make: 1 error

make: stopped making "all" in /wrkdirs/usr/ports/science/sirius/work/.build
===> Compilation failed unexpectedly.
Try to set MAKE_JOBS_UNSAFE=yes and rebuild before reporting the failure to
the maintainer.
*** Error code 1

Stop.
make: stopped making "build" in /usr/ports/science/sirius