[package - 135amd64-default][finance/chiapos] Failed for chiapos-1.0.7 in build

From: <pkg-fallout_at_FreeBSD.org>
Date: Sun, 03 May 2026 03:14:54 UTC
You are receiving this mail as a port that you maintain
is failing to build on the FreeBSD package build server.
Please investigate the failure and submit a PR to fix
build.

Maintainer:     risner@stdio.com
Log URL:        https://pkg-status.freebsd.org/beefy16/data/135amd64-default/14bd0e320b77/logs/chiapos-1.0.7.log
Build URL:      https://pkg-status.freebsd.org/beefy16/build.html?mastername=135amd64-default&build=14bd0e320b77
Log:

=>> Building finance/chiapos
build started at Sun May  3 03:14:45 UTC 2026
port directory: /usr/ports/finance/chiapos
package name: chiapos-1.0.7
building for: FreeBSD 135amd64-default-job-06 13.5-RELEASE-p13 FreeBSD 13.5-RELEASE-p13 amd64
maintained by: risner@stdio.com
Makefile datestamp: -rw-r--r--  1 root  wheel  1757 Apr 24  2025 /usr/ports/finance/chiapos/Makefile
Ports top last git commit: 14bd0e320b773acd8655d00cb3130e2acf0fed1c
Ports top unclean checkout: no
Port dir last git commit: 4050acabd7d3c9d20d20674e41c75277aa0e7aa2
Port dir unclean checkout: no
Poudriere version: poudriere-git-3.4.8
Host OSVERSION: 1600014
Jail OSVERSION: 1305000
Job Id: 06

---Begin Environment---
SHELL=/bin/csh
OSVERSION=1305000
UNAME_v=FreeBSD 13.5-RELEASE-p13
UNAME_r=13.5-RELEASE-p13
BLOCKSIZE=K
MAIL=/var/mail/root
MM_CHARSET=UTF-8
LANG=C.UTF-8
STATUS=1
HOME=/root
PATH=/sbin:/bin:/usr/sbin:/usr/bin:/usr/local/sbin:/usr/local/bin:/root/bin
MAKE_OBJDIR_CHECK_WRITABLE=0
LOCALBASE=/usr/local
USER=root
POUDRIERE_NAME=poudriere-git
LIBEXECPREFIX=/usr/local/libexec/poudriere
POUDRIERE_VERSION=3.4.8
MASTERMNT=/usr/local/poudriere/data/.m/135amd64-default/ref
LC_COLLATE=C
POUDRIERE_BUILD_TYPE=bulk
PACKAGE_BUILDING=yes
SAVED_TERM=
OUTPUT_REDIRECTED_STDERR=4
OUTPUT_REDIRECTED=1
PWD=/usr/local/poudriere/data/.m/135amd64-default/06/.p
OUTPUT_REDIRECTED_STDOUT=3
P_PORTS_FEATURES=FLAVORS SUBPACKAGES SELECTED_OPTIONS
MASTERNAME=135amd64-default
SCRIPTPREFIX=/usr/local/share/poudriere
SCRIPTNAME=bulk.sh
OLDPWD=/usr/local/poudriere/data/.m/135amd64-default/ref/.p/pool
POUDRIERE_PKGNAME=poudriere-git-3.4.8
SCRIPTPATH=/usr/local/share/poudriere/bulk.sh
POUDRIEREPATH=/usr/local/bin/poudriere
---End Environment---

---Begin Poudriere Port Flags/Env---
PORT_FLAGS=
PKGENV=
FLAVOR=
MAKE_ARGS=
---End Poudriere Port Flags/Env---

---Begin OPTIONS List---
---End OPTIONS List---

--MAINTAINER--
risner@stdio.com
--End MAINTAINER--

--CONFIGURE_ARGS--

--End CONFIGURE_ARGS--

--CONFIGURE_ENV--
XDG_DATA_HOME=/wrkdirs/usr/ports/finance/chiapos/work  XDG_CONFIG_HOME=/wrkdirs/usr/ports/finance/chiapos/work  XDG_CACHE_HOME=/wrkdirs/usr/ports/finance/chiapos/work/.cache  HOME=/wrkdirs/usr/ports/finance/chiapos/work TMPDIR="/tmp" PATH=/wrkdirs/usr/ports/finance/chiapos/work/.bin:/sbin:/bin:/usr/sbin:/usr/bin:/usr/local/sbin:/usr/local/bin:/root/bin PKG_CONFIG_LIBDIR=/wrkdirs/usr/ports/finance/chiapos/work/.pkgconfig:/usr/local/libdata/pkgconfig:/usr/local/share/pkgconfig:/usr/libdata/pkgconfig SHELL=/bin/sh CONFIG_SHELL=/bin/sh
--End CONFIGURE_ENV--

--MAKE_ENV--
XDG_DATA_HOME=/wrkdirs/usr/ports/finance/chiapos/work  XDG_CONFIG_HOME=/wrkdirs/usr/ports/finance/chiapos/work  XDG_CACHE_HOME=/wrkdirs/usr/ports/finance/chiapos/work/.cache  HOME=/wrkdirs/usr/ports/finance/chiapos/work TMPDIR="/tmp" PATH=/wrkdirs/usr/ports/finance/chiapos/work/.bin:/sbin:/bin:/usr/sbin:/usr/bin:/usr/local/sbin:/usr/local/bin:/root/bin PKG_CONFIG_LIBDIR=/wrkdirs/usr/ports/finance/chiapos/work/.pkgconfig:/usr/local/libdata/pkgconfig:/usr/local/share/pkgconfig:/usr/libdata/pkgconfig MK_DEBUG_FILES=no MK_KERNEL_SYMBOLS=no SHELL=/bin/sh NO_LINT=YES PREFIX=/usr/local  LOCALBASE=/usr/local  CC="cc" CFLAGS="-O2 -pipe  -fstack-protector-strong -fno-strict-aliasing "  CPP="cpp" CPPFLAGS=""  LDFLAGS=" " LIBS=""  CXX="c++" CXXFLAGS="-O2 -pipe -fstack-protector-strong -fno-strict-aliasing  " BSD_INSTALL_PROGRAM="install  -s -m 555"  BSD_INSTALL_LIB="install  -s -m 0644"  BSD_INSTALL_SCRIPT="install  -m 555"  BSD_INSTALL_DATA="install  -m 0644"  BSD_INSTALL_MAN="install  -m 444"
--End MAKE_ENV--

--PLIST_SUB--
CMAKE_BUILD_TYPE="release" OSREL=13.5 PREFIX=%D LOCALBASE=/usr/local  RESETPREFIX=/usr/local LIB32DIR=lib DOCSDIR="share/doc/chiapos"  EXAMPLESDIR="share/examples/chiapos"  DATADIR="share/chiapos"  WWWDIR="www/chiapos"  ETCDIR="etc/chiapos"
--End PLIST_SUB--

--SUB_LIST--
PREFIX=/usr/local LOCALBASE=/usr/local  DATADIR=/usr/local/share/chiapos DOCSDIR=/usr/local/share/doc/chiapos EXAMPLESDIR=/usr/local/share/examples/chiapos  WWWDIR=/usr/local/www/chiapos ETCDIR=/usr/local/etc/chiapos
--End SUB_LIST--

---Begin make.conf---
USE_PACKAGE_DEPENDS=yes
BATCH=yes
WRKDIRPREFIX=/wrkdirs
PORTSDIR=/usr/ports
PACKAGES=/packages
DISTDIR=/distfiles
PACKAGE_BUILDING=yes
PACKAGE_BUILDING_FLAVORS=yes
####  ####
# XXX: We really need this but cannot use it while 'make checksum' does not
# try the next mirror on checksum failure.  It currently retries the same
# failed mirror and then fails rather then trying another.  It *does*
# try the next if the size is mismatched though.
#MASTER_SITE_FREEBSD=yes
# Build ALLOW_MAKE_JOBS_PACKAGES with 3 jobs
MAKE_JOBS_NUMBER=3
#### Misc Poudriere ####
.include "/etc/make.conf.ports_env"
GID=0
UID=0
---End make.conf---
--Resource limits--
cpu time               (seconds, -t)  unlimited
file size           (512-blocks, -f)  unlimited
data seg size           (kbytes, -d)  33554432
stack size              (kbytes, -s)  524288
core file size      (512-blocks, -c)  unlimited
max memory size         (kbytes, -m)  unlimited
locked memory           (kbytes, -l)  unlimited
max user processes              (-u)  89999
open files                      (-n)  8192
virtual mem size        (kbytes, -v)  unlimited
swap limit              (kbytes, -w)  unlimited
socket buffer size       (bytes, -b)  unlimited
pseudo-terminals                (-p)  unlimited
kqueues                         (-k)  unlimited
umtx shared locks               (-o)  unlimited
--End resource limits--
=======================<phase: check-sanity   >============================
===== env: NO_DEPENDS=yes USER=root UID=0 GID=0
===>  License APACHE20 BSD2CLAUSE MIT accepted by the user
===========================================================================
=======================<phase: pkg-depends    >============================
===== env: USE_PACKAGE_DEPENDS_ONLY=1 USER=root UID=0 GID=0
===>   chiapos-1.0.7 depends on file: /usr/local/sbin/pkg - not found
===>   Installing existing package /packages/All/pkg-2.7.5.pkg
[135amd64-default-job-06] Installing pkg-2.7.5...
[135amd64-default-job-06] Extracting pkg-2.7.5: .......... done
===>   chiapos-1.0.7 depends on file: /usr/local/sbin/pkg - found
===>   Returning to build of chiapos-1.0.7
===========================================================================
=======================<phase: fetch-depends  >============================
===== env: USE_PACKAGE_DEPENDS_ONLY=1 USER=root UID=0 GID=0
===========================================================================
=======================<phase: fetch          >============================
===== env: NO_DEPENDS=yes USER=root UID=0 GID=0
===>  License APACHE20 BSD2CLAUSE MIT accepted by the user
===> Fetching all distfiles required by chiapos-1.0.7 for building
===========================================================================
=======================<phase: checksum       >============================
===== env: NO_DEPENDS=yes USER=root UID=0 GID=0
===>  License APACHE20 BSD2CLAUSE MIT accepted by the user
===> Fetching all distfiles required by chiapos-1.0.7 for building
=> SHA256 Checksum OK for chiapos-1.0.7.tar.gz.
=> SHA256 Checksum OK for jarro2783-cxxopts-302302b30839505703d37fb82f536c53cf9172fa_GH0.tar.gz.
=> SHA256 Checksum OK for gulrak-filesystem-4e21ab305794f5309a1454b4ae82ab9a0f5e0d25_GH0.tar.gz.
===========================================================================
=======================<phase: extract-depends>============================
===== env: USE_PACKAGE_DEPENDS_ONLY=1 USER=root UID=0 GID=0
===========================================================================
=======================<phase: extract        >============================
===== env: NO_DEPENDS=yes USER=root UID=0 GID=0
===>  License APACHE20 BSD2CLAUSE MIT accepted by the user
===> Fetching all distfiles required by chiapos-1.0.7 for building
===>  Extracting for chiapos-1.0.7
=> SHA256 Checksum OK for chiapos-1.0.7.tar.gz.
=> SHA256 Checksum OK for jarro2783-cxxopts-302302b30839505703d37fb82f536c53cf9172fa_GH0.tar.gz.
=> SHA256 Checksum OK for gulrak-filesystem-4e21ab305794f5309a1454b4ae82ab9a0f5e0d25_GH0.tar.gz.
===========================================================================
=======================<phase: patch-depends  >============================
===== env: USE_PACKAGE_DEPENDS_ONLY=1 USER=root UID=0 GID=0
===========================================================================
=======================<phase: patch          >============================
===== env: NO_DEPENDS=yes USER=root UID=0 GID=0
===>  Patching for chiapos-1.0.7
===>  Applying FreeBSD patches for chiapos-1.0.7 from /usr/ports/finance/chiapos/files
===========================================================================
=======================<phase: build-depends  >============================
===== env: USE_PACKAGE_DEPENDS_ONLY=1 USER=root UID=0 GID=0
===>   chiapos-1.0.7 depends on package: catch>0 - not found
===>   Installing existing package /packages/All/catch-3.14.0.pkg
[135amd64-default-job-06] Installing catch-3.14.0...
[135amd64-default-job-06] Extracting catch-3.14.0: .......... done
===>   chiapos-1.0.7 depends on package: catch>0 - found
===>   Returning to build of chiapos-1.0.7
===>   chiapos-1.0.7 depends on file: /usr/local/bin/cmake - not found
===>   Installing existing package /packages/All/cmake-core-3.31.10_1.pkg
[135amd64-default-job-06] Installing cmake-core-3.31.10_1...
[135amd64-default-job-06] `-- Installing expat-2.8.0...
[135amd64-default-job-06] `-- Extracting expat-2.8.0: .......... done
[135amd64-default-job-06] `-- Installing jsoncpp-1.9.6_1...
[135amd64-default-job-06] `-- Extracting jsoncpp-1.9.6_1: .......... done
[135amd64-default-job-06] `-- Installing libidn2-2.3.8...
[135amd64-default-job-06] |   `-- Installing indexinfo-0.3.1_1...
[135amd64-default-job-06] |   `-- Extracting indexinfo-0.3.1_1: .... done
[135amd64-default-job-06] |   `-- Installing libunistring-1.4.2...
[135amd64-default-job-06] |   `-- Extracting libunistring-1.4.2: .......... done
[135amd64-default-job-06] `-- Extracting libidn2-2.3.8: .......... done
[135amd64-default-job-06] `-- Installing libuv-1.52.1...
[135amd64-default-job-06] `-- Extracting libuv-1.52.1: .......... done
[135amd64-default-job-06] `-- Installing rhash-1.4.6...
<snip>
===========================================================================
=======================<phase: configure      >============================
===== env: NO_DEPENDS=yes USER=root UID=0 GID=0
===>  Configuring for chiapos-1.0.7
===>  Performing out-of-source build
/bin/mkdir -p /wrkdirs/usr/ports/finance/chiapos/work/.build
-- The C compiler identification is Clang 19.1.7
-- The CXX compiler identification is Clang 19.1.7
-- The ASM compiler identification is Clang with GNU-like command-line
-- Found assembler: /usr/bin/cc
-- Detecting C compiler ABI info
-- Detecting C compiler ABI info - done
-- Check for working C compiler: /usr/bin/cc - skipped
-- Detecting C compile features
-- Detecting C compile features - done
-- Detecting CXX compiler ABI info
-- Detecting CXX compiler ABI info - done
-- Check for working CXX compiler: /usr/bin/c++ - skipped
-- Detecting CXX compile features
-- Detecting CXX compile features - done
-- Performing Test CMAKE_HAVE_LIBC_PTHREAD
-- Performing Test CMAKE_HAVE_LIBC_PTHREAD - Failed
-- Looking for pthread_create in pthreads
-- Looking for pthread_create in pthreads - not found
-- Looking for pthread_create in pthread
-- Looking for pthread_create in pthread - found
-- Found Threads: TRUE
-- Configuring done (1.1s)
-- Generating done (0.0s)
CMake Warning:
  Manually-specified variables were not used by the project:

    CMAKE_MODULE_LINKER_FLAGS
    CMAKE_SHARED_LINKER_FLAGS
    COMPILER_CXXFLAGS
    COMPILER_FLAGS
    FETCHCONTENT_FULLY_DISCONNECTED


-- Build files have been written to: /wrkdirs/usr/ports/finance/chiapos/work/.build
===========================================================================
=======================<phase: build          >============================
===== env: NO_DEPENDS=yes USER=root UID=0 GID=0
===>  Building for chiapos-1.0.7
/usr/local/bin/cmake -S/wrkdirs/usr/ports/finance/chiapos/work/chiapos-1.0.7 -B/wrkdirs/usr/ports/finance/chiapos/work/.build --check-build-system CMakeFiles/Makefile.cmake 0
/usr/local/bin/cmake -E cmake_progress_start /wrkdirs/usr/ports/finance/chiapos/work/.build/CMakeFiles /wrkdirs/usr/ports/finance/chiapos/work/.build//CMakeFiles/progress.marks
/usr/bin/make  -f CMakeFiles/Makefile2 all
--- CMakeFiles/fse.dir/all ---
--- CMakeFiles/uint128.dir/all ---
--- CMakeFiles/fse.dir/all ---
/usr/bin/make  -f CMakeFiles/fse.dir/build.make CMakeFiles/fse.dir/depend
--- CMakeFiles/uint128.dir/all ---
/usr/bin/make  -f CMakeFiles/uint128.dir/build.make CMakeFiles/uint128.dir/depend
--- CMakeFiles/uint128.dir/depend ---
--- CMakeFiles/fse.dir/all ---
--- CMakeFiles/fse.dir/depend ---
--- CMakeFiles/uint128.dir/all ---
cd /wrkdirs/usr/ports/finance/chiapos/work/.build && /usr/local/bin/cmake -E cmake_depends "Unix Makefiles" /wrkdirs/usr/ports/finance/chiapos/work/chiapos-1.0.7 /wrkdirs/usr/ports/finance/chiapos/work/chiapos-1.0.7 /wrkdirs/usr/ports/finance/chiapos/work/.build /wrkdirs/usr/ports/finance/chiapos/work/.build /wrkdirs/usr/ports/finance/chiapos/work/.build/CMakeFiles/uint128.dir/DependInfo.cmake
--- CMakeFiles/fse.dir/all ---
cd /wrkdirs/usr/ports/finance/chiapos/work/.build && /usr/local/bin/cmake -E cmake_depends "Unix Makefiles" /wrkdirs/usr/ports/finance/chiapos/work/chiapos-1.0.7 /wrkdirs/usr/ports/finance/chiapos/work/chiapos-1.0.7 /wrkdirs/usr/ports/finance/chiapos/work/.build /wrkdirs/usr/ports/finance/chiapos/work/.build /wrkdirs/usr/ports/finance/chiapos/work/.build/CMakeFiles/fse.dir/DependInfo.cmake
--- CMakeFiles/uint128.dir/all ---
/usr/bin/make  -f CMakeFiles/uint128.dir/build.make CMakeFiles/uint128.dir/build
--- CMakeFiles/fse.dir/all ---
/usr/bin/make  -f CMakeFiles/fse.dir/build.make CMakeFiles/fse.dir/build
--- CMakeFiles/uint128.dir/all ---
--- CMakeFiles/uint128.dir/uint128_t/uint128_t.cpp.o ---
[  7%] Building CXX object CMakeFiles/uint128.dir/uint128_t/uint128_t.cpp.o
--- CMakeFiles/fse.dir/all ---
--- CMakeFiles/fse.dir/lib/FiniteStateEntropy/lib/fse_compress.c.o ---
--- CMakeFiles/fse.dir/lib/FiniteStateEntropy/lib/fse_decompress.c.o ---
--- CMakeFiles/fse.dir/lib/FiniteStateEntropy/lib/fse_compress.c.o ---
[  7%] Building C object CMakeFiles/fse.dir/lib/FiniteStateEntropy/lib/fse_compress.c.o
--- CMakeFiles/uint128.dir/all ---
/usr/bin/c++  -I/usr/local/include -I/wrkdirs/usr/ports/finance/chiapos/work/chiapos-1.0.7/../lib/include -I/wrkdirs/usr/ports/finance/chiapos/work/chiapos-1.0.7/src-ext/cxxopts/include -I/wrkdirs/usr/ports/finance/chiapos/work/chiapos-1.0.7/src-ext/gulrak/include/ghc -I/wrkdirs/usr/ports/finance/chiapos/work/chiapos-1.0.7/../lib/FiniteStateEntropy/lib -I/wrkdirs/usr/ports/finance/chiapos/work/chiapos-1.0.7/src -I/wrkdirs/usr/ports/finance/chiapos/work/chiapos-1.0.7/test -I/wrkdirs/usr/ports/finance/chiapos/work/chiapos-1.0.7/uint128_t -O2 -pipe -fstack-protector-strong -fno-strict-aliasing -O0 -Wall -g -O2 -pipe -fstack-protector-strong -fno-strict-aliasing   -DNDEBUG -std=gnu++17 -fPIC -MD -MT CMakeFiles/uint128.dir/uint128_t/uint128_t.cpp.o -MF CMakeFiles/uint128.dir/uint128_t/uint128_t.cpp.o.d -o CMakeFiles/uint128.dir/uint128_t/uint128_t.cpp.o -c /wrkdirs/usr/ports/finance/chiapos/work/chiapos-1.0.7/uint128_t/uint128_t.cpp
--- CMakeFiles/fse.dir/all ---
/usr/bin/cc  -I/usr/local/include -I/wrkdirs/usr/ports/finance/chiapos/work/chiapos-1.0.7/../lib/include -I/wrkdirs/usr/ports/finance/chiapos/work/chiapos-1.0.7/src-ext/cxxopts/include -I/wrkdirs/usr/ports/finance/chiapos/work/chiapos-1.0.7/src-ext/gulrak/include/ghc -I/wrkdirs/usr/ports/finance/chiapos/work/chiapos-1.0.7/../lib/FiniteStateEntropy/lib -I/wrkdirs/usr/ports/finance/chiapos/work/chiapos-1.0.7/src -I/wrkdirs/usr/ports/finance/chiapos/work/chiapos-1.0.7/test -O2 -pipe  -fstack-protector-strong -fno-strict-aliasing -O0 -Wall -g -O2 -pipe  -fstack-protector-strong -fno-strict-aliasing  -DNDEBUG -fPIC -MD -MT CMakeFiles/fse.dir/lib/FiniteStateEntropy/lib/fse_compress.c.o -MF CMakeFiles/fse.dir/lib/FiniteStateEntropy/lib/fse_compress.c.o.d -o CMakeFiles/fse.dir/lib/FiniteStateEntropy/lib/fse_compress.c.o -c /wrkdirs/usr/ports/finance/chiapos/work/chiapos-1.0.7/lib/FiniteStateEntropy/lib/fse_compress.c
--- CMakeFiles/fse.dir/lib/FiniteStateEntropy/lib/fse_decompress.c.o ---
[ 11%] Building C object CMakeFiles/fse.dir/lib/FiniteStateEntropy/lib/fse_decompress.c.o
/usr/bin/cc  -I/usr/local/include -I/wrkdirs/usr/ports/finance/chiapos/work/chiapos-1.0.7/../lib/include -I/wrkdirs/usr/ports/finance/chiapos/work/chiapos-1.0.7/src-ext/cxxopts/include -I/wrkdirs/usr/ports/finance/chiapos/work/chiapos-1.0.7/src-ext/gulrak/include/ghc -I/wrkdirs/usr/ports/finance/chiapos/work/chiapos-1.0.7/../lib/FiniteStateEntropy/lib -I/wrkdirs/usr/ports/finance/chiapos/work/chiapos-1.0.7/src -I/wrkdirs/usr/ports/finance/chiapos/work/chiapos-1.0.7/test -O2 -pipe  -fstack-protector-strong -fno-strict-aliasing -O0 -Wall -g -O2 -pipe  -fstack-protector-strong -fno-strict-aliasing  -DNDEBUG -fPIC -MD -MT CMakeFiles/fse.dir/lib/FiniteStateEntropy/lib/fse_decompress.c.o -MF CMakeFiles/fse.dir/lib/FiniteStateEntropy/lib/fse_decompress.c.o.d -o CMakeFiles/fse.dir/lib/FiniteStateEntropy/lib/fse_decompress.c.o -c /wrkdirs/usr/ports/finance/chiapos/work/chiapos-1.0.7/lib/FiniteStateEntropy/lib/fse_decompress.c
--- CMakeFiles/fse.dir/lib/FiniteStateEntropy/lib/entropy_common.c.o ---
[ 15%] Building C object CMakeFiles/fse.dir/lib/FiniteStateEntropy/lib/entropy_common.c.o
/usr/bin/cc  -I/usr/local/include -I/wrkdirs/usr/ports/finance/chiapos/work/chiapos-1.0.7/../lib/include -I/wrkdirs/usr/ports/finance/chiapos/work/chiapos-1.0.7/src-ext/cxxopts/include -I/wrkdirs/usr/ports/finance/chiapos/work/chiapos-1.0.7/src-ext/gulrak/include/ghc -I/wrkdirs/usr/ports/finance/chiapos/work/chiapos-1.0.7/../lib/FiniteStateEntropy/lib -I/wrkdirs/usr/ports/finance/chiapos/work/chiapos-1.0.7/src -I/wrkdirs/usr/ports/finance/chiapos/work/chiapos-1.0.7/test -O2 -pipe  -fstack-protector-strong -fno-strict-aliasing -O0 -Wall -g -O2 -pipe  -fstack-protector-strong -fno-strict-aliasing  -DNDEBUG -fPIC -MD -MT CMakeFiles/fse.dir/lib/FiniteStateEntropy/lib/entropy_common.c.o -MF CMakeFiles/fse.dir/lib/FiniteStateEntropy/lib/entropy_common.c.o.d -o CMakeFiles/fse.dir/lib/FiniteStateEntropy/lib/entropy_common.c.o -c /wrkdirs/usr/ports/finance/chiapos/work/chiapos-1.0.7/lib/FiniteStateEntropy/lib/entropy_common.c
--- CMakeFiles/fse.dir/lib/FiniteStateEntropy/lib/hist.c.o ---
[ 19%] Building C object CMakeFiles/fse.dir/lib/FiniteStateEntropy/lib/hist.c.o
/usr/bin/cc  -I/usr/local/include -I/wrkdirs/usr/ports/finance/chiapos/work/chiapos-1.0.7/../lib/include -I/wrkdirs/usr/ports/finance/chiapos/work/chiapos-1.0.7/src-ext/cxxopts/include -I/wrkdirs/usr/ports/finance/chiapos/work/chiapos-1.0.7/src-ext/gulrak/include/ghc -I/wrkdirs/usr/ports/finance/chiapos/work/chiapos-1.0.7/../lib/FiniteStateEntropy/lib -I/wrkdirs/usr/ports/finance/chiapos/work/chiapos-1.0.7/src -I/wrkdirs/usr/ports/finance/chiapos/work/chiapos-1.0.7/test -O2 -pipe  -fstack-protector-strong -fno-strict-aliasing -O0 -Wall -g -O2 -pipe  -fstack-protector-strong -fno-strict-aliasing  -DNDEBUG -fPIC -MD -MT CMakeFiles/fse.dir/lib/FiniteStateEntropy/lib/hist.c.o -MF CMakeFiles/fse.dir/lib/FiniteStateEntropy/lib/hist.c.o.d -o CMakeFiles/fse.dir/lib/FiniteStateEntropy/lib/hist.c.o -c /wrkdirs/usr/ports/finance/chiapos/work/chiapos-1.0.7/lib/FiniteStateEntropy/lib/hist.c
--- libfse.a ---
[ 23%] Linking C static library libfse.a
/usr/local/bin/cmake -P CMakeFiles/fse.dir/cmake_clean_target.cmake
/usr/local/bin/cmake -E cmake_link_script CMakeFiles/fse.dir/link.txt --verbose=1
/usr/bin/llvm-ar qc libfse.a CMakeFiles/fse.dir/lib/FiniteStateEntropy/lib/fse_compress.c.o CMakeFiles/fse.dir/lib/FiniteStateEntropy/lib/fse_decompress.c.o CMakeFiles/fse.dir/lib/FiniteStateEntropy/lib/entropy_common.c.o CMakeFiles/fse.dir/lib/FiniteStateEntropy/lib/hist.c.o
/usr/bin/llvm-ranlib libfse.a
[ 23%] Built target fse
--- CMakeFiles/ProofOfSpace.dir/all ---
--- CMakeFiles/RunTests.dir/all ---
--- CMakeFiles/ProofOfSpace.dir/all ---
/usr/bin/make  -f CMakeFiles/ProofOfSpace.dir/build.make CMakeFiles/ProofOfSpace.dir/depend
--- CMakeFiles/RunTests.dir/all ---
/usr/bin/make  -f CMakeFiles/RunTests.dir/build.make CMakeFiles/RunTests.dir/depend
--- CMakeFiles/ProofOfSpace.dir/all ---
--- CMakeFiles/ProofOfSpace.dir/depend ---
--- CMakeFiles/RunTests.dir/all ---
--- CMakeFiles/RunTests.dir/depend ---
--- CMakeFiles/ProofOfSpace.dir/all ---
cd /wrkdirs/usr/ports/finance/chiapos/work/.build && /usr/local/bin/cmake -E cmake_depends "Unix Makefiles" /wrkdirs/usr/ports/finance/chiapos/work/chiapos-1.0.7 /wrkdirs/usr/ports/finance/chiapos/work/chiapos-1.0.7 /wrkdirs/usr/ports/finance/chiapos/work/.build /wrkdirs/usr/ports/finance/chiapos/work/.build /wrkdirs/usr/ports/finance/chiapos/work/.build/CMakeFiles/ProofOfSpace.dir/DependInfo.cmake
--- CMakeFiles/RunTests.dir/all ---
cd /wrkdirs/usr/ports/finance/chiapos/work/.build && /usr/local/bin/cmake -E cmake_depends "Unix Makefiles" /wrkdirs/usr/ports/finance/chiapos/work/chiapos-1.0.7 /wrkdirs/usr/ports/finance/chiapos/work/chiapos-1.0.7 /wrkdirs/usr/ports/finance/chiapos/work/.build /wrkdirs/usr/ports/finance/chiapos/work/.build /wrkdirs/usr/ports/finance/chiapos/work/.build/CMakeFiles/RunTests.dir/DependInfo.cmake
/usr/bin/make  -f CMakeFiles/RunTests.dir/build.make CMakeFiles/RunTests.dir/build
--- CMakeFiles/ProofOfSpace.dir/all ---
/usr/bin/make  -f CMakeFiles/ProofOfSpace.dir/build.make CMakeFiles/ProofOfSpace.dir/build
--- CMakeFiles/ProofOfSpace.dir/src/b3/blake3_avx2_x86-64_unix.S.o ---
--- CMakeFiles/RunTests.dir/all ---
--- CMakeFiles/RunTests.dir/src/b3/blake3_avx2_x86-64_unix.S.o ---
--- CMakeFiles/ProofOfSpace.dir/all ---
[ 26%] Building ASM object CMakeFiles/ProofOfSpace.dir/src/b3/blake3_avx2_x86-64_unix.S.o
/usr/bin/cc  -I/usr/local/include -I/wrkdirs/usr/ports/finance/chiapos/work/chiapos-1.0.7/../lib/include -I/wrkdirs/usr/ports/finance/chiapos/work/chiapos-1.0.7/src-ext/cxxopts/include -I/wrkdirs/usr/ports/finance/chiapos/work/chiapos-1.0.7/src-ext/gulrak/include/ghc -I/wrkdirs/usr/ports/finance/chiapos/work/chiapos-1.0.7/../lib/FiniteStateEntropy/lib -I/wrkdirs/usr/ports/finance/chiapos/work/chiapos-1.0.7/src -I/wrkdirs/usr/ports/finance/chiapos/work/chiapos-1.0.7/test -O3 -DNDEBUG -fPIE -pthread -o CMakeFiles/ProofOfSpace.dir/src/b3/blake3_avx2_x86-64_unix.S.o -c /wrkdirs/usr/ports/finance/chiapos/work/chiapos-1.0.7/src/b3/blake3_avx2_x86-64_unix.S
--- CMakeFiles/RunTests.dir/all ---
[ 30%] Building ASM object CMakeFiles/RunTests.dir/src/b3/blake3_avx2_x86-64_unix.S.o
/usr/bin/cc  -I/usr/local/include -I/wrkdirs/usr/ports/finance/chiapos/work/chiapos-1.0.7/../lib/include -I/wrkdirs/usr/ports/finance/chiapos/work/chiapos-1.0.7/src-ext/cxxopts/include -I/wrkdirs/usr/ports/finance/chiapos/work/chiapos-1.0.7/src-ext/gulrak/include/ghc -I/wrkdirs/usr/ports/finance/chiapos/work/chiapos-1.0.7/../lib/FiniteStateEntropy/lib -I/wrkdirs/usr/ports/finance/chiapos/work/chiapos-1.0.7/src -I/wrkdirs/usr/ports/finance/chiapos/work/chiapos-1.0.7/test -O3 -DNDEBUG -fPIE -pthread -o CMakeFiles/RunTests.dir/src/b3/blake3_avx2_x86-64_unix.S.o -c /wrkdirs/usr/ports/finance/chiapos/work/chiapos-1.0.7/src/b3/blake3_avx2_x86-64_unix.S
--- CMakeFiles/ProofOfSpace.dir/all ---
--- CMakeFiles/ProofOfSpace.dir/src/b3/blake3_avx512_x86-64_unix.S.o ---
--- CMakeFiles/RunTests.dir/all ---
--- CMakeFiles/RunTests.dir/src/b3/blake3_avx512_x86-64_unix.S.o ---
--- CMakeFiles/ProofOfSpace.dir/all ---
[ 38%] Building ASM object CMakeFiles/ProofOfSpace.dir/src/b3/blake3_avx512_x86-64_unix.S.o
--- CMakeFiles/RunTests.dir/all ---
[ 38%] Building ASM object CMakeFiles/RunTests.dir/src/b3/blake3_avx512_x86-64_unix.S.o
/usr/bin/cc  -I/usr/local/include -I/wrkdirs/usr/ports/finance/chiapos/work/chiapos-1.0.7/../lib/include -I/wrkdirs/usr/ports/finance/chiapos/work/chiapos-1.0.7/src-ext/cxxopts/include -I/wrkdirs/usr/ports/finance/chiapos/work/chiapos-1.0.7/src-ext/gulrak/include/ghc -I/wrkdirs/usr/ports/finance/chiapos/work/chiapos-1.0.7/../lib/FiniteStateEntropy/lib -I/wrkdirs/usr/ports/finance/chiapos/work/chiapos-1.0.7/src -I/wrkdirs/usr/ports/finance/chiapos/work/chiapos-1.0.7/test -O3 -DNDEBUG -fPIE -pthread -o CMakeFiles/RunTests.dir/src/b3/blake3_avx512_x86-64_unix.S.o -c /wrkdirs/usr/ports/finance/chiapos/work/chiapos-1.0.7/src/b3/blake3_avx512_x86-64_unix.S
--- CMakeFiles/ProofOfSpace.dir/all ---
/usr/bin/cc  -I/usr/local/include -I/wrkdirs/usr/ports/finance/chiapos/work/chiapos-1.0.7/../lib/include -I/wrkdirs/usr/ports/finance/chiapos/work/chiapos-1.0.7/src-ext/cxxopts/include -I/wrkdirs/usr/ports/finance/chiapos/work/chiapos-1.0.7/src-ext/gulrak/include/ghc -I/wrkdirs/usr/ports/finance/chiapos/work/chiapos-1.0.7/../lib/FiniteStateEntropy/lib -I/wrkdirs/usr/ports/finance/chiapos/work/chiapos-1.0.7/src -I/wrkdirs/usr/ports/finance/chiapos/work/chiapos-1.0.7/test -O3 -DNDEBUG -fPIE -pthread -o CMakeFiles/ProofOfSpace.dir/src/b3/blake3_avx512_x86-64_unix.S.o -c /wrkdirs/usr/ports/finance/chiapos/work/chiapos-1.0.7/src/b3/blake3_avx512_x86-64_unix.S
--- CMakeFiles/ProofOfSpace.dir/src/b3/blake3_sse41_x86-64_unix.S.o ---
--- CMakeFiles/RunTests.dir/all ---
--- CMakeFiles/RunTests.dir/src/b3/blake3_sse41_x86-64_unix.S.o ---
--- CMakeFiles/ProofOfSpace.dir/all ---
[ 46%] Building ASM object CMakeFiles/ProofOfSpace.dir/src/b3/blake3_sse41_x86-64_unix.S.o
--- CMakeFiles/RunTests.dir/all ---
[ 46%] Building ASM object CMakeFiles/RunTests.dir/src/b3/blake3_sse41_x86-64_unix.S.o
--- CMakeFiles/ProofOfSpace.dir/all ---
/usr/bin/cc  -I/usr/local/include -I/wrkdirs/usr/ports/finance/chiapos/work/chiapos-1.0.7/../lib/include -I/wrkdirs/usr/ports/finance/chiapos/work/chiapos-1.0.7/src-ext/cxxopts/include -I/wrkdirs/usr/ports/finance/chiapos/work/chiapos-1.0.7/src-ext/gulrak/include/ghc -I/wrkdirs/usr/ports/finance/chiapos/work/chiapos-1.0.7/../lib/FiniteStateEntropy/lib -I/wrkdirs/usr/ports/finance/chiapos/work/chiapos-1.0.7/src -I/wrkdirs/usr/ports/finance/chiapos/work/chiapos-1.0.7/test -O3 -DNDEBUG -fPIE -pthread -o CMakeFiles/ProofOfSpace.dir/src/b3/blake3_sse41_x86-64_unix.S.o -c /wrkdirs/usr/ports/finance/chiapos/work/chiapos-1.0.7/src/b3/blake3_sse41_x86-64_unix.S
--- CMakeFiles/RunTests.dir/all ---
/usr/bin/cc  -I/usr/local/include -I/wrkdirs/usr/ports/finance/chiapos/work/chiapos-1.0.7/../lib/include -I/wrkdirs/usr/ports/finance/chiapos/work/chiapos-1.0.7/src-ext/cxxopts/include -I/wrkdirs/usr/ports/finance/chiapos/work/chiapos-1.0.7/src-ext/gulrak/include/ghc -I/wrkdirs/usr/ports/finance/chiapos/work/chiapos-1.0.7/../lib/FiniteStateEntropy/lib -I/wrkdirs/usr/ports/finance/chiapos/work/chiapos-1.0.7/src -I/wrkdirs/usr/ports/finance/chiapos/work/chiapos-1.0.7/test -O3 -DNDEBUG -fPIE -pthread -o CMakeFiles/RunTests.dir/src/b3/blake3_sse41_x86-64_unix.S.o -c /wrkdirs/usr/ports/finance/chiapos/work/chiapos-1.0.7/src/b3/blake3_sse41_x86-64_unix.S
--- CMakeFiles/ProofOfSpace.dir/all ---
--- CMakeFiles/ProofOfSpace.dir/src/cli.cpp.o ---
--- CMakeFiles/RunTests.dir/all ---
--- CMakeFiles/RunTests.dir/tests/test-main.cpp.o ---
--- CMakeFiles/ProofOfSpace.dir/all ---
[ 53%] Building CXX object CMakeFiles/ProofOfSpace.dir/src/cli.cpp.o
--- CMakeFiles/RunTests.dir/all ---
[ 53%] Building CXX object CMakeFiles/RunTests.dir/tests/test-main.cpp.o
/usr/bin/c++  -I/usr/local/include -I/wrkdirs/usr/ports/finance/chiapos/work/chiapos-1.0.7/../lib/include -I/wrkdirs/usr/ports/finance/chiapos/work/chiapos-1.0.7/src-ext/cxxopts/include -I/wrkdirs/usr/ports/finance/chiapos/work/chiapos-1.0.7/src-ext/gulrak/include/ghc -I/wrkdirs/usr/ports/finance/chiapos/work/chiapos-1.0.7/../lib/FiniteStateEntropy/lib -I/wrkdirs/usr/ports/finance/chiapos/work/chiapos-1.0.7/src -I/wrkdirs/usr/ports/finance/chiapos/work/chiapos-1.0.7/test -O2 -pipe -fstack-protector-strong -fno-strict-aliasing -O0 -Wall -g -O2 -pipe -fstack-protector-strong -fno-strict-aliasing   -DNDEBUG -std=gnu++17 -fPIE -pthread -MD -MT CMakeFiles/RunTests.dir/tests/test-main.cpp.o -MF CMakeFiles/RunTests.dir/tests/test-main.cpp.o.d -o CMakeFiles/RunTests.dir/tests/test-main.cpp.o -c /wrkdirs/usr/ports/finance/chiapos/work/chiapos-1.0.7/tests/test-main.cpp
--- CMakeFiles/ProofOfSpace.dir/all ---
/usr/bin/c++  -I/usr/local/include -I/wrkdirs/usr/ports/finance/chiapos/work/chiapos-1.0.7/../lib/include -I/wrkdirs/usr/ports/finance/chiapos/work/chiapos-1.0.7/src-ext/cxxopts/include -I/wrkdirs/usr/ports/finance/chiapos/work/chiapos-1.0.7/src-ext/gulrak/include/ghc -I/wrkdirs/usr/ports/finance/chiapos/work/chiapos-1.0.7/../lib/FiniteStateEntropy/lib -I/wrkdirs/usr/ports/finance/chiapos/work/chiapos-1.0.7/src -I/wrkdirs/usr/ports/finance/chiapos/work/chiapos-1.0.7/test -O2 -pipe -fstack-protector-strong -fno-strict-aliasing -O0 -Wall -g -O2 -pipe -fstack-protector-strong -fno-strict-aliasing   -DNDEBUG -std=gnu++17 -fPIE -pthread -MD -MT CMakeFiles/ProofOfSpace.dir/src/cli.cpp.o -MF CMakeFiles/ProofOfSpace.dir/src/cli.cpp.o.d -o CMakeFiles/ProofOfSpace.dir/src/cli.cpp.o -c /wrkdirs/usr/ports/finance/chiapos/work/chiapos-1.0.7/src/cli.cpp
--- CMakeFiles/RunTests.dir/all ---
/wrkdirs/usr/ports/finance/chiapos/work/chiapos-1.0.7/tests/test-main.cpp:16:10: fatal error: 'catch2/catch.hpp' file not found
   16 | #include <catch2/catch.hpp>
      |          ^~~~~~~~~~~~~~~~~~
1 error generated.
*** [CMakeFiles/RunTests.dir/tests/test-main.cpp.o] Error code 1

make[2]: stopped in /wrkdirs/usr/ports/finance/chiapos/work/.build
1 error

make[2]: stopped in /wrkdirs/usr/ports/finance/chiapos/work/.build
*** [CMakeFiles/RunTests.dir/all] Error code 2

make[1]: stopped in /wrkdirs/usr/ports/finance/chiapos/work/.build
--- CMakeFiles/ProofOfSpace.dir/all ---
*** [CMakeFiles/ProofOfSpace.dir/all] Error code 6

make[1]: stopped in /wrkdirs/usr/ports/finance/chiapos/work/.build
--- CMakeFiles/uint128.dir/all ---
/wrkdirs/usr/ports/finance/chiapos/work/chiapos-1.0.7/uint128_t/uint128_t.cpp:235:13: warning: use of bitwise '|' with boolean operands [-Wbitwise-instead-of-logical]
  235 |     return ((*this > rhs) | (*this == rhs));
      |            ~^~~~~~~~~~~~~~~~~~~~~~~~~~~~~~~
      |                           ||
/wrkdirs/usr/ports/finance/chiapos/work/chiapos-1.0.7/uint128_t/uint128_t.cpp:235:13: note: cast one or both operands to int to silence this warning
/wrkdirs/usr/ports/finance/chiapos/work/chiapos-1.0.7/uint128_t/uint128_t.cpp:239:13: warning: use of bitwise '|' with boolean operands [-Wbitwise-instead-of-logical]
  239 |     return ((*this < rhs) | (*this == rhs));
      |            ~^~~~~~~~~~~~~~~~~~~~~~~~~~~~~~~
      |                           ||
/wrkdirs/usr/ports/finance/chiapos/work/chiapos-1.0.7/uint128_t/uint128_t.cpp:239:13: note: cast one or both operands to int to silence this warning
2 warnings generated.
*** [CMakeFiles/uint128.dir/all] Error code 6

make[1]: stopped in /wrkdirs/usr/ports/finance/chiapos/work/.build
3 errors

make[1]: stopped in /wrkdirs/usr/ports/finance/chiapos/work/.build
*** [all] Error code 2

make: stopped in /wrkdirs/usr/ports/finance/chiapos/work/.build
1 error

make: stopped in /wrkdirs/usr/ports/finance/chiapos/work/.build
===> Compilation failed unexpectedly.
Try to set MAKE_JOBS_UNSAFE=yes and rebuild before reporting the failure to
the maintainer.
*** Error code 1

Stop.
make: stopped in /usr/ports/finance/chiapos