[package - 150arm64-default][editors/lazarus-qt6] Failed for lazarus-qt6-4.8 in build
- Go to: [ bottom of page ] [ top of archives ] [ this month ]
Date: Mon, 22 Jun 2026 10:48:58 UTC
You are receiving this mail as a port that you maintain
is failing to build on the FreeBSD package build server.
Please investigate the failure and submit a PR to fix
build.
Maintainer: acm@FreeBSD.org
Log URL: https://pkg-status.freebsd.org/ampere5/data/150arm64-default/0cd7b5a3f54a/logs/lazarus-qt6-4.8.log
Build URL: https://pkg-status.freebsd.org/ampere5/build.html?mastername=150arm64-default&build=0cd7b5a3f54a
Log:
=>> Building editors/lazarus-qt6
build started at Mon Jun 22 10:42:02 UTC 2026
port directory: /usr/ports/editors/lazarus-qt6
package name: lazarus-qt6-4.8
building for: FreeBSD 150arm64-default-job-19 15.0-RELEASE-p10 FreeBSD 15.0-RELEASE-p10 arm64
maintained by: acm@FreeBSD.org
Makefile datestamp: -rw-r--r-- 1 root wheel 351 Jan 3 01:01 /usr/ports/editors/lazarus-qt6/Makefile
Ports top last git commit: 0cd7b5a3f54a52042f1482e004e2ce70fe6c2275
Ports top unclean checkout: no
Port dir last git commit: a633e739157c8cf87492b7c95e3725b84bb51dc8
Port dir unclean checkout: no
Poudriere version: poudriere-git-3.4.8
Host OSVERSION: 1600018
Jail OSVERSION: 1500068
Job Id: 19
---Begin Environment---
SHELL=/bin/sh
OSVERSION=1500068
UNAME_v=FreeBSD 15.0-RELEASE-p10
UNAME_r=15.0-RELEASE-p10
BLOCKSIZE=K
MAIL=/var/mail/root
MM_CHARSET=UTF-8
LANG=C.UTF-8
STATUS=1
HOME=/root
PATH=/sbin:/bin:/usr/sbin:/usr/bin:/usr/local/sbin:/usr/local/bin:/root/bin
MAKE_OBJDIR_CHECK_WRITABLE=0
LOCALBASE=/usr/local
USER=root
POUDRIERE_NAME=poudriere-git
LIBEXECPREFIX=/usr/local/libexec/poudriere
POUDRIERE_VERSION=3.4.8
MASTERMNT=/usr/local/poudriere/data/.m/150arm64-default/ref
LC_COLLATE=C
POUDRIERE_BUILD_TYPE=bulk
PACKAGE_BUILDING=yes
SAVED_TERM=
OUTPUT_REDIRECTED_STDERR=4
OUTPUT_REDIRECTED=1
PWD=/usr/local/poudriere/data/.m/150arm64-default/19/.p
OUTPUT_REDIRECTED_STDOUT=3
P_PORTS_FEATURES=FLAVORS SUBPACKAGES SELECTED_OPTIONS
MASTERNAME=150arm64-default
SCRIPTPREFIX=/usr/local/share/poudriere
SCRIPTNAME=bulk.sh
OLDPWD=/usr/local/poudriere/data/.m/150arm64-default/ref/.p/pool
POUDRIERE_PKGNAME=poudriere-git-3.4.8
SCRIPTPATH=/usr/local/share/poudriere/bulk.sh
POUDRIEREPATH=/usr/local/bin/poudriere
---End Environment---
---Begin Poudriere Port Flags/Env---
PORT_FLAGS=
PKGENV=
FLAVOR=
MAKE_ARGS=
---End Poudriere Port Flags/Env---
---Begin OPTIONS List---
===> The following configuration options are available for lazarus-qt6-4.8:
GDB=on: Install a newest version of gdb
===> Use 'make config' to modify these settings
---End OPTIONS List---
--MAINTAINER--
acm@FreeBSD.org
--End MAINTAINER--
--CONFIGURE_ARGS--
--End CONFIGURE_ARGS--
--CONFIGURE_ENV--
MAKE=/usr/local/bin/gmake XDG_DATA_HOME=/wrkdirs/usr/ports/editors/lazarus-qt6/work XDG_CONFIG_HOME=/wrkdirs/usr/ports/editors/lazarus-qt6/work XDG_CACHE_HOME=/wrkdirs/usr/ports/editors/lazarus-qt6/work/.cache HOME=/wrkdirs/usr/ports/editors/lazarus-qt6/work TMPDIR="/tmp" PATH=/wrkdirs/usr/ports/editors/lazarus-qt6/work/.bin:/sbin:/bin:/usr/sbin:/usr/bin:/usr/local/sbin:/usr/local/bin:/root/bin PKG_CONFIG_LIBDIR=/wrkdirs/usr/ports/editors/lazarus-qt6/work/.pkgconfig:/usr/local/libdata/pkgconfig:/usr/local/share/pkgconfig:/usr/libdata/pkgconfig SHELL=/bin/sh CONFIG_SHELL=/bin/sh
--End CONFIGURE_ENV--
--MAKE_ENV--
OPT="-Sgic " XDG_DATA_HOME=/wrkdirs/usr/ports/editors/lazarus-qt6/work XDG_CONFIG_HOME=/wrkdirs/usr/ports/editors/lazarus-qt6/work XDG_CACHE_HOME=/wrkdirs/usr/ports/editors/lazarus-qt6/work/.cache HOME=/wrkdirs/usr/ports/editors/lazarus-qt6/work TMPDIR="/tmp" PATH=/wrkdirs/usr/ports/editors/lazarus-qt6/work/.bin:/sbin:/bin:/usr/sbin:/usr/bin:/usr/local/sbin:/usr/local/bin:/root/bin PKG_CONFIG_LIBDIR=/wrkdirs/usr/ports/editors/lazarus-qt6/work/.pkgconfig:/usr/local/libdata/pkgconfig:/usr/local/share/pkgconfig:/usr/libdata/pkgconfig MK_DEBUG_FILES=no MK_KERNEL_SYMBOLS=no SHELL=/bin/sh NO_LINT=YES PREFIX=/usr/local LOCALBASE=/usr/local CC="cc" CFLAGS="-O2 -pipe -DLIBICONV_PLUG -fstack-protector-strong -fno-strict-aliasing " CPP="cpp" CPPFLAGS="-DLIBICONV_PLUG" LDFLAGS=" " LIBS="" CXX="c++" CXXFLAGS="-O2 -pipe -DLIBICONV_PLUG -fstack-protector-strong -fno-strict-aliasing -DLIBICONV_PLUG " BSD_INSTALL_PROGRAM="install -s -m 555" BSD_INSTALL_LIB="install -s -m 0644"
BSD_INSTALL_SCRIPT="install -m 555" BSD_INSTALL_DATA="install -m 0644" BSD_INSTALL_MAN="install -m 444"
--End MAKE_ENV--
--PLIST_SUB--
OSREL=15.0 PREFIX=%D LOCALBASE=/usr/local RESETPREFIX=/usr/local LIB32DIR=lib DOCSDIR="share/doc/lazarus" EXAMPLESDIR="share/examples/lazarus" DATADIR="share/lazarus-4.8" WWWDIR="www/lazarus" ETCDIR="etc/lazarus"
--End PLIST_SUB--
--SUB_LIST--
PORTSDIR="/usr/ports" PREFIX=/usr/local LOCALBASE=/usr/local DATADIR=/usr/local/share/lazarus-4.8 DOCSDIR=/usr/local/share/doc/lazarus EXAMPLESDIR=/usr/local/share/examples/lazarus WWWDIR=/usr/local/www/lazarus ETCDIR=/usr/local/etc/lazarus
--End SUB_LIST--
---Begin make.conf---
USE_PACKAGE_DEPENDS=yes
BATCH=yes
WRKDIRPREFIX=/wrkdirs
PORTSDIR=/usr/ports
PACKAGES=/packages
DISTDIR=/distfiles
PACKAGE_BUILDING=yes
PACKAGE_BUILDING_FLAVORS=yes
#### ####
# XXX: We really need this but cannot use it while 'make checksum' does not
# try the next mirror on checksum failure. It currently retries the same
# failed mirror and then fails rather then trying another. It *does*
# try the next if the size is mismatched though.
#MASTER_SITE_FREEBSD=yes
# Build ALLOW_MAKE_JOBS_PACKAGES with 3 jobs
MAKE_JOBS_NUMBER=3
#### Misc Poudriere ####
.include "/etc/make.conf.ports_env"
GID=0
UID=0
---End make.conf---
--Resource limits--
cpu time (seconds, -t) unlimited
file size (512-blocks, -f) unlimited
data seg size (kbytes, -d) 1048576
stack size (kbytes, -s) 1048576
core file size (512-blocks, -c) unlimited
max memory size (kbytes, -m) unlimited
locked memory (kbytes, -l) unlimited
max user processes (-u) 89999
open files (-n) 8192
virtual mem size (kbytes, -v) unlimited
swap limit (kbytes, -w) unlimited
socket buffer size (bytes, -b) unlimited
pseudo-terminals (-p) unlimited
kqueues (-k) unlimited
umtx shared locks (-o) unlimited
pipebuf (-y) unlimited
--End resource limits--
=======================<phase: check-sanity >============================
===== env: NO_DEPENDS=yes USER=root UID=0 GID=0
===========================================================================
=======================<phase: pkg-depends >============================
===== env: USE_PACKAGE_DEPENDS_ONLY=1 USER=root UID=0 GID=0
===> lazarus-qt6-4.8 depends on file: /usr/local/sbin/pkg - not found
===> Installing existing package /packages/All/pkg-2.7.5.pkg
[150arm64-default-job-19] Installing pkg-2.7.5...
[150arm64-default-job-19] Extracting pkg-2.7.5: .......... done
===> lazarus-qt6-4.8 depends on file: /usr/local/sbin/pkg - found
===> Returning to build of lazarus-qt6-4.8
===========================================================================
=======================<phase: fetch-depends >============================
===== env: USE_PACKAGE_DEPENDS_ONLY=1 USER=root UID=0 GID=0
===========================================================================
=======================<phase: fetch >============================
===== env: NO_DEPENDS=yes USER=root UID=0 GID=0
===> Fetching all distfiles required by lazarus-qt6-4.8 for building
===========================================================================
=======================<phase: checksum >============================
===== env: NO_DEPENDS=yes USER=root UID=0 GID=0
===> Fetching all distfiles required by lazarus-qt6-4.8 for building
=> SHA256 Checksum OK for freepascal/freepascal.org/lazarus-lazarus-62c14a4d18c81f222127d42ce9b89b922c63fcbf_GL0.tar.gz.
===========================================================================
=======================<phase: extract-depends>============================
===== env: USE_PACKAGE_DEPENDS_ONLY=1 USER=root UID=0 GID=0
===========================================================================
=======================<phase: extract >============================
===== env: NO_DEPENDS=yes USER=root UID=0 GID=0
===> Fetching all distfiles required by lazarus-qt6-4.8 for building
===> Extracting for lazarus-qt6-4.8
=> SHA256 Checksum OK for freepascal/freepascal.org/lazarus-lazarus-62c14a4d18c81f222127d42ce9b89b922c63fcbf_GL0.tar.gz.
===========================================================================
=======================<phase: patch-depends >============================
===== env: USE_PACKAGE_DEPENDS_ONLY=1 USER=root UID=0 GID=0
===========================================================================
=======================<phase: patch >============================
===== env: NO_DEPENDS=yes USER=root UID=0 GID=0
===> Patching for lazarus-qt6-4.8
===========================================================================
=======================<phase: build-depends >============================
===== env: USE_PACKAGE_DEPENDS_ONLY=1 USER=root UID=0 GID=0
===> lazarus-qt6-4.8 depends on file: /usr/local/bin/as - not found
===> Installing existing package /packages/All/binutils-2.44,1.pkg
[150arm64-default-job-19] Installing binutils-2.44,1...
[150arm64-default-job-19] `-- Installing indexinfo-0.3.1_1...
[150arm64-default-job-19] `-- Extracting indexinfo-0.3.1_1: .... done
[150arm64-default-job-19] `-- Installing zstd-1.5.7_2...
[150arm64-default-job-19] | `-- Installing liblz4-1.10.0_2,1...
[150arm64-default-job-19] | `-- Extracting liblz4-1.10.0_2,1: .......... done
[150arm64-default-job-19] `-- Extracting zstd-1.5.7_2: .......... done
[150arm64-default-job-19] Extracting binutils-2.44,1: .......... done
===> lazarus-qt6-4.8 depends on file: /usr/local/bin/as - found
===> Returning to build of lazarus-qt6-4.8
===> lazarus-qt6-4.8 depends on executable: update-desktop-database - not found
===> Installing existing package /packages/All/desktop-file-utils-0.28.pkg
[150arm64-default-job-19] Installing desktop-file-utils-0.28...
[150arm64-default-job-19] `-- Installing gettext-runtime-1.0_1...
[150arm64-default-job-19] `-- Extracting gettext-runtime-1.0_1: .......... done
[150arm64-default-job-19] `-- Installing glib-2.86.4,2...
[150arm64-default-job-19] | `-- Installing libffi-3.5.2...
[150arm64-default-job-19] | `-- Extracting libffi-3.5.2: .......... done
[150arm64-default-job-19] | `-- Installing libiconv-1.18_1...
[150arm64-default-job-19] | `-- Extracting libiconv-1.18_1: .......... done
[150arm64-default-job-19] | `-- Installing pcre2-10.47_1...
[150arm64-default-job-19] | `-- Extracting pcre2-10.47_1: .......... done
[150arm64-default-job-19] | `-- Installing py311-packaging-26.2...
[150arm64-default-job-19] | | `-- Installing python311-3.11.15_4...
[150arm64-default-job-19] | | `-- Installing expat-2.8.1...
<snip>
/wrkdirs/usr/ports/editors/lazarus-qt6/work/lazarus-62c14a4d18c81f222127d42ce9b89b922c63fcbf/components/projecttemplates/frmtemplatevariables.pas(28,26) Hint: (5024) Parameter "Sender" not used
(9009) Assembling frmtemplatevariables
/wrkdirs/usr/ports/editors/lazarus-qt6/work/lazarus-62c14a4d18c81f222127d42ce9b89b922c63fcbf/components/projecttemplates/idetemplateproject.pp(200,26) Hint: (5024) Parameter "Sender" not used
/wrkdirs/usr/ports/editors/lazarus-qt6/work/lazarus-62c14a4d18c81f222127d42ce9b89b922c63fcbf/components/projecttemplates/idetemplateproject.pp(37,36) Hint: (5024) Parameter "AProject" not used
(9009) Assembling idetemplateproject
(9009) Assembling projtemplates
(1008) 1175 lines compiled, 1.1 sec
(1022) 13 hint(s) issued
/bin/cp -f Makefile.compiled lib/aarch64-freebsd/qt6/projtemplates.compiled
gmake[3]: Leaving directory '/wrkdirs/usr/ports/editors/lazarus-qt6/work/lazarus-62c14a4d18c81f222127d42ce9b89b922c63fcbf/components/projecttemplates'
/usr/local/bin/gmake -C leakview
gmake[3]: Entering directory '/wrkdirs/usr/ports/editors/lazarus-qt6/work/lazarus-62c14a4d18c81f222127d42ce9b89b922c63fcbf/components/leakview'
/bin/rm -f lib/aarch64-freebsd/qt6/leakview.ppu
/bin/mkdir -p lib/aarch64-freebsd/qt6
/usr/local/bin/ppca64 -MObjFPC -Sgi -O1 -g -gl -l -vewnhibq -dLCL -dLCLqt6 -Fu. -Fu../../packager/units/aarch64-freebsd -Fu../lazdebuggers/lazdebuggerintf/lib/aarch64-freebsd -Fu../lazutils/lib/aarch64-freebsd -Fu../buildintf/units/aarch64-freebsd -Fu../codetools/units/aarch64-freebsd -Fu../debuggerintf/lib/aarch64-freebsd -Fu../freetype/lib/aarch64-freebsd -Fu../../lcl/units/aarch64-freebsd -Fu../fpdebug/lib/aarch64-freebsd -Fu../../lcl/units/aarch64-freebsd/qt6 -Fu../lazcontrols/lib/aarch64-freebsd/qt6 -Fu../ideintf/units/aarch64-freebsd/qt6 -Fu../lazdebuggers/cmdlinedebuggerbase/lib/aarch64-freebsd/qt6 -Fu../lazdebuggers/lazdebuggerlldb/lib/aarch64-freebsd/qt6 -Fu/usr/local/lib/fpc/3.3.1/units/aarch64-freebsd/rtl -FE. -FUlib/aarch64-freebsd/qt6 -Sgic -daarch64 leakview.pas
Hint: (11030) Start of reading config file /usr/local/etc/fpc.cfg
Hint: (11031) End of reading config file /usr/local/etc/fpc.cfg
Free Pascal Compiler version 3.3.1 [2026/06/21] for aarch64
Copyright (c) 1993-2026 by Florian Klaempfl and others
(1002) Target OS: FreeBSD for aarch64
(3104) Compiling leakview.pas
(3104) Compiling heaptrcview.pas
(3104) Compiling leakinfo.pas
/wrkdirs/usr/ports/editors/lazarus-qt6/work/lazarus-62c14a4d18c81f222127d42ce9b89b922c63fcbf/components/leakview/heaptrcview.pas(41,30) Hint: (5024) Parameter "Sender" not used
/wrkdirs/usr/ports/editors/lazarus-qt6/work/lazarus-62c14a4d18c81f222127d42ce9b89b922c63fcbf/components/leakview/heaptrcview.pas(39,33) Hint: (5024) Parameter "Sender" not used
/wrkdirs/usr/ports/editors/lazarus-qt6/work/lazarus-62c14a4d18c81f222127d42ce9b89b922c63fcbf/components/leakview/heaptrcview.pas(40,31) Hint: (5024) Parameter "Sender" not used
/wrkdirs/usr/ports/editors/lazarus-qt6/work/lazarus-62c14a4d18c81f222127d42ce9b89b922c63fcbf/components/leakview/heaptrcview.pas(42,30) Hint: (5024) Parameter "Sender" not used
/wrkdirs/usr/ports/editors/lazarus-qt6/work/lazarus-62c14a4d18c81f222127d42ce9b89b922c63fcbf/components/leakview/heaptrcview.pas(43,34) Hint: (5024) Parameter "Sender" not used
/wrkdirs/usr/ports/editors/lazarus-qt6/work/lazarus-62c14a4d18c81f222127d42ce9b89b922c63fcbf/components/leakview/heaptrcview.pas(44,31) Hint: (5024) Parameter "Sender" not used
/wrkdirs/usr/ports/editors/lazarus-qt6/work/lazarus-62c14a4d18c81f222127d42ce9b89b922c63fcbf/components/leakview/heaptrcview.pas(45,26) Hint: (5024) Parameter "Sender" not used
/wrkdirs/usr/ports/editors/lazarus-qt6/work/lazarus-62c14a4d18c81f222127d42ce9b89b922c63fcbf/components/leakview/heaptrcview.pas(46,27) Hint: (5024) Parameter "Sender" not used
/wrkdirs/usr/ports/editors/lazarus-qt6/work/lazarus-62c14a4d18c81f222127d42ce9b89b922c63fcbf/components/leakview/heaptrcview.pas(47,36) Hint: (5024) Parameter "Sender" not used
/wrkdirs/usr/ports/editors/lazarus-qt6/work/lazarus-62c14a4d18c81f222127d42ce9b89b922c63fcbf/components/leakview/heaptrcview.pas(253,24) Hint: (5094) Function result variable of a managed type does not seem to be initialized
/wrkdirs/usr/ports/editors/lazarus-qt6/work/lazarus-62c14a4d18c81f222127d42ce9b89b922c63fcbf/components/leakview/heaptrcview.pas(294,57) Hint: (4055) Conversion between ordinals and pointers is not portable
/wrkdirs/usr/ports/editors/lazarus-qt6/work/lazarus-62c14a4d18c81f222127d42ce9b89b922c63fcbf/components/leakview/heaptrcview.pas(271,1) Note: (6058) Call to subroutine "function TFPGObjectList<leakinfo.TStackTrace>.Get(Index:LongInt):leakinfo.TStackTrace;" marked as inline is not inlined
/wrkdirs/usr/ports/editors/lazarus-qt6/work/lazarus-62c14a4d18c81f222127d42ce9b89b922c63fcbf/components/leakview/heaptrcview.pas(271,1) Note: (6058) Call to subroutine "procedure TFPGObjectList<leakinfo.TStackTrace>.Put(Index:LongInt;const Item:TStackTrace);" marked as inline is not inlined
/wrkdirs/usr/ports/editors/lazarus-qt6/work/lazarus-62c14a4d18c81f222127d42ce9b89b922c63fcbf/components/leakview/heaptrcview.pas(271,1) Note: (6058) Call to subroutine "function TFPGObjectList<leakinfo.TStackTrace>.Get(Index:LongInt):leakinfo.TStackTrace;" marked as inline is not inlined
/wrkdirs/usr/ports/editors/lazarus-qt6/work/lazarus-62c14a4d18c81f222127d42ce9b89b922c63fcbf/components/leakview/heaptrcview.pas(361,23) Hint: (4055) Conversion between ordinals and pointers is not portable
/wrkdirs/usr/ports/editors/lazarus-qt6/work/lazarus-62c14a4d18c81f222127d42ce9b89b922c63fcbf/components/leakview/heaptrcview.pas(68,27) Hint: (5024) Parameter "Sender" not used
/wrkdirs/usr/ports/editors/lazarus-qt6/work/lazarus-62c14a4d18c81f222127d42ce9b89b922c63fcbf/components/leakview/heaptrcview.pas(548,26) Hint: (5024) Parameter "Sender" not used
(1010) Writing Resource String Table file: heaptrcview.rsj
(9009) Assembling heaptrcview
(3104) Compiling dbginforeader.pas
/wrkdirs/usr/ports/editors/lazarus-qt6/work/lazarus-62c14a4d18c81f222127d42ce9b89b922c63fcbf/components/leakview/dbginforeader.pas(51,2) Warning: (2024) User defined: This code is not thread-safe, and needs improvement
/wrkdirs/usr/ports/editors/lazarus-qt6/work/lazarus-62c14a4d18c81f222127d42ce9b89b922c63fcbf/components/leakview/dbginforeader.pas(172,49) Hint: (5057) Local variable "bytesread" does not seem to be initialized
/wrkdirs/usr/ports/editors/lazarus-qt6/work/lazarus-62c14a4d18c81f222127d42ce9b89b922c63fcbf/components/leakview/dbginforeader.pas(202,51) Hint: (5057) Local variable "bytesread" does not seem to be initialized
/wrkdirs/usr/ports/editors/lazarus-qt6/work/lazarus-62c14a4d18c81f222127d42ce9b89b922c63fcbf/components/leakview/dbginforeader.pas(267,28) Hint: (5060) Function result variable does not seem to be initialized
/wrkdirs/usr/ports/editors/lazarus-qt6/work/lazarus-62c14a4d18c81f222127d42ce9b89b922c63fcbf/components/leakview/dbginforeader.pas(304,26) Hint: (5060) Function result variable does not seem to be initialized
/wrkdirs/usr/ports/editors/lazarus-qt6/work/lazarus-62c14a4d18c81f222127d42ce9b89b922c63fcbf/components/leakview/dbginforeader.pas(465,28) Hint: (5057) Local variable "temp_length" does not seem to be initialized
/wrkdirs/usr/ports/editors/lazarus-qt6/work/lazarus-62c14a4d18c81f222127d42ce9b89b922c63fcbf/components/leakview/dbginforeader.pas(480,27) Hint: (5057) Local variable "header32" does not seem to be initialized
/wrkdirs/usr/ports/editors/lazarus-qt6/work/lazarus-62c14a4d18c81f222127d42ce9b89b922c63fcbf/components/leakview/dbginforeader.pas(503,27) Hint: (5057) Local variable "numoptable" does not seem to be initialized
/wrkdirs/usr/ports/editors/lazarus-qt6/work/lazarus-62c14a4d18c81f222127d42ce9b89b922c63fcbf/components/leakview/dbginforeader.pas(520,34) Hint: (5057) Local variable "state" does not seem to be initialized
/wrkdirs/usr/ports/editors/lazarus-qt6/work/lazarus-62c14a4d18c81f222127d42ce9b89b922c63fcbf/components/leakview/dbginforeader.pas(725,2) Warning: (2024) User defined: This code is not thread-safe, and needs improvement
/wrkdirs/usr/ports/editors/lazarus-qt6/work/lazarus-62c14a4d18c81f222127d42ce9b89b922c63fcbf/components/leakview/dbginforeader.pas(768,25) Hint: (5057) Local variable "lastfunc" does not seem to be initialized
/wrkdirs/usr/ports/editors/lazarus-qt6/work/lazarus-62c14a4d18c81f222127d42ce9b89b922c63fcbf/components/leakview/dbginforeader.pas(777,56) Hint: (5057) Local variable "res" does not seem to be initialized
/wrkdirs/usr/ports/editors/lazarus-qt6/work/lazarus-62c14a4d18c81f222127d42ce9b89b922c63fcbf/components/leakview/dbginforeader.pas(915,71) Hint: (5058) Variable "line" does not seem to be initialized
/wrkdirs/usr/ports/editors/lazarus-qt6/work/lazarus-62c14a4d18c81f222127d42ce9b89b922c63fcbf/components/leakview/dbginforeader.pas(915,60) Hint: (5058) Variable "source" does not seem to be initialized
/wrkdirs/usr/ports/editors/lazarus-qt6/work/lazarus-62c14a4d18c81f222127d42ce9b89b922c63fcbf/components/leakview/dbginforeader.pas(915,47) Hint: (5058) Variable "func" does not seem to be initialized
(9009) Assembling dbginforeader
(9009) Assembling leakview
(1008) 2655 lines compiled, 1.4 sec
(1021) 2 warning(s) issued
(1022) 29 hint(s) issued
(1023) 3 note(s) issued
/bin/cp -f Makefile.compiled lib/aarch64-freebsd/qt6/leakview.compiled
gmake[3]: Leaving directory '/wrkdirs/usr/ports/editors/lazarus-qt6/work/lazarus-62c14a4d18c81f222127d42ce9b89b922c63fcbf/components/leakview'
/usr/local/bin/gmake -C memds
gmake[3]: Entering directory '/wrkdirs/usr/ports/editors/lazarus-qt6/work/lazarus-62c14a4d18c81f222127d42ce9b89b922c63fcbf/components/memds'
/bin/rm -f lib/aarch64-freebsd/qt6/memdslaz.ppu
/bin/mkdir -p lib/aarch64-freebsd/qt6
/usr/local/bin/ppca64 -MObjFPC -Scgi -O1 -g -gl -l -vewnhibq -dLCL -dLCLqt6 -Fu. -Fu../../packager/units/aarch64-freebsd -Fu../lazdebuggers/lazdebuggerintf/lib/aarch64-freebsd -Fu../lazutils/lib/aarch64-freebsd -Fu../buildintf/units/aarch64-freebsd -Fu../debuggerintf/lib/aarch64-freebsd -Fu../freetype/lib/aarch64-freebsd -Fu../../lcl/units/aarch64-freebsd -Fu../../lcl/units/aarch64-freebsd/qt6 -Fu../lazcontrols/lib/aarch64-freebsd/qt6 -Fu../ideintf/units/aarch64-freebsd/qt6 -Fu/usr/local/lib/fpc/3.3.1/units/aarch64-freebsd/rtl -FE. -FUlib/aarch64-freebsd/qt6 -Sgic -daarch64 memdslaz.pas
Hint: (11030) Start of reading config file /usr/local/etc/fpc.cfg
Hint: (11031) End of reading config file /usr/local/etc/fpc.cfg
Free Pascal Compiler version 3.3.1 [2026/06/21] for aarch64
Copyright (c) 1993-2026 by Florian Klaempfl and others
(1002) Target OS: FreeBSD for aarch64
(3104) Compiling memdslaz.pas
(3104) Compiling frmselectdataset.pp
/wrkdirs/usr/ports/editors/lazarus-qt6/work/lazarus-62c14a4d18c81f222127d42ce9b89b922c63fcbf/components/memds/frmselectdataset.pp(49,26) Hint: (5024) Parameter "Sender" not used
(1010) Writing Resource String Table file: frmselectdataset.rsj
(9009) Assembling frmselectdataset
(9009) Assembling memdslaz
(1008) 240 lines compiled, 1.0 sec
(1022) 3 hint(s) issued
/bin/cp -f Makefile.compiled lib/aarch64-freebsd/qt6/memdslaz.compiled
gmake[3]: Leaving directory '/wrkdirs/usr/ports/editors/lazarus-qt6/work/lazarus-62c14a4d18c81f222127d42ce9b89b922c63fcbf/components/memds'
/usr/local/bin/gmake -C sdf
gmake[3]: Entering directory '/wrkdirs/usr/ports/editors/lazarus-qt6/work/lazarus-62c14a4d18c81f222127d42ce9b89b922c63fcbf/components/sdf'
/bin/rm -f lib/aarch64-freebsd/qt6/sdflaz.ppu
/bin/mkdir -p lib/aarch64-freebsd/qt6
/usr/local/bin/ppca64 -MObjFPC -Scgi -O1 -g -gl -l -vewnhibq -Fu. -Fu../../packager/units/aarch64-freebsd -Fu../lazutils/lib/aarch64-freebsd -Fu../freetype/lib/aarch64-freebsd -Fu../../lcl/units/aarch64-freebsd -Fu/usr/local/lib/fpc/3.3.1/units/aarch64-freebsd/rtl -FE. -FUlib/aarch64-freebsd/qt6 -Sgic -daarch64 sdflaz.pas
Hint: (11030) Start of reading config file /usr/local/etc/fpc.cfg
Hint: (11031) End of reading config file /usr/local/etc/fpc.cfg
Free Pascal Compiler version 3.3.1 [2026/06/21] for aarch64
Copyright (c) 1993-2026 by Florian Klaempfl and others
(1002) Target OS: FreeBSD for aarch64
(3104) Compiling sdflaz.pas
(3104) Compiling registersdf.pas
(9009) Assembling registersdf
(9009) Assembling sdflaz
(1008) 59 lines compiled, 0.3 sec
(1022) 2 hint(s) issued
/bin/cp -f Makefile.compiled lib/aarch64-freebsd/qt6/sdflaz.compiled
gmake[3]: Leaving directory '/wrkdirs/usr/ports/editors/lazarus-qt6/work/lazarus-62c14a4d18c81f222127d42ce9b89b922c63fcbf/components/sdf'
/usr/local/bin/gmake -C tachart
gmake[3]: Entering directory '/wrkdirs/usr/ports/editors/lazarus-qt6/work/lazarus-62c14a4d18c81f222127d42ce9b89b922c63fcbf/components/tachart'
/bin/rm -f lib/aarch64-freebsd/qt6/tachartlazaruspkg.ppu
/bin/mkdir -p lib/aarch64-freebsd/qt6
/usr/local/bin/ppca64 -MObjFPC -Scghi -O1 -g -gl -Xg -l -vewnhibq -vm6058 -dLCL -dLCLqt6 -dCHECK_VALID_SCALING -Fu. -Funumlib_fix -Fueditors -Fu../../packager/units/aarch64-freebsd -Fu../lazdebuggers/lazdebuggerintf/lib/aarch64-freebsd -Fu../lazutils/lib/aarch64-freebsd -Fu../buildintf/units/aarch64-freebsd -Fu../debuggerintf/lib/aarch64-freebsd -Fu../freetype/lib/aarch64-freebsd -Fu../../lcl/units/aarch64-freebsd -Fu../../lcl/units/aarch64-freebsd/qt6 -Fu../lazcontrols/lib/aarch64-freebsd/qt6 -Fu../ideintf/units/aarch64-freebsd/qt6 -Fu/usr/local/lib/fpc/3.3.1/units/aarch64-freebsd/rtl -FE. -FUlib/aarch64-freebsd/qt6 -Sgic -daarch64 tachartlazaruspkg.pas
Hint: (11030) Start of reading config file /usr/local/etc/fpc.cfg
Hint: (11031) End of reading config file /usr/local/etc/fpc.cfg
Free Pascal Compiler version 3.3.1 [2026/06/21] for aarch64
Copyright (c) 1993-2026 by Florian Klaempfl and others
(1002) Target OS: FreeBSD for aarch64
(3104) Compiling tachartlazaruspkg.pas
(3104) Compiling tagraph.pas
(3104) Compiling tachartaxis.pas
(3104) Compiling tachartaxisutils.pas
(3104) Compiling tachartutils.pas
(3104) Compiling tachartstrconsts.pas
(1010) Writing Resource String Table file: tachartstrconsts.rsj
(9009) Assembling tachartstrconsts
/wrkdirs/usr/ports/editors/lazarus-qt6/work/lazarus-62c14a4d18c81f222127d42ce9b89b922c63fcbf/components/tachart/tachartutils.pas(1062,24) Warning: (5093) Function result variable of a managed type does not seem to be initialized
(9009) Assembling tachartutils
(3104) Compiling tacustomsource.pas
(3104) Compiling tamath.pas
(9009) Assembling tamath
/wrkdirs/usr/ports/editors/lazarus-qt6/work/lazarus-62c14a4d18c81f222127d42ce9b89b922c63fcbf/components/tachart/tacustomsource.pas(217,31) Hint: (5026) Value parameter "Sender" is assigned but never used
/wrkdirs/usr/ports/editors/lazarus-qt6/work/lazarus-62c14a4d18c81f222127d42ce9b89b922c63fcbf/components/tachart/tacustomsource.pas(313,32) Hint: (5024) Parameter "AIndex" not used
(9009) Assembling tacustomsource
(3104) Compiling tadrawutils.pas
(3104) Compiling tageometry.pas
/wrkdirs/usr/ports/editors/lazarus-qt6/work/lazarus-62c14a4d18c81f222127d42ce9b89b922c63fcbf/components/tachart/tageometry.pas(133,24) Warning: (5093) Function result variable of a managed type does not seem to be initialized
/wrkdirs/usr/ports/editors/lazarus-qt6/work/lazarus-62c14a4d18c81f222127d42ce9b89b922c63fcbf/components/tachart/tageometry.pas(735,24) Warning: (5093) Function result variable of a managed type does not seem to be initialized
(9009) Assembling tageometry
(3104) Compiling tahtml.pas
(9009) Assembling tahtml
/wrkdirs/usr/ports/editors/lazarus-qt6/work/lazarus-62c14a4d18c81f222127d42ce9b89b922c63fcbf/components/tachart/tadrawutils.pas(226,39) Hint: (5026) Value parameter "ActualTag" is assigned but never used
/wrkdirs/usr/ports/editors/lazarus-qt6/work/lazarus-62c14a4d18c81f222127d42ce9b89b922c63fcbf/components/tachart/tadrawutils.pas(495,38) Hint: (5026) Value parameter "AFont" is assigned but never used
/wrkdirs/usr/ports/editors/lazarus-qt6/work/lazarus-62c14a4d18c81f222127d42ce9b89b922c63fcbf/components/tachart/tadrawutils.pas(159,34) Hint: (5026) Value parameter "ABoundingBox" is assigned but never used
/wrkdirs/usr/ports/editors/lazarus-qt6/work/lazarus-62c14a4d18c81f222127d42ce9b89b922c63fcbf/components/tachart/tadrawutils.pas(175,24) Hint: (5026) Value parameter "AX" is assigned but never used
/wrkdirs/usr/ports/editors/lazarus-qt6/work/lazarus-62c14a4d18c81f222127d42ce9b89b922c63fcbf/components/tachart/tadrawutils.pas(175,28) Hint: (5026) Value parameter "AY" is assigned but never used
/wrkdirs/usr/ports/editors/lazarus-qt6/work/lazarus-62c14a4d18c81f222127d42ce9b89b922c63fcbf/components/tachart/tadrawutils.pas(175,41) Hint: (5026) Value parameter "AImage" is assigned but never used
/wrkdirs/usr/ports/editors/lazarus-qt6/work/lazarus-62c14a4d18c81f222127d42ce9b89b922c63fcbf/components/tachart/tadrawutils.pas(176,24) Hint: (5026) Value parameter "AX" is assigned but never used
/wrkdirs/usr/ports/editors/lazarus-qt6/work/lazarus-62c14a4d18c81f222127d42ce9b89b922c63fcbf/components/tachart/tadrawutils.pas(176,28) Hint: (5026) Value parameter "AY" is assigned but never used
/wrkdirs/usr/ports/editors/lazarus-qt6/work/lazarus-62c14a4d18c81f222127d42ce9b89b922c63fcbf/components/tachart/tadrawutils.pas(176,41) Hint: (5026) Value parameter "AColor" is assigned but never used
/wrkdirs/usr/ports/editors/lazarus-qt6/work/lazarus-62c14a4d18c81f222127d42ce9b89b922c63fcbf/components/tachart/tadrawutils.pas(178,35) Hint: (5026) Value parameter "AValue" is assigned but never used
(9009) Assembling tadrawutils
(3104) Compiling taintervalsources.pas
/wrkdirs/usr/ports/editors/lazarus-qt6/work/lazarus-62c14a4d18c81f222127d42ce9b89b922c63fcbf/components/tachart/taintervalsources.pas(34,22) Hint: (5026) Value parameter "AIndex" is assigned but never used
/wrkdirs/usr/ports/editors/lazarus-qt6/work/lazarus-62c14a4d18c81f222127d42ce9b89b922c63fcbf/components/tachart/taintervalsources.pas(35,25) Hint: (5026) Value parameter "AValue" is assigned but never used
/wrkdirs/usr/ports/editors/lazarus-qt6/work/lazarus-62c14a4d18c81f222127d42ce9b89b922c63fcbf/components/tachart/taintervalsources.pas(36,25) Hint: (5026) Value parameter "AValue" is assigned but never used
(9009) Assembling taintervalsources
(3104) Compiling tastyles.pas
(3104) Compiling tatypes.pas
(9009) Assembling tatypes
/wrkdirs/usr/ports/editors/lazarus-qt6/work/lazarus-62c14a4d18c81f222127d42ce9b89b922c63fcbf/components/tachart/tastyles.pas(29,28) Hint: (5024) Parameter "Sender" not used
/wrkdirs/usr/ports/editors/lazarus-qt6/work/lazarus-62c14a4d18c81f222127d42ce9b89b922c63fcbf/components/tachart/tastyles.pas(56,28) Hint: (5026) Value parameter "ASender" is assigned but never used
(9009) Assembling tastyles
(3104) Compiling tatextelements.pas
(9009) Assembling tatextelements
(9009) Assembling tachartaxisutils
(3104) Compiling tatransformations.pas
(3104) Compiling ./editors/tasubcomponentseditor.pas
/wrkdirs/usr/ports/editors/lazarus-qt6/work/lazarus-62c14a4d18c81f222127d42ce9b89b922c63fcbf/components/tachart/./editors/tasubcomponentseditor.pas(53,36) Hint: (5024) Parameter "Sender" not used
/wrkdirs/usr/ports/editors/lazarus-qt6/work/lazarus-62c14a4d18c81f222127d42ce9b89b922c63fcbf/components/tachart/./editors/tasubcomponentseditor.pas(54,25) Hint: (5024) Parameter "Sender" not used
/wrkdirs/usr/ports/editors/lazarus-qt6/work/lazarus-62c14a4d18c81f222127d42ce9b89b922c63fcbf/components/tachart/./editors/tasubcomponentseditor.pas(55,26) Hint: (5024) Parameter "Sender" not used
/wrkdirs/usr/ports/editors/lazarus-qt6/work/lazarus-62c14a4d18c81f222127d42ce9b89b922c63fcbf/components/tachart/./editors/tasubcomponentseditor.pas(56,27) Hint: (5024) Parameter "Sender" not used
/wrkdirs/usr/ports/editors/lazarus-qt6/work/lazarus-62c14a4d18c81f222127d42ce9b89b922c63fcbf/components/tachart/./editors/tasubcomponentseditor.pas(58,29) Hint: (5024) Parameter "Sender" not used
/wrkdirs/usr/ports/editors/lazarus-qt6/work/lazarus-62c14a4d18c81f222127d42ce9b89b922c63fcbf/components/tachart/./editors/tasubcomponentseditor.pas(59,31) Hint: (5024) Parameter "Sender" not used
/wrkdirs/usr/ports/editors/lazarus-qt6/work/lazarus-62c14a4d18c81f222127d42ce9b89b922c63fcbf/components/tachart/./editors/tasubcomponentseditor.pas(60,29) Hint: (5024) Parameter "Sender" not used
(9009) Assembling tasubcomponentseditor
(9009) Assembling tatransformations
/wrkdirs/usr/ports/editors/lazarus-qt6/work/lazarus-62c14a4d18c81f222127d42ce9b89b922c63fcbf/components/tachart/tachartaxis.pas(391,9) Note: (3123) "inherited" not yet supported inside inline procedure/function
/wrkdirs/usr/ports/editors/lazarus-qt6/work/lazarus-62c14a4d18c81f222127d42ce9b89b922c63fcbf/components/tachart/tachartaxis.pas(391,9) Hint: (3124) Inlining disabled
/wrkdirs/usr/ports/editors/lazarus-qt6/work/lazarus-62c14a4d18c81f222127d42ce9b89b922c63fcbf/components/tachart/tachartaxis.pas(42,28) Hint: (5026) Value parameter "AValue" is assigned but never used
/wrkdirs/usr/ports/editors/lazarus-qt6/work/lazarus-62c14a4d18c81f222127d42ce9b89b922c63fcbf/components/tachart/tachartaxis.pas(485,29) Warning: (5066) Symbol "TChartAxis.OnMarkToText" is deprecated: "Use "OnGetMarkText"
/wrkdirs/usr/ports/editors/lazarus-qt6/work/lazarus-62c14a4d18c81f222127d42ce9b89b922c63fcbf/components/tachart/tachartaxis.pas(764,9) Note: (3123) "inherited" not yet supported inside inline procedure/function
/wrkdirs/usr/ports/editors/lazarus-qt6/work/lazarus-62c14a4d18c81f222127d42ce9b89b922c63fcbf/components/tachart/tachartaxis.pas(764,9) Hint: (3124) Inlining disabled
/wrkdirs/usr/ports/editors/lazarus-qt6/work/lazarus-62c14a4d18c81f222127d42ce9b89b922c63fcbf/components/tachart/tachartaxis.pas(809,64) Hint: (5057) Local variable "rng" does not seem to be initialized
/wrkdirs/usr/ports/editors/lazarus-qt6/work/lazarus-62c14a4d18c81f222127d42ce9b89b922c63fcbf/components/tachart/tachartaxis.pas(1327,9) Note: (3123) "inherited" not yet supported inside inline procedure/function
/wrkdirs/usr/ports/editors/lazarus-qt6/work/lazarus-62c14a4d18c81f222127d42ce9b89b922c63fcbf/components/tachart/tachartaxis.pas(1327,9) Hint: (3124) Inlining disabled
/wrkdirs/usr/ports/editors/lazarus-qt6/work/lazarus-62c14a4d18c81f222127d42ce9b89b922c63fcbf/components/tachart/tachartaxis.pas(254,22) Hint: (5026) Value parameter "AItem" is assigned but never used
(9009) Assembling tachartaxis
(3104) Compiling taguiconnector.pas
(3104) Compiling tadrawercanvas.pas
/wrkdirs/usr/ports/editors/lazarus-qt6/work/lazarus-62c14a4d18c81f222127d42ce9b89b922c63fcbf/components/tachart/tadrawercanvas.pas(420,36) Error: (3026) Wrong number of parameters specified for call to "Scale"
/usr/local/lib/fpc/3.3.1/units/aarch64-freebsd/fcl-image/fpcanvas.ppu:fpcanvas.inc(363,27) Error: (5088) Found declaration: Scale(Double;Double);
/wrkdirs/usr/ports/editors/lazarus-qt6/work/lazarus-62c14a4d18c81f222127d42ce9b89b922c63fcbf/components/tachart/tadrawercanvas.pas(573) Fatal: (10026) There were 2 errors compiling module, stopping
Fatal: (1018) Compilation aborted
gmake[3]: *** [Makefile:3556: tachartlazaruspkg.ppu] Error 1
gmake[3]: Leaving directory '/wrkdirs/usr/ports/editors/lazarus-qt6/work/lazarus-62c14a4d18c81f222127d42ce9b89b922c63fcbf/components/tachart'
gmake[2]: *** [Makefile:1974: bigide] Error 2
gmake[2]: Leaving directory '/wrkdirs/usr/ports/editors/lazarus-qt6/work/lazarus-62c14a4d18c81f222127d42ce9b89b922c63fcbf/components'
gmake[1]: *** [Makefile:3187: bigidecomponents] Error 2
gmake[1]: Leaving directory '/wrkdirs/usr/ports/editors/lazarus-qt6/work/lazarus-62c14a4d18c81f222127d42ce9b89b922c63fcbf'
*** Error code 2
Stop.
make: stopped making "build" in /usr/ports/editors/lazarus-qt6