[package - main-amd64-default][devel/plan9port] Failed for plan9port-20250218 in stage
- Go to: [ bottom of page ] [ top of archives ] [ this month ]
Date: Sun, 21 Jun 2026 16:47:44 UTC
You are receiving this mail as a port that you maintain
is failing to build on the FreeBSD package build server.
Please investigate the failure and submit a PR to fix
build.
Maintainer: tiga@FreeBSD.org
Log URL: https://pkg-status.freebsd.org/beefy24/data/main-amd64-default/p0cd7b5a3f54a_sa4ed783cee2/logs/plan9port-20250218.log
Build URL: https://pkg-status.freebsd.org/beefy24/build.html?mastername=main-amd64-default&build=p0cd7b5a3f54a_sa4ed783cee2
Log:
=>> Building devel/plan9port
build started at Sun Jun 21 16:46:58 UTC 2026
port directory: /usr/ports/devel/plan9port
package name: plan9port-20250218
building for: FreeBSD main-amd64-default-job-14 16.0-CURRENT FreeBSD 16.0-CURRENT 1600019 amd64
maintained by: tiga@FreeBSD.org
Makefile datestamp: -rw-r--r-- 1 root wheel 2686 Oct 2 2025 /usr/ports/devel/plan9port/Makefile
Ports top last git commit: 0cd7b5a3f54a52042f1482e004e2ce70fe6c2275
Ports top unclean checkout: no
Port dir last git commit: 4e450f33b9f9cf668688f9c439c58871751e2bbb
Port dir unclean checkout: no
Poudriere version: poudriere-git-3.4.8
Host OSVERSION: 1600018
Jail OSVERSION: 1600019
Job Id: 14
!!! Jail is newer than host. (Jail: 1600019, Host: 1600018) !!!
!!! This is not supported. !!!
!!! Host kernel must be same or newer than jail. !!!
!!! Expect build failures. !!!
---Begin Environment---
SHELL=/bin/sh
OSVERSION=1600019
UNAME_v=FreeBSD 16.0-CURRENT 1600019
UNAME_r=16.0-CURRENT
BLOCKSIZE=K
MAIL=/var/mail/root
MM_CHARSET=UTF-8
LANG=C.UTF-8
STATUS=1
HOME=/root
PATH=/sbin:/bin:/usr/sbin:/usr/bin:/usr/local/sbin:/usr/local/bin:/root/bin
MAKE_OBJDIR_CHECK_WRITABLE=0
LOCALBASE=/usr/local
USER=root
POUDRIERE_NAME=poudriere-git
LIBEXECPREFIX=/usr/local/libexec/poudriere
POUDRIERE_VERSION=3.4.8
MASTERMNT=/usr/local/poudriere/data/.m/main-amd64-default/ref
LC_COLLATE=C
POUDRIERE_BUILD_TYPE=bulk
PACKAGE_BUILDING=yes
SAVED_TERM=
OUTPUT_REDIRECTED_STDERR=4
OUTPUT_REDIRECTED=1
PWD=/usr/local/poudriere/data/.m/main-amd64-default/14/.p
OUTPUT_REDIRECTED_STDOUT=3
P_PORTS_FEATURES=FLAVORS SUBPACKAGES SELECTED_OPTIONS
MASTERNAME=main-amd64-default
SCRIPTPREFIX=/usr/local/share/poudriere
SCRIPTNAME=bulk.sh
OLDPWD=/usr/local/poudriere/data/.m/main-amd64-default/ref/.p/pool
POUDRIERE_PKGNAME=poudriere-git-3.4.8
SCRIPTPATH=/usr/local/share/poudriere/bulk.sh
POUDRIEREPATH=/usr/local/bin/poudriere
---End Environment---
---Begin Poudriere Port Flags/Env---
PORT_FLAGS=
PKGENV=
FLAVOR=
MAKE_ARGS=
---End Poudriere Port Flags/Env---
---Begin OPTIONS List---
===> The following configuration options are available for plan9port-20250218:
DATA=on: Install dictionary, thesaurus, and other data files
===> Use 'make config' to modify these settings
---End OPTIONS List---
--MAINTAINER--
tiga@FreeBSD.org
--End MAINTAINER--
--CONFIGURE_ARGS--
--End CONFIGURE_ARGS--
--CONFIGURE_ENV--
ac_cv_path_PERL=/usr/local/bin/perl ac_cv_path_PERL_PATH=/usr/local/bin/perl PERL_USE_UNSAFE_INC=1 XDG_DATA_HOME=/wrkdirs/usr/ports/devel/plan9port/work XDG_CONFIG_HOME=/wrkdirs/usr/ports/devel/plan9port/work XDG_CACHE_HOME=/wrkdirs/usr/ports/devel/plan9port/work/.cache HOME=/wrkdirs/usr/ports/devel/plan9port/work TMPDIR="/tmp" PATH=/wrkdirs/usr/ports/devel/plan9port/work/.bin:/sbin:/bin:/usr/sbin:/usr/bin:/usr/local/sbin:/usr/local/bin:/root/bin PKG_CONFIG_LIBDIR=/wrkdirs/usr/ports/devel/plan9port/work/.pkgconfig:/usr/local/libdata/pkgconfig:/usr/local/share/pkgconfig:/usr/libdata/pkgconfig SHELL=/bin/sh CONFIG_SHELL=/bin/sh CMAKE_PREFIX_PATH="/usr/local"
--End CONFIGURE_ENV--
--MAKE_ENV--
PERL_USE_UNSAFE_INC=1 XDG_DATA_HOME=/wrkdirs/usr/ports/devel/plan9port/work XDG_CONFIG_HOME=/wrkdirs/usr/ports/devel/plan9port/work XDG_CACHE_HOME=/wrkdirs/usr/ports/devel/plan9port/work/.cache HOME=/wrkdirs/usr/ports/devel/plan9port/work TMPDIR="/tmp" PATH=/wrkdirs/usr/ports/devel/plan9port/work/.bin:/sbin:/bin:/usr/sbin:/usr/bin:/usr/local/sbin:/usr/local/bin:/root/bin PKG_CONFIG_LIBDIR=/wrkdirs/usr/ports/devel/plan9port/work/.pkgconfig:/usr/local/libdata/pkgconfig:/usr/local/share/pkgconfig:/usr/libdata/pkgconfig MK_DEBUG_FILES=no MK_KERNEL_SYMBOLS=no SHELL=/bin/sh NO_LINT=YES PREFIX=/usr/local LOCALBASE=/usr/local CC="cc" CFLAGS="-O2 -pipe -fstack-protector-strong -isystem /usr/local/include -fno-strict-aliasing " CPP="cpp" CPPFLAGS="-isystem /usr/local/include" LDFLAGS=" -L/usr/local/lib " LIBS="" CXX="c++" CXXFLAGS="-O2 -pipe -fstack-protector-strong -isystem /usr/local/include -fno-strict-aliasing -isystem /usr/local/include " BSD_INSTALL_PROGRAM="install
-s -m 555" BSD_INSTALL_LIB="install -s -m 0644" BSD_INSTALL_SCRIPT="install -m 555" BSD_INSTALL_DATA="install -m 0644" BSD_INSTALL_MAN="install -m 444"
--End MAKE_ENV--
--PLIST_SUB--
DATA="" NO_DATA="@comment " OSREL=16.0 PREFIX=%D LOCALBASE=/usr/local RESETPREFIX=/usr/local LIB32DIR=lib PERL_VERSION=5.42.2 PERL_VER=5.42 PERL5_MAN1=lib/perl5/site_perl/man/man1 PERL5_MAN3=lib/perl5/site_perl/man/man3 SITE_PERL=lib/perl5/site_perl SITE_ARCH=lib/perl5/site_perl/mach/5.42 DOCSDIR="share/doc/plan9port" EXAMPLESDIR="share/examples/plan9port" DATADIR="share/plan9port" WWWDIR="www/plan9port" ETCDIR="etc/plan9port"
--End PLIST_SUB--
--SUB_LIST--
OPSYS=FreeBSD DATA="" NO_DATA="@comment " PREFIX=/usr/local LOCALBASE=/usr/local DATADIR=/usr/local/share/plan9port DOCSDIR=/usr/local/share/doc/plan9port EXAMPLESDIR=/usr/local/share/examples/plan9port WWWDIR=/usr/local/www/plan9port ETCDIR=/usr/local/etc/plan9port
--End SUB_LIST--
---Begin make.conf---
USE_PACKAGE_DEPENDS=yes
BATCH=yes
WRKDIRPREFIX=/wrkdirs
PORTSDIR=/usr/ports
PACKAGES=/packages
DISTDIR=/distfiles
PACKAGE_BUILDING=yes
PACKAGE_BUILDING_FLAVORS=yes
#### ####
# XXX: We really need this but cannot use it while 'make checksum' does not
# try the next mirror on checksum failure. It currently retries the same
# failed mirror and then fails rather then trying another. It *does*
# try the next if the size is mismatched though.
#MASTER_SITE_FREEBSD=yes
# Build ALLOW_MAKE_JOBS_PACKAGES with 3 jobs
MAKE_JOBS_NUMBER=3
#### Misc Poudriere ####
.include "/etc/make.conf.ports_env"
GID=0
UID=0
---End make.conf---
--Resource limits--
cpu time (seconds, -t) unlimited
file size (512-blocks, -f) unlimited
data seg size (kbytes, -d) 33554432
stack size (kbytes, -s) 524288
core file size (512-blocks, -c) unlimited
max memory size (kbytes, -m) unlimited
locked memory (kbytes, -l) unlimited
max user processes (-u) 89999
open files (-n) 8192
virtual mem size (kbytes, -v) unlimited
swap limit (kbytes, -w) unlimited
socket buffer size (bytes, -b) unlimited
pseudo-terminals (-p) unlimited
kqueues (-k) unlimited
umtx shared locks (-o) unlimited
pipebuf (kbytes, -y) unlimited
virtual machines (-V) unlimited
--End resource limits--
=======================<phase: check-sanity >============================
===== env: NO_DEPENDS=yes USER=root UID=0 GID=0
===> License MIT accepted by the user
===========================================================================
=======================<phase: pkg-depends >============================
===== env: USE_PACKAGE_DEPENDS_ONLY=1 USER=root UID=0 GID=0
===> plan9port-20250218 depends on file: /usr/local/sbin/pkg - not found
===> Installing existing package /packages/All/pkg-2.7.5.pkg
[main-amd64-default-job-14] Installing pkg-2.7.5...
[main-amd64-default-job-14] Extracting pkg-2.7.5: .......... done
===> plan9port-20250218 depends on file: /usr/local/sbin/pkg - found
===> Returning to build of plan9port-20250218
===========================================================================
=======================<phase: fetch-depends >============================
===== env: USE_PACKAGE_DEPENDS_ONLY=1 USER=root UID=0 GID=0
===========================================================================
=======================<phase: fetch >============================
===== env: NO_DEPENDS=yes USER=root UID=0 GID=0
===> License MIT accepted by the user
===> Fetching all distfiles required by plan9port-20250218 for building
===========================================================================
=======================<phase: checksum >============================
===== env: NO_DEPENDS=yes USER=root UID=0 GID=0
===> License MIT accepted by the user
===> Fetching all distfiles required by plan9port-20250218 for building
=> SHA256 Checksum OK for plan9port/pgw.tar.bz2.
=> SHA256 Checksum OK for plan9port/roget.tar.bz2.
=> SHA256 Checksum OK for plan9port/scat.tgz.
=> SHA256 Checksum OK for plan9port/9fans-plan9port-20250218-13582b1_GH0.tar.gz.
===========================================================================
=======================<phase: extract-depends>============================
===== env: USE_PACKAGE_DEPENDS_ONLY=1 USER=root UID=0 GID=0
===========================================================================
=======================<phase: extract >============================
===== env: NO_DEPENDS=yes USER=root UID=0 GID=0
===> License MIT accepted by the user
===> Fetching all distfiles required by plan9port-20250218 for building
===> Extracting for plan9port-20250218
=> SHA256 Checksum OK for plan9port/pgw.tar.bz2.
=> SHA256 Checksum OK for plan9port/roget.tar.bz2.
=> SHA256 Checksum OK for plan9port/scat.tgz.
=> SHA256 Checksum OK for plan9port/9fans-plan9port-20250218-13582b1_GH0.tar.gz.
===========================================================================
=======================<phase: patch-depends >============================
===== env: USE_PACKAGE_DEPENDS_ONLY=1 USER=root UID=0 GID=0
===========================================================================
=======================<phase: patch >============================
===== env: NO_DEPENDS=yes USER=root UID=0 GID=0
===> Patching for plan9port-20250218
===> Applying FreeBSD patches for plan9port-20250218 from /usr/ports/devel/plan9port/files
===========================================================================
=======================<phase: build-depends >============================
===== env: USE_PACKAGE_DEPENDS_ONLY=1 USER=root UID=0 GID=0
===> plan9port-20250218 depends on executable: as - not found
===> Installing existing package /packages/All/binutils-2.44,1.pkg
[main-amd64-default-job-14] Installing binutils-2.44,1...
[main-amd64-default-job-14] `-- Installing indexinfo-0.3.1_1...
[main-amd64-default-job-14] `-- Extracting indexinfo-0.3.1_1: .... done
[main-amd64-default-job-14] `-- Installing zstd-1.5.7_2...
[main-amd64-default-job-14] | `-- Installing liblz4-1.10.0_2,1...
[main-amd64-default-job-14] | `-- Extracting liblz4-1.10.0_2,1: .......... done
[main-amd64-default-job-14] `-- Extracting zstd-1.5.7_2: .......... done
[main-amd64-default-job-14] Extracting binutils-2.44,1: .......... done
===> plan9port-20250218 depends on executable: as - found
===> Returning to build of plan9port-20250218
===> plan9port-20250218 depends on package: perl5>=5.42.r<5.43 - not found
===> Installing existing package /packages/All/perl5-5.42.2.pkg
[main-amd64-default-job-14] Installing perl5-5.42.2...
[main-amd64-default-job-14] Extracting perl5-5.42.2: .......... done
===> plan9port-20250218 depends on package: perl5>=5.42.r<5.43 - found
===> Returning to build of plan9port-20250218
===> plan9port-20250218 depends on file: /usr/local/libdata/pkgconfig/x11.pc - not found
===> Installing existing package /packages/All/libX11-1.8.13_1,1.pkg
[main-amd64-default-job-14] Installing libX11-1.8.13_1,1...
[main-amd64-default-job-14] `-- Installing libxcb-1.17.0...
[main-amd64-default-job-14] | `-- Installing libXau-1.0.12...
[main-amd64-default-job-14] | `-- Extracting libXau-1.0.12: .......... done
[main-amd64-default-job-14] | `-- Installing libXdmcp-1.1.5...
[main-amd64-default-job-14] | | `-- Installing xorgproto-2025.1...
[main-amd64-default-job-14] | | `-- Extracting xorgproto-2025.1: .......... done
[main-amd64-default-job-14] | `-- Extracting libXdmcp-1.1.5: ......... done
[main-amd64-default-job-14] `-- Extracting libxcb-1.17.0: .......... done
[main-amd64-default-job-14] Extracting libX11-1.8.13_1,1: .......... done
===> plan9port-20250218 depends on file: /usr/local/libdata/pkgconfig/x11.pc - found
===> Returning to build of plan9port-20250218
===> plan9port-20250218 depends on file: /usr/local/libdata/pkgconfig/xext.pc - not found
===> Installing existing package /packages/All/libXext-1.3.7,1.pkg
[main-amd64-default-job-14] Installing libXext-1.3.7,1...
[main-amd64-default-job-14] Extracting libXext-1.3.7,1: .......... done
===> plan9port-20250218 depends on file: /usr/local/libdata/pkgconfig/xext.pc - found
===> Returning to build of plan9port-20250218
===> plan9port-20250218 depends on file: /usr/local/libdata/pkgconfig/xt.pc - not found
===> Installing existing package /packages/All/libXt-1.3.1,1.pkg
[main-amd64-default-job-14] Installing libXt-1.3.1,1...
[main-amd64-default-job-14] `-- Installing libICE-1.1.2,1...
[main-amd64-default-job-14] `-- Extracting libICE-1.1.2,1: .......... done
[main-amd64-default-job-14] `-- Installing libSM-1.2.6,1...
[main-amd64-default-job-14] `-- Extracting libSM-1.2.6,1: .......... done
[main-amd64-default-job-14] Extracting libXt-1.3.1,1: .......... done
===> plan9port-20250218 depends on file: /usr/local/libdata/pkgconfig/xt.pc - found
===> Returning to build of plan9port-20250218
===========================================================================
=======================<phase: lib-depends >============================
===== env: USE_PACKAGE_DEPENDS_ONLY=1 USER=root UID=0 GID=0
===> plan9port-20250218 depends on shared library: libfontconfig.so - not found
===> Installing existing package /packages/All/fontconfig-2.17.1,1.pkg
[main-amd64-default-job-14] Installing fontconfig-2.17.1,1...
[main-amd64-default-job-14] `-- Installing expat-2.8.1...
[main-amd64-default-job-14] `-- Extracting expat-2.8.1: .......... done
[main-amd64-default-job-14] `-- Installing freetype2-2.14.3...
[main-amd64-default-job-14] | `-- Installing brotli-1.2.0,1...
[main-amd64-default-job-14] | `-- Extracting brotli-1.2.0,1: .......... done
[main-amd64-default-job-14] | `-- Installing png-1.6.58...
[main-amd64-default-job-14] | `-- Extracting png-1.6.58: .......... done
[main-amd64-default-job-14] `-- Extracting freetype2-2.14.3: .......... done
[main-amd64-default-job-14] `-- Installing gettext-runtime-1.0_1...
[main-amd64-default-job-14] `-- Extracting gettext-runtime-1.0_1: .......... done
[main-amd64-default-job-14] Extracting fontconfig-2.17.1,1: .......... done
==> Running trigger: fontconfig.ucl
Running fc-cache to build fontconfig cache...
=====
Message from freetype2-2.14.3:
--
The 2.7.x series now uses the new subpixel hinting mode (V40 port's option) as
the default, emulating a modern version of ClearType. This change inevitably
leads to different rendering results, and you might change port's options to
adapt it to your taste (or use the new "FREETYPE_PROPERTIES" environment
variable).
The environment variable "FREETYPE_PROPERTIES" can be used to control the
driver properties. Example:
FREETYPE_PROPERTIES=truetype:interpreter-version=35 \
cff:no-stem-darkening=1 \
autofitter:warping=1
This allows to select, say, the subpixel hinting mode at runtime for a given
application.
If LONG_PCF_NAMES port's option was enabled, the PCF family names may include
the foundry and information whether they contain wide characters. For example,
"Sony Fixed" or "Misc Fixed Wide", instead of "Fixed". This can be disabled at
run time with using pcf:no-long-family-names property, if needed. Example:
FREETYPE_PROPERTIES=pcf:no-long-family-names=1
How to recreate fontconfig cache with using such environment variable,
if needed:
# env FREETYPE_PROPERTIES=pcf:no-long-family-names=1 fc-cache -fsv
The controllable properties are listed in the section "Controlling FreeType
Modules" in the reference's table of contents
(/usr/local/share/doc/freetype2/reference/index.html, if documentation was installed).
===> plan9port-20250218 depends on shared library: libfontconfig.so - found (/usr/local/lib/libfontconfig.so)
===> Returning to build of plan9port-20250218
===> plan9port-20250218 depends on shared library: libfreetype.so - found (/usr/local/lib/libfreetype.so)
===========================================================================
=======================<phase: configure >============================
===== env: NO_DEPENDS=yes USER=root UID=0 GID=0
===> Configuring for plan9port-20250218
===========================================================================
=======================<phase: build >============================
===== env: NO_DEPENDS=yes USER=root UID=0 GID=0
===> Building for plan9port-20250218
+ Mailing list: https://groups.google.com/group/plan9port-dev
+ Issue tracker: https://github.com/9fans/plan9port/issues/
+ Submitting changes: https://github.com/9fans/plan9port/pulls
* Resetting /wrkdirs/usr/ports/devel/plan9port/work/plan9port-13582b1/config
* Running on FreeBSD, adjusting linker flags
>>> fontsrv dependencies found.
Using LOCAL.config options:
CFLAGS="-O2 -pipe -fstack-protector-strong -isystem /usr/local/include -fno-strict-aliasing "
LDFLAGS=" -L/usr/local/lib "
FONTSRV=fontsrv
* Compiler version:
FreeBSD clang version 21.1.8 (https://github.com/llvm/llvm-project.git llvmorg-21.1.8-0-g2078da43e25a)
* Building mk...
>>> pwd
>>> cd /wrkdirs/usr/ports/devel/plan9port/work/plan9port-13582b1/src/lib9
9c dial.c
dial.c:118:33: warning: variable 'ssl' is uninitialized when passed as a const pointer argument here [-Wuninitialized-const-pointer]
>>> cd /wrkdirs/usr/ports/devel/plan9port/work/plan9port-13582b1/src/lib9
9c -Ifmt fmt/fmt.c
fmt/fmt.c:55:3: warning: call to undeclared function 'ATOMIC_VAR_INIT'; ISO C99 and later do not support implicit function declarations [-Wimplicit-function-declaration]
fmt/fmt.c:55:3: error: initializer element is not a compile-time constant
>>> cd /wrkdirs/usr/ports/devel/plan9port/work/plan9port-13582b1/src/lib9
9ar rsc /wrkdirs/usr/ports/devel/plan9port/work/plan9port-13582b1/lib/lib9.a _exits.o _p9dialparse.o _p9dir.o announce.o argv0.o atexit.o atoi.o atol.o atoll.o atnotify.o await.o cistrcmp.o cistrncmp.o cistrstr.o cleanname.o convD2M.o convM2D.o convM2S.o convS2M.o crypt.o ctime.o dial.o dirfstat.o dirfwstat.o dirmodefmt.o dirstat.o dirwstat.o dup.o encodefmt.o errstr.o exec.o execl.o exitcode.o fcallfmt.o frand.o get9root.o getcallerpc.o getenv.o getfields.o getnetconn.o getns.o getuser.o getwd.o jmp.o lrand.o lnrand.o main.o malloc.o malloctag.o mallocz.o nan.o needsrcquote.o needstack.o netcrypt.o netmkaddr.o notify.o nrand.o nulldir.o open.o opentemp.o pin.o pipe.o post9p.o postnote.o qlock.o quote.o rand.o read9pmsg.o readcons.o readn.o rfork.o searchpath.o sendfd.o sleep.o strdup.o strecpy.o sysfatal.o syslog.o sysname.o time.o tm2sec.o tokenize.o truerand.o u16.o u32.o u64.o unsharp.o wait.o waitpid.o write.o zoneinfo.o dofmt.o fltfmt.o fmt.o fmtfd.o fmtfdflush.o fmtlo
cale.o fmtlock2.o fmtnull.o fmtprint.o fmtquote.o fmtrune.o fmtstr.o fmtvprint.o fprint.o frexp.o nan64.o print.o runefmtstr.o runeseprint.o runesmprint.o runesnprint.o runesprint.o runevseprint.o runevsmprint.o runevsnprint.o seprint.o smprint.o snprint.o sprint.o strtod.o vfprint.o vseprint.o vsmprint.o vsnprint.o charstod.o pow10.o rune.o runestrcat.o runestrchr.o runestrcmp.o runestrcpy.o runestrdup.o runestrlen.o runestrecpy.o runestrncat.o runestrncmp.o runestrncpy.o runestrrchr.o runestrstr.o runetype.o utfecpy.o utflen.o utfnlen.o utfrrune.o utfrune.o utfutf.o
ar: error: fmt.o: No such file or directory
>>> pwd
>>> pwd
>>> pwd
>>> cd /wrkdirs/usr/ports/devel/plan9port/work/plan9port-13582b1/src/cmd/mk
9l -o o.mk arc.o archive.o bufblock.o env.o file.o graph.o job.o lex.o main.o match.o mk.o parse.o recipe.o rc.o rule.o run.o sh.o shell.o shprint.o symtab.o var.o varsub.o word.o unix.o
ld.lld: error: unable to find library -l9
clang: error: linker command failed with exit code 1 (use -v to see invocation)
>>> cd /wrkdirs/usr/ports/devel/plan9port/work/plan9port-13582b1/src/cmd/mk
install o.mk /wrkdirs/usr/ports/devel/plan9port/work/plan9port-13582b1/bin/mk
install: o.mk: No such file or directory
* Error: mk failed to build.
===========================================================================
=======================<phase: run-depends >============================
===== env: USE_PACKAGE_DEPENDS_ONLY=1 USER=root UID=0 GID=0
===> plan9port-20250218 depends on file: /usr/local/libdata/pkgconfig/x11.pc - found
===> plan9port-20250218 depends on file: /usr/local/libdata/pkgconfig/xext.pc - found
===> plan9port-20250218 depends on file: /usr/local/libdata/pkgconfig/xt.pc - found
===========================================================================
=======================<phase: stage >============================
===== env: NO_DEPENDS=yes USER=root UID=0 GID=0
===> Staging for plan9port-20250218
===> Generating temporary packing list
sed: bin/": No such file or directory
*** Error code 1
Stop.
make: stopped making "stage" in /usr/ports/devel/plan9port