[package - 143i386-default][multimedia/vapoursynth] Failed for vapoursynth-r73 in build
- Go to: [ bottom of page ] [ top of archives ] [ this month ]
Date: Sun, 21 Jun 2026 08:45:35 UTC
You are receiving this mail as a port that you maintain
is failing to build on the FreeBSD package build server.
Please investigate the failure and submit a PR to fix
build.
Maintainer: multimedia@FreeBSD.org
Log URL: https://pkg-status.freebsd.org/beefy18/data/143i386-default/0cd7b5a3f54a/logs/vapoursynth-r73.log
Build URL: https://pkg-status.freebsd.org/beefy18/build.html?mastername=143i386-default&build=0cd7b5a3f54a
Log:
=>> Building multimedia/vapoursynth
build started at Sun Jun 21 08:45:13 UTC 2026
port directory: /usr/ports/multimedia/vapoursynth
package name: vapoursynth-r73
building for: FreeBSD 143i386-default-job-06 14.3-RELEASE-p15 FreeBSD 14.3-RELEASE-p15 i386
maintained by: multimedia@FreeBSD.org
Makefile datestamp: -rw-r--r-- 1 root wheel 986 Jun 21 01:01 /usr/ports/multimedia/vapoursynth/Makefile
Ports top last git commit: 0cd7b5a3f54a52042f1482e004e2ce70fe6c2275
Ports top unclean checkout: no
Port dir last git commit: a2fb9923e7014adde1da669b8322e5a8b631fc90
Port dir unclean checkout: no
Poudriere version: poudriere-git-3.4.8
Host OSVERSION: 1600018
Jail OSVERSION: 1403000
Job Id: 06
---Begin Environment---
SHELL=/bin/sh
BLOCKSIZE=K
MAIL=/var/mail/root
MM_CHARSET=UTF-8
LANG=C.UTF-8
OSVERSION=1403000
STATUS=1
HOME=/root
PATH=/sbin:/bin:/usr/sbin:/usr/bin:/usr/local/sbin:/usr/local/bin:/root/bin
MAKE_OBJDIR_CHECK_WRITABLE=0
UNAME_m=i386
UNAME_p=i386
UNAME_r=14.3-RELEASE-p15
LOCALBASE=/usr/local
UNAME_v=FreeBSD 14.3-RELEASE-p15
USER=root
POUDRIERE_NAME=poudriere-git
LIBEXECPREFIX=/usr/local/libexec/poudriere
POUDRIERE_VERSION=3.4.8
MASTERMNT=/usr/local/poudriere/data/.m/143i386-default/ref
LC_COLLATE=C
POUDRIERE_BUILD_TYPE=bulk
PACKAGE_BUILDING=yes
SAVED_TERM=
OUTPUT_REDIRECTED_STDERR=4
OUTPUT_REDIRECTED=1
PWD=/usr/local/poudriere/data/.m/143i386-default/06/.p
OUTPUT_REDIRECTED_STDOUT=3
P_PORTS_FEATURES=FLAVORS SUBPACKAGES SELECTED_OPTIONS
MASTERNAME=143i386-default
SCRIPTPREFIX=/usr/local/share/poudriere
SCRIPTNAME=bulk.sh
OLDPWD=/usr/local/poudriere/data/.m/143i386-default/ref/.p/pool
POUDRIERE_PKGNAME=poudriere-git-3.4.8
SCRIPTPATH=/usr/local/share/poudriere/bulk.sh
POUDRIEREPATH=/usr/local/bin/poudriere
---End Environment---
---Begin Poudriere Port Flags/Env---
PORT_FLAGS=
PKGENV=
FLAVOR=
MAKE_ARGS=
---End Poudriere Port Flags/Env---
---Begin OPTIONS List---
---End OPTIONS List---
--MAINTAINER--
multimedia@FreeBSD.org
--End MAINTAINER--
--CONFIGURE_ARGS--
setup --prefix /usr/local --localstatedir /var --infodir share/info --auto-features=enabled -Dpython.bytecompile=-1 -Db_colorout=never --buildtype release --optimization plain --strip -Dpython3_bin=/usr/local/bin/python3.11 -Db_lto=true _build
--End CONFIGURE_ARGS--
--CONFIGURE_ENV--
PKG_CONFIG=pkgconf PYTHON="/usr/local/bin/python3.11" XDG_DATA_HOME=/wrkdirs/usr/ports/multimedia/vapoursynth/work XDG_CONFIG_HOME=/wrkdirs/usr/ports/multimedia/vapoursynth/work XDG_CACHE_HOME=/wrkdirs/usr/ports/multimedia/vapoursynth/work/.cache HOME=/wrkdirs/usr/ports/multimedia/vapoursynth/work TMPDIR="/tmp" PATH=/wrkdirs/usr/ports/multimedia/vapoursynth/work/.bin:/sbin:/bin:/usr/sbin:/usr/bin:/usr/local/sbin:/usr/local/bin:/root/bin PKG_CONFIG_LIBDIR=/wrkdirs/usr/ports/multimedia/vapoursynth/work/.pkgconfig:/usr/local/libdata/pkgconfig:/usr/local/share/pkgconfig:/usr/libdata/pkgconfig SHELL=/bin/sh CONFIG_SHELL=/bin/sh
--End CONFIGURE_ENV--
--MAKE_ENV--
NINJA_STATUS="[%p %s/%t] " XDG_DATA_HOME=/wrkdirs/usr/ports/multimedia/vapoursynth/work XDG_CONFIG_HOME=/wrkdirs/usr/ports/multimedia/vapoursynth/work XDG_CACHE_HOME=/wrkdirs/usr/ports/multimedia/vapoursynth/work/.cache HOME=/wrkdirs/usr/ports/multimedia/vapoursynth/work TMPDIR="/tmp" PATH=/wrkdirs/usr/ports/multimedia/vapoursynth/work/.bin:/sbin:/bin:/usr/sbin:/usr/bin:/usr/local/sbin:/usr/local/bin:/root/bin PKG_CONFIG_LIBDIR=/wrkdirs/usr/ports/multimedia/vapoursynth/work/.pkgconfig:/usr/local/libdata/pkgconfig:/usr/local/share/pkgconfig:/usr/libdata/pkgconfig MK_DEBUG_FILES=no MK_KERNEL_SYMBOLS=no SHELL=/bin/sh NO_LINT=YES DESTDIR=/wrkdirs/usr/ports/multimedia/vapoursynth/work/stage PREFIX=/usr/local LOCALBASE=/usr/local CC="cc" CFLAGS="-O2 -pipe -fstack-protector-strong -fno-strict-aliasing " CPP="cpp" CPPFLAGS="" LDFLAGS=" -lpthread " LIBS="" CXX="c++" CXXFLAGS="-O2 -pipe -fstack-protector-strong -fno-strict-aliasing " BSD_INSTALL_PROGRAM="install -s -m 555"
BSD_INSTALL_LIB="install -s -m 0644" BSD_INSTALL_SCRIPT="install -m 555" BSD_INSTALL_DATA="install -m 0644" BSD_INSTALL_MAN="install -m 444"
--End MAKE_ENV--
--PLIST_SUB--
PYTHON_INCLUDEDIR=include/python3.11 PYTHON_LIBDIR=lib/python3.11 PYTHON_PLATFORM=freebsd14 PYTHON_SITELIBDIR=lib/python3.11/site-packages PYTHON_SUFFIX=311 PYTHON_BASESUFFIX=311 PYTHON_TAG=.cpython-311 PYTHON_SOABI=.cpython-311 PYTHON_VER=3.11 PYTHON_BASEVER=3.11 PYTHON_VERSION=python3.11 PYTHON2="@comment " PYTHON3="" OSREL=14.3 PREFIX=%D LOCALBASE=/usr/local RESETPREFIX=/usr/local LIB32DIR=lib DOCSDIR="share/doc/vapoursynth" EXAMPLESDIR="share/examples/vapoursynth" DATADIR="share/vapoursynth" WWWDIR="www/vapoursynth" ETCDIR="etc/vapoursynth"
--End PLIST_SUB--
--SUB_LIST--
PYTHON_INCLUDEDIR=/usr/local/include/python3.11 PYTHON_LIBDIR=/usr/local/lib/python3.11 PYTHON_PLATFORM=freebsd14 PYTHON_SITELIBDIR=/usr/local/lib/python3.11/site-packages PYTHON_SUFFIX=311 PYTHON_BASESUFFIX=311 PYTHON_TAG=.cpython-311 PYTHON_SOABI=.cpython-311 PYTHON_VER=3.11 PYTHON_BASEVER=3.11 PYTHON_VERSION=python3.11 PYTHON2="@comment " PYTHON3="" PREFIX=/usr/local LOCALBASE=/usr/local DATADIR=/usr/local/share/vapoursynth DOCSDIR=/usr/local/share/doc/vapoursynth EXAMPLESDIR=/usr/local/share/examples/vapoursynth WWWDIR=/usr/local/www/vapoursynth ETCDIR=/usr/local/etc/vapoursynth
--End SUB_LIST--
---Begin make.conf---
USE_PACKAGE_DEPENDS=yes
BATCH=yes
WRKDIRPREFIX=/wrkdirs
PORTSDIR=/usr/ports
PACKAGES=/packages
DISTDIR=/distfiles
PACKAGE_BUILDING=yes
PACKAGE_BUILDING_FLAVORS=yes
MACHINE=i386
MACHINE_ARCH=i386
ARCH=${MACHINE_ARCH}
#### ####
# XXX: We really need this but cannot use it while 'make checksum' does not
# try the next mirror on checksum failure. It currently retries the same
# failed mirror and then fails rather then trying another. It *does*
# try the next if the size is mismatched though.
#MASTER_SITE_FREEBSD=yes
# Build ALLOW_MAKE_JOBS_PACKAGES with 3 jobs
MAKE_JOBS_NUMBER=3
#### Misc Poudriere ####
.include "/etc/make.conf.ports_env"
GID=0
UID=0
---End make.conf---
--Resource limits--
cpu time (seconds, -t) unlimited
file size (512-blocks, -f) unlimited
data seg size (kbytes, -d) 524288
stack size (kbytes, -s) 65536
core file size (512-blocks, -c) unlimited
max memory size (kbytes, -m) unlimited
locked memory (kbytes, -l) unlimited
max user processes (-u) 89999
open files (-n) 8192
virtual mem size (kbytes, -v) unlimited
swap limit (kbytes, -w) unlimited
socket buffer size (bytes, -b) unlimited
pseudo-terminals (-p) unlimited
kqueues (-k) unlimited
umtx shared locks (-o) unlimited
pipebuf (-y) unlimited
--End resource limits--
=======================<phase: check-sanity >============================
===== env: NO_DEPENDS=yes USER=root UID=0 GID=0
===> License LGPL21+ accepted by the user
===========================================================================
=======================<phase: pkg-depends >============================
===== env: USE_PACKAGE_DEPENDS_ONLY=1 USER=root UID=0 GID=0
===> vapoursynth-r73 depends on file: /usr/local/sbin/pkg - not found
===> Installing existing package /packages/All/pkg-2.7.5.pkg
[143i386-default-job-06] Installing pkg-2.7.5...
[143i386-default-job-06] Extracting pkg-2.7.5: .......... done
===> vapoursynth-r73 depends on file: /usr/local/sbin/pkg - found
===> Returning to build of vapoursynth-r73
===========================================================================
=======================<phase: fetch-depends >============================
===== env: USE_PACKAGE_DEPENDS_ONLY=1 USER=root UID=0 GID=0
===========================================================================
=======================<phase: fetch >============================
===== env: NO_DEPENDS=yes USER=root UID=0 GID=0
===> License LGPL21+ accepted by the user
=> vapoursynth-vapoursynth-R73_GH0.tar.gz doesn't seem to exist in /portdistfiles.
=> Attempting to fetch https://codeload.github.com/vapoursynth/vapoursynth/tar.gz/R73?dummy=/vapoursynth-vapoursynth-R73_GH0.tar.gz
fetch: https://codeload.github.com/vapoursynth/vapoursynth/tar.gz/R73?dummy=/vapoursynth-vapoursynth-R73_GH0.tar.gz: size unknown
fetch: https://codeload.github.com/vapoursynth/vapoursynth/tar.gz/R73?dummy=/vapoursynth-vapoursynth-R73_GH0.tar.gz: size of remote file is not known
vapoursynth-vapoursynth-R73_GH0.tar.gz 1833 kB 18 MBps 00s
===> Fetching all distfiles required by vapoursynth-r73 for building
===========================================================================
=======================<phase: checksum >============================
===== env: NO_DEPENDS=yes USER=root UID=0 GID=0
===> License LGPL21+ accepted by the user
===> Fetching all distfiles required by vapoursynth-r73 for building
=> SHA256 Checksum OK for vapoursynth-vapoursynth-R73_GH0.tar.gz.
===========================================================================
=======================<phase: extract-depends>============================
===== env: USE_PACKAGE_DEPENDS_ONLY=1 USER=root UID=0 GID=0
===========================================================================
=======================<phase: extract >============================
===== env: NO_DEPENDS=yes USER=root UID=0 GID=0
===> License LGPL21+ accepted by the user
===> Fetching all distfiles required by vapoursynth-r73 for building
===> Extracting for vapoursynth-r73
=> SHA256 Checksum OK for vapoursynth-vapoursynth-R73_GH0.tar.gz.
===========================================================================
=======================<phase: patch-depends >============================
===== env: USE_PACKAGE_DEPENDS_ONLY=1 USER=root UID=0 GID=0
===========================================================================
=======================<phase: patch >============================
===== env: NO_DEPENDS=yes USER=root UID=0 GID=0
===> Patching for vapoursynth-r73
===> Applying FreeBSD patches for vapoursynth-r73 from /usr/ports/multimedia/vapoursynth/files
===========================================================================
=======================<phase: build-depends >============================
===== env: USE_PACKAGE_DEPENDS_ONLY=1 USER=root UID=0 GID=0
===> vapoursynth-r73 depends on executable: meson - not found
===> Installing existing package /packages/All/meson-1.10.2_1,1.pkg
[143i386-default-job-06] Installing meson-1.10.2_1,1...
[143i386-default-job-06] `-- Installing ninja-1.13.2,4...
[143i386-default-job-06] | `-- Installing python311-3.11.15_4...
[143i386-default-job-06] | | `-- Installing expat-2.8.1...
[143i386-default-job-06] | | `-- Extracting expat-2.8.1: .......... done
[143i386-default-job-06] | | `-- Installing gettext-runtime-1.0_1...
[143i386-default-job-06] | | `-- Installing indexinfo-0.3.1_1...
[143i386-default-job-06] | | `-- Extracting indexinfo-0.3.1_1: .... done
[143i386-default-job-06] | | `-- Extracting gettext-runtime-1.0_1: .......... done
[143i386-default-job-06] | | `-- Installing libffi-3.5.2...
[143i386-default-job-06] | | `-- Extracting libffi-3.5.2: .......... done
[143i386-default-job-06] | | `-- Installing mpdecimal-4.0.1...
[143i386-default-job-06] | | `-- Extracting mpdecimal-4.0.1: .......... done
<snip>
[ 1% 3/52] cc -Ilibsse2.a.p -I. -I.. -I../include -fvisibility=hidden -flto -fdiagnostics-color=never -DNDEBUG -D_FILE_OFFSET_BITS=64 -Wall -Winvalid-pch -std=c99 -DVS_CORE_EXPORTS -DVS_CURRENT_RELEASE=73 -DVS_GRAPH_API '-DVS_PATH_PLUGINDIR="/usr/local/lib/vapoursynth"' -DVS_USE_LATEST_API -DVSSCRIPT_USE_LATEST_API -Wno-ignored-attributes -fno-math-errno -fno-trapping-math -DVS_TARGET_OS_LINUX -DHAVE_SCHED_GETAFFINITY -DHAVE_CPUSET_GETAFFINITY -DVS_TARGET_CPU_X86 -O2 -pipe -fstack-protector-strong -fno-strict-aliasing -fPIC -MD -MQ libsse2.a.p/src_core_kernel_x86_average_sse2.c.o -MF libsse2.a.p/src_core_kernel_x86_average_sse2.c.o.d -o libsse2.a.p/src_core_kernel_x86_average_sse2.c.o -c ../src/core/kernel/x86/average_sse2.c
FAILED: [code=1] libsse2.a.p/src_core_kernel_x86_average_sse2.c.o
cc -Ilibsse2.a.p -I. -I.. -I../include -fvisibility=hidden -flto -fdiagnostics-color=never -DNDEBUG -D_FILE_OFFSET_BITS=64 -Wall -Winvalid-pch -std=c99 -DVS_CORE_EXPORTS -DVS_CURRENT_RELEASE=73 -DVS_GRAPH_API '-DVS_PATH_PLUGINDIR="/usr/local/lib/vapoursynth"' -DVS_USE_LATEST_API -DVSSCRIPT_USE_LATEST_API -Wno-ignored-attributes -fno-math-errno -fno-trapping-math -DVS_TARGET_OS_LINUX -DHAVE_SCHED_GETAFFINITY -DHAVE_CPUSET_GETAFFINITY -DVS_TARGET_CPU_X86 -O2 -pipe -fstack-protector-strong -fno-strict-aliasing -fPIC -MD -MQ libsse2.a.p/src_core_kernel_x86_average_sse2.c.o -MF libsse2.a.p/src_core_kernel_x86_average_sse2.c.o.d -o libsse2.a.p/src_core_kernel_x86_average_sse2.c.o -c ../src/core/kernel/x86/average_sse2.c
In file included from ../src/core/kernel/x86/average_sse2.c:4:
In file included from ../include/VSHelper4.h:24:
../include/VapourSynth4.h:336:3: warning: redefinition of typedef 'VSPLUGINAPI' is a C11 feature [-Wtypedef-redefinition]
336 | } VSPLUGINAPI;
| ^
../include/VapourSynth4.h:81:28: note: previous definition is here
81 | typedef struct VSPLUGINAPI VSPLUGINAPI;
| ^
../src/core/kernel/x86/average_sse2.c:38:17: error: always_inline function '_mm_set_ps1' requires target feature 'sse', but would be inlined into function 'vs_average_plane_byte_luma_sse2' that is compiled without support for 'sse'
38 | __m128 scale = _mm_set_ps1(1.0f / *(const int *)scale_);
| ^
../src/core/kernel/x86/average_sse2.c:49:19: error: always_inline function '_mm_setzero_si128' requires target feature 'sse2', but would be inlined into function 'vs_average_plane_byte_luma_sse2' that is compiled without support for 'sse2'
49 | __m128i lolo = _mm_setzero_si128();
| ^
../src/core/kernel/x86/average_sse2.c:50:19: error: always_inline function '_mm_setzero_si128' requires target feature 'sse2', but would be inlined into function 'vs_average_plane_byte_luma_sse2' that is compiled without support for 'sse2'
50 | __m128i lohi = _mm_setzero_si128();
| ^
../src/core/kernel/x86/average_sse2.c:51:19: error: always_inline function '_mm_setzero_si128' requires target feature 'sse2', but would be inlined into function 'vs_average_plane_byte_luma_sse2' that is compiled without support for 'sse2'
51 | __m128i hilo = _mm_setzero_si128();
| ^
../src/core/kernel/x86/average_sse2.c:52:19: error: always_inline function '_mm_setzero_si128' requires target feature 'sse2', but would be inlined into function 'vs_average_plane_byte_luma_sse2' that is compiled without support for 'sse2'
52 | __m128i hihi = _mm_setzero_si128();
| ^
../src/core/kernel/x86/average_sse2.c:59:18: error: always_inline function '_mm_load_si128' requires target feature 'sse2', but would be inlined into function 'vs_average_plane_byte_luma_sse2' that is compiled without support for 'sse2'
59 | __m128i v1 = _mm_load_si128((const __m128i *)(ptr1 + j));
| ^
../src/core/kernel/x86/average_sse2.c:60:18: error: always_inline function '_mm_load_si128' requires target feature 'sse2', but would be inlined into function 'vs_average_plane_byte_luma_sse2' that is compiled without support for 'sse2'
60 | __m128i v2 = _mm_load_si128((const __m128i *)(ptr2 + j));
| ^
../src/core/kernel/x86/average_sse2.c:62:43: error: always_inline function '_mm_setzero_si128' requires target feature 'sse2', but would be inlined into function 'vs_average_plane_byte_luma_sse2' that is compiled without support for 'sse2'
62 | __m128i v1_lo = _mm_unpacklo_epi8(v1, _mm_setzero_si128());
| ^
../src/core/kernel/x86/average_sse2.c:62:21: error: always_inline function '_mm_unpacklo_epi8' requires target feature 'sse2', but would be inlined into function 'vs_average_plane_byte_luma_sse2' that is compiled without support for 'sse2'
62 | __m128i v1_lo = _mm_unpacklo_epi8(v1, _mm_setzero_si128());
| ^
../src/core/kernel/x86/average_sse2.c:63:43: error: always_inline function '_mm_setzero_si128' requires target feature 'sse2', but would be inlined into function 'vs_average_plane_byte_luma_sse2' that is compiled without support for 'sse2'
63 | __m128i v1_hi = _mm_unpackhi_epi8(v1, _mm_setzero_si128());
| ^
../src/core/kernel/x86/average_sse2.c:63:21: error: always_inline function '_mm_unpackhi_epi8' requires target feature 'sse2', but would be inlined into function 'vs_average_plane_byte_luma_sse2' that is compiled without support for 'sse2'
63 | __m128i v1_hi = _mm_unpackhi_epi8(v1, _mm_setzero_si128());
| ^
../src/core/kernel/x86/average_sse2.c:64:43: error: always_inline function '_mm_setzero_si128' requires target feature 'sse2', but would be inlined into function 'vs_average_plane_byte_luma_sse2' that is compiled without support for 'sse2'
64 | __m128i v2_lo = _mm_unpacklo_epi8(v2, _mm_setzero_si128());
| ^
../src/core/kernel/x86/average_sse2.c:64:21: error: always_inline function '_mm_unpacklo_epi8' requires target feature 'sse2', but would be inlined into function 'vs_average_plane_byte_luma_sse2' that is compiled without support for 'sse2'
64 | __m128i v2_lo = _mm_unpacklo_epi8(v2, _mm_setzero_si128());
| ^
../src/core/kernel/x86/average_sse2.c:65:43: error: always_inline function '_mm_setzero_si128' requires target feature 'sse2', but would be inlined into function 'vs_average_plane_byte_luma_sse2' that is compiled without support for 'sse2'
65 | __m128i v2_hi = _mm_unpackhi_epi8(v2, _mm_setzero_si128());
| ^
../src/core/kernel/x86/average_sse2.c:65:21: error: always_inline function '_mm_unpackhi_epi8' requires target feature 'sse2', but would be inlined into function 'vs_average_plane_byte_luma_sse2' that is compiled without support for 'sse2'
65 | __m128i v2_hi = _mm_unpackhi_epi8(v2, _mm_setzero_si128());
| ^
../src/core/kernel/x86/average_sse2.c:67:55: error: always_inline function '_mm_unpacklo_epi16' requires target feature 'sse2', but would be inlined into function 'vs_average_plane_byte_luma_sse2' that is compiled without support for 'sse2'
67 | lolo = _mm_add_epi32(lolo, _mm_madd_epi16(coeffs, _mm_unpacklo_epi16(v1_lo, v2_lo)));
| ^
../src/core/kernel/x86/average_sse2.c:67:32: error: always_inline function '_mm_madd_epi16' requires target feature 'sse2', but would be inlined into function 'vs_average_plane_byte_luma_sse2' that is compiled without support for 'sse2'
67 | lolo = _mm_add_epi32(lolo, _mm_madd_epi16(coeffs, _mm_unpacklo_epi16(v1_lo, v2_lo)));
| ^
../src/core/kernel/x86/average_sse2.c:67:12: error: always_inline function '_mm_add_epi32' requires target feature 'sse2', but would be inlined into function 'vs_average_plane_byte_luma_sse2' that is compiled without support for 'sse2'
67 | lolo = _mm_add_epi32(lolo, _mm_madd_epi16(coeffs, _mm_unpacklo_epi16(v1_lo, v2_lo)));
| ^
../src/core/kernel/x86/average_sse2.c:68:55: error: always_inline function '_mm_unpackhi_epi16' requires target feature 'sse2', but would be inlined into function 'vs_average_plane_byte_luma_sse2' that is compiled without support for 'sse2'
68 | lohi = _mm_add_epi32(lohi, _mm_madd_epi16(coeffs, _mm_unpackhi_epi16(v1_lo, v2_lo)));
| ^
fatal error: too many errors emitted, stopping now [-ferror-limit=]
1 warning and 20 errors generated.
[ 3% 3/52] c++ -Ilibsse2.a.p -I. -I.. -I../include -fvisibility=hidden -flto -fdiagnostics-color=never -DNDEBUG -D_FILE_OFFSET_BITS=64 -Wall -Winvalid-pch -std=c++17 -DVS_CORE_EXPORTS -DVS_CURRENT_RELEASE=73 -DVS_GRAPH_API '-DVS_PATH_PLUGINDIR="/usr/local/lib/vapoursynth"' -DVS_USE_LATEST_API -DVSSCRIPT_USE_LATEST_API -Wno-ignored-attributes -fno-math-errno -fno-trapping-math -DVS_TARGET_OS_LINUX -DHAVE_SCHED_GETAFFINITY -DHAVE_CPUSET_GETAFFINITY -DVS_TARGET_CPU_X86 -O2 -pipe -fstack-protector-strong -fno-strict-aliasing -fPIC -MD -MQ libsse2.a.p/src_core_kernel_x86_convolution_sse2.cpp.o -MF libsse2.a.p/src_core_kernel_x86_convolution_sse2.cpp.o.d -o libsse2.a.p/src_core_kernel_x86_convolution_sse2.cpp.o -c ../src/core/kernel/x86/convolution_sse2.cpp
FAILED: [code=1] libsse2.a.p/src_core_kernel_x86_convolution_sse2.cpp.o
c++ -Ilibsse2.a.p -I. -I.. -I../include -fvisibility=hidden -flto -fdiagnostics-color=never -DNDEBUG -D_FILE_OFFSET_BITS=64 -Wall -Winvalid-pch -std=c++17 -DVS_CORE_EXPORTS -DVS_CURRENT_RELEASE=73 -DVS_GRAPH_API '-DVS_PATH_PLUGINDIR="/usr/local/lib/vapoursynth"' -DVS_USE_LATEST_API -DVSSCRIPT_USE_LATEST_API -Wno-ignored-attributes -fno-math-errno -fno-trapping-math -DVS_TARGET_OS_LINUX -DHAVE_SCHED_GETAFFINITY -DHAVE_CPUSET_GETAFFINITY -DVS_TARGET_CPU_X86 -O2 -pipe -fstack-protector-strong -fno-strict-aliasing -fPIC -MD -MQ libsse2.a.p/src_core_kernel_x86_convolution_sse2.cpp.o -MF libsse2.a.p/src_core_kernel_x86_convolution_sse2.cpp.o.d -o libsse2.a.p/src_core_kernel_x86_convolution_sse2.cpp.o -c ../src/core/kernel/x86/convolution_sse2.cpp
../src/core/kernel/x86/convolution_sse2.cpp:83:20: error: always_inline function '_mm_set1_epi32' requires target feature 'sse2', but would be inlined into function 'conv_scanline_h_byte_pass' that is compiled without support for 'sse2'
83 | __m128i w0w1 = _mm_set1_epi32((weight(1) << 16) | weight(0));
| ^
../src/core/kernel/x86/convolution_sse2.cpp:84:20: error: always_inline function '_mm_set1_epi32' requires target feature 'sse2', but would be inlined into function 'conv_scanline_h_byte_pass' that is compiled without support for 'sse2'
84 | __m128i w2w3 = _mm_set1_epi32((weight(3) << 16) | weight(2));
| ^
../src/core/kernel/x86/convolution_sse2.cpp:85:20: error: always_inline function '_mm_set1_epi32' requires target feature 'sse2', but would be inlined into function 'conv_scanline_h_byte_pass' that is compiled without support for 'sse2'
85 | __m128i w4w5 = _mm_set1_epi32((weight(5) << 16) | weight(4));
| ^
../src/core/kernel/x86/convolution_sse2.cpp:86:20: error: always_inline function '_mm_set1_epi32' requires target feature 'sse2', but would be inlined into function 'conv_scanline_h_byte_pass' that is compiled without support for 'sse2'
86 | __m128i w6w7 = _mm_set1_epi32((weight(7) << 16) | weight(6));
| ^
../src/core/kernel/x86/convolution_sse2.cpp:87:20: error: always_inline function '_mm_set1_epi32' requires target feature 'sse2', but would be inlined into function 'conv_scanline_h_byte_pass' that is compiled without support for 'sse2'
87 | __m128i w8w9 = _mm_set1_epi32((weight(9) << 16) | weight(8));
| ^
../src/core/kernel/x86/convolution_sse2.cpp:88:22: error: always_inline function '_mm_set1_epi32' requires target feature 'sse2', but would be inlined into function 'conv_scanline_h_byte_pass' that is compiled without support for 'sse2'
88 | __m128i w10w11 = _mm_set1_epi32((weight(11) << 16) | weight(10));
| ^
../src/core/kernel/x86/convolution_sse2.cpp:89:19: error: always_inline function '_mm_set1_epi32' requires target feature 'sse2', but would be inlined into function 'conv_scanline_h_byte_pass' that is compiled without support for 'sse2'
89 | __m128i w12 = _mm_set1_epi32(weight(12));
| ^
../src/core/kernel/x86/convolution_sse2.cpp:91:20: error: always_inline function '_mm_set_ps1' requires target feature 'sse', but would be inlined into function 'conv_scanline_h_byte_pass' that is compiled without support for 'sse'
91 | __m128 scale = _mm_set_ps1(params.div);
| ^
../src/core/kernel/x86/convolution_sse2.cpp:92:19: error: always_inline function '_mm_set_ps1' requires target feature 'sse', but would be inlined into function 'conv_scanline_h_byte_pass' that is compiled without support for 'sse'
92 | __m128 bias = _mm_set_ps1(params.bias);
| ^
../src/core/kernel/x86/convolution_sse2.cpp:93:44: error: always_inline function '_mm_set1_epi32' requires target feature 'sse2', but would be inlined into function 'conv_scanline_h_byte_pass' that is compiled without support for 'sse2'
93 | __m128 saturatemask = _mm_castsi128_ps(_mm_set1_epi32(params.saturate ? 0xFFFFFFFF : 0x7FFFFFFF));
| ^
../src/core/kernel/x86/convolution_sse2.cpp:93:27: error: always_inline function '_mm_castsi128_ps' requires target feature 'sse2', but would be inlined into function 'conv_scanline_h_byte_pass' that is compiled without support for 'sse2'
93 | __m128 saturatemask = _mm_castsi128_ps(_mm_set1_epi32(params.saturate ? 0xFFFFFFFF : 0x7FFFFFFF));
| ^
../src/core/kernel/x86/convolution_sse2.cpp:98:36: error: always_inline function '_mm_setzero_si128' requires target feature 'sse2', but would be inlined into function 'conv_scanline_h_byte_pass' that is compiled without support for 'sse2'
98 | __m128i accum_lo = First ? _mm_setzero_si128() : _mm_load_si128((const __m128i *)(tmp + j + 0));
| ^
../src/core/kernel/x86/convolution_sse2.cpp:99:36: error: always_inline function '_mm_setzero_si128' requires target feature 'sse2', but would be inlined into function 'conv_scanline_h_byte_pass' that is compiled without support for 'sse2'
99 | __m128i accum_hi = First ? _mm_setzero_si128() : _mm_load_si128((const __m128i *)(tmp + j + 4));
| ^
../src/core/kernel/x86/convolution_sse2.cpp:103:36: error: always_inline function '_mm_loadl_epi64' requires target feature 'sse2', but would be inlined into function 'conv_scanline_h_byte_pass' that is compiled without support for 'sse2'
103 | x0 = _mm_unpacklo_epi8(_mm_loadl_epi64((const __m128i *)(src + j + 0)), _mm_setzero_si128());
| ^
../src/core/kernel/x86/convolution_sse2.cpp:103:85: error: always_inline function '_mm_setzero_si128' requires target feature 'sse2', but would be inlined into function 'conv_scanline_h_byte_pass' that is compiled without support for 'sse2'
103 | x0 = _mm_unpacklo_epi8(_mm_loadl_epi64((const __m128i *)(src + j + 0)), _mm_setzero_si128());
| ^
../src/core/kernel/x86/convolution_sse2.cpp:103:18: error: always_inline function '_mm_unpacklo_epi8' requires target feature 'sse2', but would be inlined into function 'conv_scanline_h_byte_pass' that is compiled without support for 'sse2'
103 | x0 = _mm_unpacklo_epi8(_mm_loadl_epi64((const __m128i *)(src + j + 0)), _mm_setzero_si128());
| ^
../src/core/kernel/x86/convolution_sse2.cpp:104:36: error: always_inline function '_mm_loadl_epi64' requires target feature 'sse2', but would be inlined into function 'conv_scanline_h_byte_pass' that is compiled without support for 'sse2'
104 | x1 = _mm_unpacklo_epi8(_mm_loadl_epi64((const __m128i *)(src + j + 1)), _mm_setzero_si128());
| ^
../src/core/kernel/x86/convolution_sse2.cpp:104:85: error: always_inline function '_mm_setzero_si128' requires target feature 'sse2', but would be inlined into function 'conv_scanline_h_byte_pass' that is compiled without support for 'sse2'
104 | x1 = _mm_unpacklo_epi8(_mm_loadl_epi64((const __m128i *)(src + j + 1)), _mm_setzero_si128());
| ^
../src/core/kernel/x86/convolution_sse2.cpp:104:18: error: always_inline function '_mm_unpacklo_epi8' requires target feature 'sse2', but would be inlined into function 'conv_scanline_h_byte_pass' that is compiled without support for 'sse2'
104 | x1 = _mm_unpacklo_epi8(_mm_loadl_epi64((const __m128i *)(src + j + 1)), _mm_setzero_si128());
| ^
fatal error: too many errors emitted, stopping now [-ferror-limit=]
20 errors generated.
[ 5% 3/52] c++ -Ilibsse2.a.p -I. -I.. -I../include -fvisibility=hidden -flto -fdiagnostics-color=never -DNDEBUG -D_FILE_OFFSET_BITS=64 -Wall -Winvalid-pch -std=c++17 -DVS_CORE_EXPORTS -DVS_CURRENT_RELEASE=73 -DVS_GRAPH_API '-DVS_PATH_PLUGINDIR="/usr/local/lib/vapoursynth"' -DVS_USE_LATEST_API -DVSSCRIPT_USE_LATEST_API -Wno-ignored-attributes -fno-math-errno -fno-trapping-math -DVS_TARGET_OS_LINUX -DHAVE_SCHED_GETAFFINITY -DHAVE_CPUSET_GETAFFINITY -DVS_TARGET_CPU_X86 -O2 -pipe -fstack-protector-strong -fno-strict-aliasing -fPIC -MD -MQ libsse2.a.p/src_core_expr_jitcompiler_x86.cpp.o -MF libsse2.a.p/src_core_expr_jitcompiler_x86.cpp.o.d -o libsse2.a.p/src_core_expr_jitcompiler_x86.cpp.o -c ../src/core/expr/jitcompiler_x86.cpp
In file included from ../src/core/expr/jitcompiler_x86.cpp:28:
../src/core/expr/jitasm.h:7638:10: warning: variable 'num_of_preserved_gp_reg' set but not used [-Wunused-but-set-variable]
7638 | size_t num_of_preserved_gp_reg = 0;
| ^
../src/core/expr/jitcompiler_x86.cpp:115:30: warning: unused variable 'float_511' [-Wunused-const-variable]
115 | static constexpr int float_511 = 8;
| ^~~~~~~~~
../src/core/expr/jitcompiler_x86.cpp:116:30: warning: unused variable 'float_1023' [-Wunused-const-variable]
116 | static constexpr int float_1023 = 9;
| ^~~~~~~~~~
../src/core/expr/jitcompiler_x86.cpp:117:30: warning: unused variable 'float_2047' [-Wunused-const-variable]
117 | static constexpr int float_2047 = 10;
| ^~~~~~~~~~
../src/core/expr/jitcompiler_x86.cpp:118:30: warning: unused variable 'float_4095' [-Wunused-const-variable]
118 | static constexpr int float_4095 = 11;
| ^~~~~~~~~~
../src/core/expr/jitcompiler_x86.cpp:119:30: warning: unused variable 'float_8191' [-Wunused-const-variable]
119 | static constexpr int float_8191 = 12;
| ^~~~~~~~~~
../src/core/expr/jitcompiler_x86.cpp:120:30: warning: unused variable 'float_16383' [-Wunused-const-variable]
120 | static constexpr int float_16383 = 13;
| ^~~~~~~~~~~
../src/core/expr/jitcompiler_x86.cpp:121:30: warning: unused variable 'float_32767' [-Wunused-const-variable]
121 | static constexpr int float_32767 = 14;
| ^~~~~~~~~~~
../src/core/expr/jitcompiler_x86.cpp:122:30: warning: unused variable 'float_65535' [-Wunused-const-variable]
122 | static constexpr int float_65535 = 15;
| ^~~~~~~~~~~
../src/core/expr/jitcompiler_x86.cpp:1067:30: warning: unused variable 'float_511' [-Wunused-const-variable]
1067 | static constexpr int float_511 = 8;
| ^~~~~~~~~
../src/core/expr/jitcompiler_x86.cpp:1068:30: warning: unused variable 'float_1023' [-Wunused-const-variable]
1068 | static constexpr int float_1023 = 9;
| ^~~~~~~~~~
../src/core/expr/jitcompiler_x86.cpp:1069:30: warning: unused variable 'float_2047' [-Wunused-const-variable]
1069 | static constexpr int float_2047 = 10;
| ^~~~~~~~~~
../src/core/expr/jitcompiler_x86.cpp:1070:30: warning: unused variable 'float_4095' [-Wunused-const-variable]
1070 | static constexpr int float_4095 = 11;
| ^~~~~~~~~~
../src/core/expr/jitcompiler_x86.cpp:1071:30: warning: unused variable 'float_8191' [-Wunused-const-variable]
1071 | static constexpr int float_8191 = 12;
| ^~~~~~~~~~
../src/core/expr/jitcompiler_x86.cpp:1072:30: warning: unused variable 'float_16383' [-Wunused-const-variable]
1072 | static constexpr int float_16383 = 13;
| ^~~~~~~~~~~
../src/core/expr/jitcompiler_x86.cpp:1073:30: warning: unused variable 'float_32767' [-Wunused-const-variable]
1073 | static constexpr int float_32767 = 14;
| ^~~~~~~~~~~
../src/core/expr/jitcompiler_x86.cpp:1074:30: warning: unused variable 'float_65535' [-Wunused-const-variable]
1074 | static constexpr int float_65535 = 15;
| ^~~~~~~~~~~
../src/core/expr/jitcompiler_x86.cpp:1075:30: warning: unused variable 'i16min_epi16' [-Wunused-const-variable]
1075 | static constexpr int i16min_epi16 = 16;
| ^~~~~~~~~~~~
../src/core/expr/jitcompiler_x86.cpp:1076:30: warning: unused variable 'i16min_epi32' [-Wunused-const-variable]
1076 | static constexpr int i16min_epi32 = 17;
| ^~~~~~~~~~~~
19 warnings generated.
ninja: build stopped: subcommand failed.
===> Compilation failed unexpectedly.
Try to set MAKE_JOBS_UNSAFE=yes and rebuild before reporting the failure to
the maintainer.
*** Error code 1
Stop.
make: stopped in /usr/ports/multimedia/vapoursynth