[package - main-amd64-default][lang/swift6] Failed for swift6-6.3.2 in build
- Go to: [ bottom of page ] [ top of archives ] [ this month ]
Date: Thu, 09 Jul 2026 12:06:08 UTC
You are receiving this mail as a port that you maintain
is failing to build on the FreeBSD package build server.
Please investigate the failure and submit a PR to fix
build.
Maintainer: tagattie@FreeBSD.org
Log URL: https://pkg-status.freebsd.org/beefy24/data/main-amd64-default/p7eab0869b7d1_s750d429a228/logs/swift6-6.3.2.log
Build URL: https://pkg-status.freebsd.org/beefy24/build.html?mastername=main-amd64-default&build=p7eab0869b7d1_s750d429a228
Log:
=>> Building lang/swift6
build started at Thu Jul 9 03:39:30 UTC 2026
port directory: /usr/ports/lang/swift6
package name: swift6-6.3.2
building for: FreeBSD main-amd64-default-job-26 16.0-CURRENT FreeBSD 16.0-CURRENT 1600019 amd64
maintained by: tagattie@FreeBSD.org
Makefile datestamp: -rw-r--r-- 1 root wheel 11234 Jul 4 01:01 /usr/ports/lang/swift6/Makefile
Ports top last git commit: 7eab0869b7d18b44ee6a4796a1a1549e1c3d3d2b
Ports top unclean checkout: no
Port dir last git commit: 0fbb7d57552133f769419bfa27fe3b6201635899
Port dir unclean checkout: no
Poudriere version: poudriere-git-3.4.8
Host OSVERSION: 1600018
Jail OSVERSION: 1600019
Job Id: 26
!!! Jail is newer than host. (Jail: 1600019, Host: 1600018) !!!
!!! This is not supported. !!!
!!! Host kernel must be same or newer than jail. !!!
!!! Expect build failures. !!!
---Begin Environment---
SHELL=/bin/sh
OSVERSION=1600019
UNAME_v=FreeBSD 16.0-CURRENT 1600019
UNAME_r=16.0-CURRENT
BLOCKSIZE=K
MAIL=/var/mail/root
MM_CHARSET=UTF-8
LANG=C.UTF-8
STATUS=1
HOME=/root
PATH=/sbin:/bin:/usr/sbin:/usr/bin:/usr/local/sbin:/usr/local/bin:/root/bin
MAKE_OBJDIR_CHECK_WRITABLE=0
LOCALBASE=/usr/local
USER=root
POUDRIERE_NAME=poudriere-git
LIBEXECPREFIX=/usr/local/libexec/poudriere
POUDRIERE_VERSION=3.4.8
MASTERMNT=/usr/local/poudriere/data/.m/main-amd64-default/ref
LC_COLLATE=C
POUDRIERE_BUILD_TYPE=bulk
PACKAGE_BUILDING=yes
SAVED_TERM=
OUTPUT_REDIRECTED_STDERR=4
OUTPUT_REDIRECTED=1
PWD=/usr/local/poudriere/data/.m/main-amd64-default/26/.p
OUTPUT_REDIRECTED_STDOUT=3
P_PORTS_FEATURES=FLAVORS SUBPACKAGES SELECTED_OPTIONS
MASTERNAME=main-amd64-default
SCRIPTPREFIX=/usr/local/share/poudriere
SCRIPTNAME=bulk.sh
OLDPWD=/usr/local/poudriere/data/.m/main-amd64-default/ref/.p/pool
POUDRIERE_PKGNAME=poudriere-git-3.4.8
SCRIPTPATH=/usr/local/share/poudriere/bulk.sh
POUDRIEREPATH=/usr/local/bin/poudriere
---End Environment---
---Begin Poudriere Port Flags/Env---
PORT_FLAGS=
PKGENV=
FLAVOR=
MAKE_ARGS=
---End Poudriere Port Flags/Env---
---Begin OPTIONS List---
===> The following configuration options are available for swift6-6.3.2:
DOCS=on: Build and/or install documentation
===> Use 'make config' to modify these settings
---End OPTIONS List---
--MAINTAINER--
tagattie@FreeBSD.org
--End MAINTAINER--
--CONFIGURE_ARGS--
--End CONFIGURE_ARGS--
--CONFIGURE_ENV--
ac_cv_path_PERL=/usr/local/bin/perl ac_cv_path_PERL_PATH=/usr/local/bin/perl PERL_USE_UNSAFE_INC=1 PKG_CONFIG=pkgconf PYTHON="/usr/local/bin/python3.12" XDG_DATA_HOME=/wrkdirs/usr/ports/lang/swift6/work XDG_CONFIG_HOME=/wrkdirs/usr/ports/lang/swift6/work XDG_CACHE_HOME=/wrkdirs/usr/ports/lang/swift6/work/.cache HOME=/wrkdirs/usr/ports/lang/swift6/work TMPDIR="/tmp" PATH=/wrkdirs/usr/ports/lang/swift6/work/.bin:/sbin:/bin:/usr/sbin:/usr/bin:/usr/local/sbin:/usr/local/bin:/root/bin PKG_CONFIG_LIBDIR=/wrkdirs/usr/ports/lang/swift6/work/.pkgconfig:/usr/local/libdata/pkgconfig:/usr/local/share/pkgconfig:/usr/libdata/pkgconfig SHELL=/bin/sh CONFIG_SHELL=/bin/sh CMAKE_PREFIX_PATH="/usr/local"
--End CONFIGURE_ENV--
--MAKE_ENV--
SKIP_BUILD_SWIFTPM_INTERNALTESTSUPPORT=1 NINJA_STATUS="[%p %s/%t] " PERL_USE_UNSAFE_INC=1 XDG_DATA_HOME=/wrkdirs/usr/ports/lang/swift6/work XDG_CONFIG_HOME=/wrkdirs/usr/ports/lang/swift6/work XDG_CACHE_HOME=/wrkdirs/usr/ports/lang/swift6/work/.cache HOME=/wrkdirs/usr/ports/lang/swift6/work TMPDIR="/tmp" PATH=/wrkdirs/usr/ports/lang/swift6/work/.bin:/sbin:/bin:/usr/sbin:/usr/bin:/usr/local/sbin:/usr/local/bin:/root/bin PKG_CONFIG_LIBDIR=/wrkdirs/usr/ports/lang/swift6/work/.pkgconfig:/usr/local/libdata/pkgconfig:/usr/local/share/pkgconfig:/usr/libdata/pkgconfig MK_DEBUG_FILES=no MK_KERNEL_SYMBOLS=no SHELL=/bin/sh NO_LINT=YES PREFIX=/usr/local LOCALBASE=/usr/local CC="cc" CFLAGS="-O2 -pipe -fstack-protector-strong -isystem /usr/local/include -fno-strict-aliasing " CPP="cpp" CPPFLAGS="-isystem /usr/local/include" LDFLAGS=" " LIBS="-L/usr/local/lib" CXX="c++" CXXFLAGS="-O2 -pipe -fstack-protector-strong -isystem /usr/local/include -fno-strict-aliasing -isystem /usr/loc
al/include " BSD_INSTALL_PROGRAM="install -s -m 555" BSD_INSTALL_LIB="install -s -m 0644" BSD_INSTALL_SCRIPT="install -m 555" BSD_INSTALL_DATA="install -m 0644" BSD_INSTALL_MAN="install -m 444"
--End MAKE_ENV--
--PLIST_SUB--
SWIFT_ARCH=x86_64 SWIFT_TARGET_TRIPLE=x86_64-unknown-freebsd BOOTSTRAP="" PORTDOCS="" GTK2_VERSION="2.10.0" GTK3_VERSION="3.0.0" GTK4_VERSION="4.0.0" PYTHON_INCLUDEDIR=include/python3.12 PYTHON_LIBDIR=lib/python3.12 PYTHON_PLATFORM=freebsd16 PYTHON_SITELIBDIR=lib/python3.12/site-packages PYTHON_SUFFIX=312 PYTHON_BASESUFFIX=312 PYTHON_TAG=.cpython-312 PYTHON_SOABI=.cpython-312 PYTHON_VER=3.12 PYTHON_BASEVER=3.12 PYTHON_VERSION=python3.12 PYTHON2="@comment " PYTHON3="" OSREL=16.0 PREFIX=%D LOCALBASE=/usr/local RESETPREFIX=/usr/local LIB32DIR=lib PERL_VERSION=5.42.2 PERL_VER=5.42 PERL5_MAN1=lib/perl5/site_perl/man/man1 PERL5_MAN3=lib/perl5/site_perl/man/man3 SITE_PERL=lib/perl5/site_perl SITE_ARCH=lib/perl5/site_perl/mach/5.42 DOCSDIR="share/doc/swift" EXAMPLESDIR="share/examples/swift" DATADIR="share/swift" WWWDIR="www/swift" ETCDIR="etc/swift"
--End PLIST_SUB--
--SUB_LIST--
PYTHON_INCLUDEDIR=/usr/local/include/python3.12 PYTHON_LIBDIR=/usr/local/lib/python3.12 PYTHON_PLATFORM=freebsd16 PYTHON_SITELIBDIR=/usr/local/lib/python3.12/site-packages PYTHON_SUFFIX=312 PYTHON_BASESUFFIX=312 PYTHON_TAG=.cpython-312 PYTHON_SOABI=.cpython-312 PYTHON_VER=3.12 PYTHON_BASEVER=3.12 PYTHON_VERSION=python3.12 PYTHON2="@comment " PYTHON3="" PREFIX=/usr/local LOCALBASE=/usr/local DATADIR=/usr/local/share/swift DOCSDIR=/usr/local/share/doc/swift EXAMPLESDIR=/usr/local/share/examples/swift WWWDIR=/usr/local/www/swift ETCDIR=/usr/local/etc/swift
--End SUB_LIST--
---Begin make.conf---
USE_PACKAGE_DEPENDS=yes
BATCH=yes
WRKDIRPREFIX=/wrkdirs
PORTSDIR=/usr/ports
PACKAGES=/packages
DISTDIR=/distfiles
PACKAGE_BUILDING=yes
PACKAGE_BUILDING_FLAVORS=yes
#### ####
# XXX: We really need this but cannot use it while 'make checksum' does not
# try the next mirror on checksum failure. It currently retries the same
# failed mirror and then fails rather then trying another. It *does*
# try the next if the size is mismatched though.
#MASTER_SITE_FREEBSD=yes
# Build ALLOW_MAKE_JOBS_PACKAGES with 3 jobs
MAKE_JOBS_NUMBER=3
#### Misc Poudriere ####
.include "/etc/make.conf.ports_env"
GID=0
UID=0
---End make.conf---
--Resource limits--
cpu time (seconds, -t) unlimited
file size (512-blocks, -f) unlimited
data seg size (kbytes, -d) 33554432
stack size (kbytes, -s) 524288
core file size (512-blocks, -c) unlimited
max memory size (kbytes, -m) unlimited
locked memory (kbytes, -l) unlimited
max user processes (-u) 89999
open files (-n) 8192
virtual mem size (kbytes, -v) unlimited
swap limit (kbytes, -w) unlimited
socket buffer size (bytes, -b) unlimited
pseudo-terminals (-p) unlimited
kqueues (-k) unlimited
umtx shared locks (-o) unlimited
pipebuf (kbytes, -y) unlimited
virtual machines (-V) unlimited
--End resource limits--
=======================<phase: check-sanity >============================
===== env: NO_DEPENDS=yes USER=root UID=0 GID=0
===> License APACHE20 accepted by the user
===========================================================================
=======================<phase: pkg-depends >============================
===== env: USE_PACKAGE_DEPENDS_ONLY=1 USER=root UID=0 GID=0
===> swift6-6.3.2 depends on file: /usr/local/sbin/pkg - not found
===> Installing existing package /packages/All/pkg-2.7.5.pkg
[main-amd64-default-job-26] Installing pkg-2.7.5...
[main-amd64-default-job-26] Extracting pkg-2.7.5: .......... done
===> swift6-6.3.2 depends on file: /usr/local/sbin/pkg - found
===> Returning to build of swift6-6.3.2
===========================================================================
=======================<phase: fetch-depends >============================
===== env: USE_PACKAGE_DEPENDS_ONLY=1 USER=root UID=0 GID=0
===========================================================================
=======================<phase: fetch >============================
===== env: NO_DEPENDS=yes USER=root UID=0 GID=0
===> License APACHE20 accepted by the user
===> Fetching all distfiles required by swift6-6.3.2 for building
===========================================================================
=======================<phase: checksum >============================
===== env: NO_DEPENDS=yes USER=root UID=0 GID=0
===> License APACHE20 accepted by the user
===> Fetching all distfiles required by swift6-6.3.2 for building
=> SHA256 Checksum OK for swift/swift6-bootstrap-6.3.1-x86_64-unknown-freebsd.tar.xz.
=> SHA256 Checksum OK for swift/swiftlang-swift-cmark-swift-6.3.2-RELEASE_GH0.tar.gz.
=> SHA256 Checksum OK for swift/swiftlang-indexstore-db-swift-6.3.2-RELEASE_GH0.tar.gz.
=> SHA256 Checksum OK for swift/swiftlang-swift-llbuild-swift-6.3.2-RELEASE_GH0.tar.gz.
=> SHA256 Checksum OK for swift/swiftlang-llvm-project-swift-6.3.2-RELEASE_GH0.tar.gz.
=> SHA256 Checksum OK for swift/swiftlang-sourcekit-lsp-swift-6.3.2-RELEASE_GH0.tar.gz.
=> SHA256 Checksum OK for swift/swiftlang-swift-swift-6.3.2-RELEASE_GH0.tar.gz.
=> SHA256 Checksum OK for swift/apple-swift-argument-parser-1.6.1_GH0.tar.gz.
=> SHA256 Checksum OK for swift/apple-swift-asn1-1.3.2_GH0.tar.gz.
=> SHA256 Checksum OK for swift/apple-swift-async-algorithms-1.0.1_GH0.tar.gz.
=> SHA256 Checksum OK for swift/apple-swift-atomics-1.2.0_GH0.tar.gz.
=> SHA256 Checksum OK for swift/swiftlang-swift-build-swift-6.3.2-RELEASE_GH0.tar.gz.
=> SHA256 Checksum OK for swift/apple-swift-certificates-1.10.1_GH0.tar.gz.
=> SHA256 Checksum OK for swift/apple-swift-collections-1.1.6_GH0.tar.gz.
=> SHA256 Checksum OK for swift/swiftlang-swift-corelibs-blocksruntime-swift-6.3.2-RELEASE_GH0.tar.gz.
=> SHA256 Checksum OK for swift/swiftlang-swift-corelibs-foundation-swift-6.3.2-RELEASE_GH0.tar.gz.
=> SHA256 Checksum OK for swift/swiftlang-swift-corelibs-libdispatch-swift-6.3.2-RELEASE_GH0.tar.gz.
=> SHA256 Checksum OK for swift/swiftlang-swift-corelibs-xctest-swift-6.3.2-RELEASE_GH0.tar.gz.
=> SHA256 Checksum OK for swift/apple-swift-crypto-3.12.5_GH0.tar.gz.
=> SHA256 Checksum OK for swift/swiftlang-swift-docc-swift-6.3.2-RELEASE_GH0.tar.gz.
=> SHA256 Checksum OK for swift/swiftlang-swift-docc-render-artifact-swift-6.3.2-RELEASE_GH0.tar.gz.
=> SHA256 Checksum OK for swift/swiftlang-swift-docc-symbolkit-swift-6.3.2-RELEASE_GH0.tar.gz.
=> SHA256 Checksum OK for swift/swiftlang-swift-driver-swift-6.3.2-RELEASE_GH0.tar.gz.
=> SHA256 Checksum OK for swift/swiftlang-swift-experimental-string-processing-swift-6.3.2-RELEASE_GH0.tar.gz.
=> SHA256 Checksum OK for swift/swiftlang-swift-format-swift-6.3.2-RELEASE_GH0.tar.gz.
=> SHA256 Checksum OK for swift/swiftlang-swift-foundation-swift-6.3.2-RELEASE_GH0.tar.gz.
=> SHA256 Checksum OK for swift/swiftlang-swift-foundation-icu-swift-6.3.2-RELEASE_GH0.tar.gz.
=> SHA256 Checksum OK for swift/swiftlang-swift-installer-scripts-swift-6.3.2-RELEASE_GH0.tar.gz.
=> SHA256 Checksum OK for swift/swiftlang-swift-integration-tests-swift-6.3.2-RELEASE_GH0.tar.gz.
=> SHA256 Checksum OK for swift/swiftlang-swift-llvm-bindings-swift-6.3.2-RELEASE_GH0.tar.gz.
=> SHA256 Checksum OK for swift/swiftlang-swift-lmdb-swift-6.3.2-RELEASE_GH0.tar.gz.
=> SHA256 Checksum OK for swift/apple-swift-log-1.5.4_GH0.tar.gz.
=> SHA256 Checksum OK for swift/swiftlang-swift-markdown-swift-6.3.2-RELEASE_GH0.tar.gz.
<snip>
16 |
17 | #include "llvm/ADT/SmallVector.h"
| `- error: could not build module 'LLVM_Utils'
18 | #include "llvm/Object/ObjectFile.h"
19 | #include "llvm/Support/WithColor.h"
/wrkdirs/usr/ports/lang/swift6/work/swift-6.3.2/swift/include/swift/Basic/SourceManager.h:19:10: note: while building module 'Clang_Basic' imported from /wrkdirs/usr/ports/lang/swift6/work/swift-6.3.2/swift/include/swift/Basic/SourceManager.h:19:
17 | #include "swift/Basic/FileSystem.h"
18 | #include "swift/Basic/SourceLoc.h"
19 | #include "clang/Basic/FileManager.h"
| `- note: while building module 'Clang_Basic' imported from /wrkdirs/usr/ports/lang/swift6/work/swift-6.3.2/swift/include/swift/Basic/SourceManager.h:19:
20 | #include "llvm/ADT/ArrayRef.h"
21 | #include "llvm/ADT/DenseSet.h"
/wrkdirs/usr/ports/lang/swift6/work/swift-6.3.2/llvm-project/clang/include/clang/Basic/Sanitizers.h:20:10: note: while building module 'LLVM_Transforms' imported from /wrkdirs/usr/ports/lang/swift6/work/swift-6.3.2/llvm-project/clang/include/clang/Basic/Sanitizers.h:20:
18 | #include "llvm/ADT/StringRef.h"
19 | #include "llvm/Support/HashBuilder.h"
20 | #include "llvm/Transforms/Instrumentation/AddressSanitizerOptions.h"
| `- note: while building module 'LLVM_Transforms' imported from /wrkdirs/usr/ports/lang/swift6/work/swift-6.3.2/llvm-project/clang/include/clang/Basic/Sanitizers.h:20:
21 | #include <cassert>
22 | #include <cstdint>
/wrkdirs/usr/ports/lang/swift6/work/swift-6.3.2/llvm-project/llvm/include/llvm/Transforms/Vectorize/SandboxVectorizer/DependencyGraph.h:28:10: note: while building module 'LLVM_SandboxIR' imported from /wrkdirs/usr/ports/lang/swift6/work/swift-6.3.2/llvm-project/llvm/include/llvm/Transforms/Vectorize/SandboxVectorizer/DependencyGraph.h:28:
26 | #include "llvm/ADT/iterator_range.h"
27 | #include "llvm/Analysis/AliasAnalysis.h"
28 | #include "llvm/SandboxIR/Instruction.h"
| `- note: while building module 'LLVM_SandboxIR' imported from /wrkdirs/usr/ports/lang/swift6/work/swift-6.3.2/llvm-project/llvm/include/llvm/Transforms/Vectorize/SandboxVectorizer/DependencyGraph.h:28:
29 | #include "llvm/SandboxIR/IntrinsicInst.h"
30 | #include "llvm/Support/Compiler.h"
<module-includes>:1:10: note: in file included from <module-includes>:1:
1 | #include "llvm/SandboxIR/Argument.h"
| `- note: in file included from <module-includes>:1:
2 | #include "llvm/SandboxIR/BasicBlock.h"
3 | #include "llvm/SandboxIR/Constant.h"
/wrkdirs/usr/ports/lang/swift6/work/swift-6.3.2/llvm-project/llvm/include/llvm/SandboxIR/Argument.h:12:10: error: could not build module 'LLVM_IR'
10 | #define LLVM_SANDBOXIR_ARGUMENT_H
11 |
12 | #include "llvm/IR/Argument.h"
| `- error: could not build module 'LLVM_IR'
13 | #include "llvm/SandboxIR/Value.h"
14 |
/wrkdirs/usr/ports/lang/swift6/work/swift-6.3.2/swift/include/swift/Basic/SourceManager.h:19:10: note: while building module 'Clang_Basic' imported from /wrkdirs/usr/ports/lang/swift6/work/swift-6.3.2/swift/include/swift/Basic/SourceManager.h:19:
17 | #include "swift/Basic/FileSystem.h"
18 | #include "swift/Basic/SourceLoc.h"
19 | #include "clang/Basic/FileManager.h"
| `- note: while building module 'Clang_Basic' imported from /wrkdirs/usr/ports/lang/swift6/work/swift-6.3.2/swift/include/swift/Basic/SourceManager.h:19:
20 | #include "llvm/ADT/ArrayRef.h"
21 | #include "llvm/ADT/DenseSet.h"
/wrkdirs/usr/ports/lang/swift6/work/swift-6.3.2/llvm-project/clang/include/clang/Basic/PointerAuthOptions.h:21:10: note: while building module 'LLVM_Backend_Target' imported from /wrkdirs/usr/ports/lang/swift6/work/swift-6.3.2/llvm-project/clang/include/clang/Basic/PointerAuthOptions.h:21:
19 | #include "llvm/ADT/STLForwardCompat.h"
20 | #include "llvm/Support/ErrorHandling.h"
21 | #include "llvm/Target/TargetOptions.h"
| `- note: while building module 'LLVM_Backend_Target' imported from /wrkdirs/usr/ports/lang/swift6/work/swift-6.3.2/llvm-project/clang/include/clang/Basic/PointerAuthOptions.h:21:
22 | #include <optional>
23 |
<module-includes>:1:10: note: in file included from <module-includes>:1:
1 | #include "llvm/Target/CGPassBuilderOption.h"
| `- note: in file included from <module-includes>:1:
2 | #include "llvm/Target/CodeGenCWrappers.h"
3 | #include "llvm/Target/RegisterTargetPassConfigCallback.h"
/wrkdirs/usr/ports/lang/swift6/work/swift-6.3.2/llvm-project/llvm/include/llvm/Target/CGPassBuilderOption.h:17:10: error: could not build module 'LLVM_Utils'
15 | #define LLVM_TARGET_CGPASSBUILDEROPTION_H
16 |
17 | #include "llvm/Support/CommandLine.h"
| `- error: could not build module 'LLVM_Utils'
18 | #include "llvm/Support/Compiler.h"
19 | #include "llvm/Target/TargetOptions.h"
/wrkdirs/usr/ports/lang/swift6/work/swift-6.3.2/swift/include/swift/Basic/SourceManager.h:19:10: note: while building module 'Clang_Basic' imported from /wrkdirs/usr/ports/lang/swift6/work/swift-6.3.2/swift/include/swift/Basic/SourceManager.h:19:
17 | #include "swift/Basic/FileSystem.h"
18 | #include "swift/Basic/SourceLoc.h"
19 | #include "clang/Basic/FileManager.h"
| `- note: while building module 'Clang_Basic' imported from /wrkdirs/usr/ports/lang/swift6/work/swift-6.3.2/swift/include/swift/Basic/SourceManager.h:19:
20 | #include "llvm/ADT/ArrayRef.h"
21 | #include "llvm/ADT/DenseSet.h"
/wrkdirs/usr/ports/lang/swift6/work/swift-6.3.2/llvm-project/clang/include/clang/Basic/OpenMPKinds.h:20:10: note: while building module 'LLVM_Frontend_OpenMP' imported from /wrkdirs/usr/ports/lang/swift6/work/swift-6.3.2/llvm-project/clang/include/clang/Basic/OpenMPKinds.h:20:
18 | #include "llvm/ADT/Sequence.h"
19 | #include "llvm/ADT/StringRef.h"
20 | #include "llvm/Frontend/OpenMP/OMPConstants.h"
| `- note: while building module 'LLVM_Frontend_OpenMP' imported from /wrkdirs/usr/ports/lang/swift6/work/swift-6.3.2/llvm-project/clang/include/clang/Basic/OpenMPKinds.h:20:
21 |
22 | namespace clang {
<module-includes>:1:10: note: in file included from <module-includes>:1:
1 | #include "llvm/Frontend/OpenMP/ClauseT.h"
| `- note: in file included from <module-includes>:1:
2 | #include "llvm/Frontend/OpenMP/ConstructDecompositionT.h"
3 | #include "llvm/Frontend/OpenMP/DirectiveNameParser.h"
/wrkdirs/usr/ports/lang/swift6/work/swift-6.3.2/llvm-project/llvm/include/llvm/Frontend/OpenMP/ClauseT.h:44:10: error: could not build module 'LLVM_Utils'
42 | #define LLVM_FRONTEND_OPENMP_CLAUSET_H
43 |
44 | #include "llvm/ADT/ArrayRef.h"
| `- error: could not build module 'LLVM_Utils'
45 | #include "llvm/ADT/DenseMap.h"
46 | #include "llvm/ADT/DenseSet.h"
/wrkdirs/usr/ports/lang/swift6/work/swift-6.3.2/swift/include/swift/Basic/SourceManager.h:19:10: note: while building module 'Clang_Basic' imported from /wrkdirs/usr/ports/lang/swift6/work/swift-6.3.2/swift/include/swift/Basic/SourceManager.h:19:
17 | #include "swift/Basic/FileSystem.h"
18 | #include "swift/Basic/SourceLoc.h"
19 | #include "clang/Basic/FileManager.h"
| `- note: while building module 'Clang_Basic' imported from /wrkdirs/usr/ports/lang/swift6/work/swift-6.3.2/swift/include/swift/Basic/SourceManager.h:19:
20 | #include "llvm/ADT/ArrayRef.h"
21 | #include "llvm/ADT/DenseSet.h"
/wrkdirs/usr/ports/lang/swift6/work/swift-6.3.2/llvm-project/clang/include/clang/Basic/ParsedAttrInfo.h:20:10: note: while building module 'Clang_Support' imported from /wrkdirs/usr/ports/lang/swift6/work/swift-6.3.2/llvm-project/clang/include/clang/Basic/ParsedAttrInfo.h:20:
18 | #include "clang/Basic/AttrSubjectMatchRules.h"
19 | #include "clang/Basic/AttributeCommonInfo.h"
20 | #include "clang/Support/Compiler.h"
| `- note: while building module 'Clang_Support' imported from /wrkdirs/usr/ports/lang/swift6/work/swift-6.3.2/llvm-project/clang/include/clang/Basic/ParsedAttrInfo.h:20:
21 | #include "llvm/ADT/ArrayRef.h"
22 | #include "llvm/Support/Registry.h"
<module-includes>:1:10: note: in file included from <module-includes>:1:
1 | #include "clang/Support/Compiler.h"
| `- note: in file included from <module-includes>:1:
2 | #include "clang/Support/RISCVVIntrinsicUtils.h"
3 |
/wrkdirs/usr/ports/lang/swift6/work/swift-6.3.2/llvm-project/clang/include/clang/Support/Compiler.h:17:10: error: could not build module 'LLVM_Utils'
15 | #define CLANG_SUPPORT_COMPILER_H
16 |
17 | #include "llvm/Support/Compiler.h"
| `- error: could not build module 'LLVM_Utils'
18 |
19 | /// CLANG_ABI is the main export/visibility macro to mark something as
/wrkdirs/usr/ports/lang/swift6/work/swift-6.3.2/swift/include/swift/Basic/LangOptions.h:35:10: note: while building module 'LLVM_Option' imported from /wrkdirs/usr/ports/lang/swift6/work/swift-6.3.2/swift/include/swift/Basic/LangOptions.h:35:
33 | #include "llvm/ADT/SmallVector.h"
34 | #include "llvm/ADT/StringRef.h"
35 | #include "llvm/Option/ArgList.h"
| `- note: while building module 'LLVM_Option' imported from /wrkdirs/usr/ports/lang/swift6/work/swift-6.3.2/swift/include/swift/Basic/LangOptions.h:35:
36 | #include "llvm/Support/Regex.h"
37 | #include "llvm/Support/VersionTuple.h"
<module-includes>:1:10: note: in file included from <module-includes>:1:
1 | #include "llvm/Option/Arg.h"
| `- note: in file included from <module-includes>:1:
2 | #include "llvm/Option/ArgList.h"
3 | #include "llvm/Option/OptSpecifier.h"
/wrkdirs/usr/ports/lang/swift6/work/swift-6.3.2/llvm-project/llvm/include/llvm/Option/Arg.h:17:10: error: could not build module 'LLVM_Utils'
15 | #define LLVM_OPTION_ARG_H
16 |
17 | #include "llvm/ADT/SmallVector.h"
| `- error: could not build module 'LLVM_Utils'
18 | #include "llvm/ADT/StringRef.h"
19 | #include "llvm/Option/Option.h"
/wrkdirs/usr/ports/lang/swift6/work/swift-6.3.2/swift/include/swift/AST/ASTContext.h:38:10: note: while building module 'Clang_AST' imported from /wrkdirs/usr/ports/lang/swift6/work/swift-6.3.2/swift/include/swift/AST/ASTContext.h:38:
36 | #include "swift/Serialization/SerializationOptions.h"
37 | #include "swift/SymbolGraphGen/SymbolGraphOptions.h"
38 | #include "clang/AST/DeclTemplate.h"
| `- note: while building module 'Clang_AST' imported from /wrkdirs/usr/ports/lang/swift6/work/swift-6.3.2/swift/include/swift/AST/ASTContext.h:38:
39 | #include "clang/Basic/DarwinSDKInfo.h"
40 | #include "llvm/ADT/ArrayRef.h"
<module-includes>:1:10: note: in file included from <module-includes>:1:
1 | #include "clang/AST/APNumericStorage.h"
| `- note: in file included from <module-includes>:1:
2 | #include "clang/AST/APValue.h"
3 | #include "clang/AST/AST.h"
/wrkdirs/usr/ports/lang/swift6/work/swift-6.3.2/llvm-project/clang/include/clang/AST/APNumericStorage.h:12:10: error: could not build module 'LLVM_Utils'
10 | #define LLVM_CLANG_AST_APNUMERICSTORAGE_H
11 |
12 | #include "llvm/ADT/APFloat.h"
| `- error: could not build module 'LLVM_Utils'
13 | #include "llvm/ADT/APInt.h"
14 |
/wrkdirs/usr/ports/lang/swift6/work/swift-6.3.2/swift/lib/ASTGen/Sources/BasicSwift/StaticBuildConfiguration+LangOptions.swift:13:8: error: could not build C module 'ASTBridging'
11 | //===----------------------------------------------------------------------===//
12 |
13 | import ASTBridging
| `- error: could not build C module 'ASTBridging'
14 | @_spi(PluginMessage) import SwiftCompilerPluginMessageHandling
15 | import SwiftDiagnostics
[ 10% 197/1782] /usr/bin/clang++ -DCMARK_STATIC_DEFINE -DGTEST_HAS_RTTI=0 -DNDEBUG -DOBJC_OLD_DISPATCH_PROTOTYPES=0 -DSWIFT_BUILD_SWIFT_SYNTAX -DSWIFT_ENABLE_SWIFT_IN_SWIFT -DSWIFT_THREADING_PTHREADS -D__STDC_CONSTANT_MACROS -D__STDC_FORMAT_MACROS -D__STDC_LIMIT_MACROS -I/wrkdirs/usr/ports/lang/swift6/work/swift-6.3.2/build/Ninja-Release/swift-freebsd-x86_64/lib/DependencyScan -I/wrkdirs/usr/ports/lang/swift6/work/swift-6.3.2/swift/lib/DependencyScan -I/wrkdirs/usr/ports/lang/swift6/work/swift-6.3.2/swift/stdlib/public/SwiftShims -I/wrkdirs/usr/ports/lang/swift6/work/swift-6.3.2/build/Ninja-Release/swift-freebsd-x86_64/include -I/wrkdirs/usr/ports/lang/swift6/work/swift-6.3.2/swift/include -I/wrkdirs/usr/ports/lang/swift6/work/swift-6.3.2/llvm-project/llvm/include -I/wrkdirs/usr/ports/lang/swift6/work/swift-6.3.2/build/Ninja-Release/llvm-freebsd-x86_64/include -I/wrkdirs/usr/ports/lang/swift6/work/swift-6.3.2/llvm-project/clang/include -I/wrkdirs/usr/ports/lang/swift6/work/s
wift-6.3.2/build/Ninja-Release/llvm-freebsd-x86_64/tools/clang/include -I/wrkdirs/usr/ports/lang/swift6/work/swift-6.3.2/cmark/src/include -I/wrkdirs/usr/ports/lang/swift6/work/swift-6.3.2/build/Ninja-Release/cmark-freebsd-x86_64/src -I/wrkdirs/usr/ports/lang/swift6/work/swift-6.3.2/swift-corelibs-libdispatch/src/BlocksRuntime -I/wrkdirs/usr/ports/lang/swift6/work/swift-6.3.2/swift-corelibs-libdispatch -Wno-unknown-warning-option -Werror=unguarded-availability-new -fno-stack-protector -fPIC -fno-semantic-interposition -fvisibility-inlines-hidden -Werror=date-time -Werror=unguarded-availability-new -Wall -Wextra -Wno-unused-parameter -Wwrite-strings -Wcast-qual -Wmissing-field-initializers -Wimplicit-fallthrough -Wcovered-switch-default -Wno-noexcept-type -Wnon-virtual-dtor -Wdelete-non-virtual-dtor -Wsuggest-override -Wstring-conversion -Wmisleading-indentation -Wctad-maybe-unsupported -fdiagnostics-color -ffunction-sections -fdata-sections -O2 -pipe -fstack-protector-strong
-isystem /usr/local/include -fno-strict-aliasing -isystem /usr/local/include -DNDEBUG -std=c++17 -fno-exceptions -funwind-tables -fno-rtti -Werror=gnu -Werror=c++98-compat-extra-semi -fsized-deallocation -Werror=switch -Wimplicit-fallthrough -Wunreachable-code -Woverloaded-virtual -Wno-nested-anon-types -target x86_64-unknown-freebsd16.0 -O2 -momit-leaf-frame-pointer -g0 -MD -MT lib/DependencyScan/CMakeFiles/swiftDependencyScanImpl.dir/DependencyScanJSON.cpp.o -MF lib/DependencyScan/CMakeFiles/swiftDependencyScanImpl.dir/DependencyScanJSON.cpp.o.d -o lib/DependencyScan/CMakeFiles/swiftDependencyScanImpl.dir/DependencyScanJSON.cpp.o -c /wrkdirs/usr/ports/lang/swift6/work/swift-6.3.2/swift/lib/DependencyScan/DependencyScanJSON.cpp
[ 11% 197/1782] /usr/bin/clang++ -DCMARK_STATIC_DEFINE -DGTEST_HAS_RTTI=0 -DNDEBUG -DOBJC_OLD_DISPATCH_PROTOTYPES=0 -DSWIFT_BUILD_SWIFT_SYNTAX -DSWIFT_ENABLE_SWIFT_IN_SWIFT -DSWIFT_THREADING_PTHREADS -D__STDC_CONSTANT_MACROS -D__STDC_FORMAT_MACROS -D__STDC_LIMIT_MACROS -I/wrkdirs/usr/ports/lang/swift6/work/swift-6.3.2/build/Ninja-Release/swift-freebsd-x86_64/lib/Localization -I/wrkdirs/usr/ports/lang/swift6/work/swift-6.3.2/swift/lib/Localization -I/wrkdirs/usr/ports/lang/swift6/work/swift-6.3.2/swift/stdlib/public/SwiftShims -I/wrkdirs/usr/ports/lang/swift6/work/swift-6.3.2/build/Ninja-Release/swift-freebsd-x86_64/include -I/wrkdirs/usr/ports/lang/swift6/work/swift-6.3.2/swift/include -I/wrkdirs/usr/ports/lang/swift6/work/swift-6.3.2/llvm-project/llvm/include -I/wrkdirs/usr/ports/lang/swift6/work/swift-6.3.2/build/Ninja-Release/llvm-freebsd-x86_64/include -I/wrkdirs/usr/ports/lang/swift6/work/swift-6.3.2/llvm-project/clang/include -I/wrkdirs/usr/ports/lang/swift6/work/swift
-6.3.2/build/Ninja-Release/llvm-freebsd-x86_64/tools/clang/include -I/wrkdirs/usr/ports/lang/swift6/work/swift-6.3.2/cmark/src/include -I/wrkdirs/usr/ports/lang/swift6/work/swift-6.3.2/build/Ninja-Release/cmark-freebsd-x86_64/src -I/wrkdirs/usr/ports/lang/swift6/work/swift-6.3.2/swift-corelibs-libdispatch/src/BlocksRuntime -I/wrkdirs/usr/ports/lang/swift6/work/swift-6.3.2/swift-corelibs-libdispatch -Wno-unknown-warning-option -Werror=unguarded-availability-new -fno-stack-protector -fPIC -fno-semantic-interposition -fvisibility-inlines-hidden -Werror=date-time -Werror=unguarded-availability-new -Wall -Wextra -Wno-unused-parameter -Wwrite-strings -Wcast-qual -Wmissing-field-initializers -Wimplicit-fallthrough -Wcovered-switch-default -Wno-noexcept-type -Wnon-virtual-dtor -Wdelete-non-virtual-dtor -Wsuggest-override -Wstring-conversion -Wmisleading-indentation -Wctad-maybe-unsupported -fdiagnostics-color -ffunction-sections -fdata-sections -O2 -pipe -fstack-protector-strong -is
ystem /usr/local/include -fno-strict-aliasing -isystem /usr/local/include -DNDEBUG -std=c++17 -fno-exceptions -funwind-tables -fno-rtti -Werror=gnu -Werror=c++98-compat-extra-semi -fsized-deallocation -Werror=switch -Wimplicit-fallthrough -Wunreachable-code -Woverloaded-virtual -Wno-nested-anon-types -target x86_64-unknown-freebsd16.0 -O2 -momit-leaf-frame-pointer -g0 -MD -MT lib/Localization/CMakeFiles/swiftLocalization.dir/LocalizationFormat.cpp.o -MF lib/Localization/CMakeFiles/swiftLocalization.dir/LocalizationFormat.cpp.o.d -o lib/Localization/CMakeFiles/swiftLocalization.dir/LocalizationFormat.cpp.o -c /wrkdirs/usr/ports/lang/swift6/work/swift-6.3.2/swift/lib/Localization/LocalizationFormat.cpp
/wrkdirs/usr/ports/lang/swift6/work/swift-6.3.2/swift/lib/Localization/LocalizationFormat.cpp:253:12: warning: variable 'isValid' set but not used [-Wunused-but-set-variable]
253 | bool isValid = false;
| ^
1 warning generated.
ninja: build stopped: subcommand failed.
Building the standard library for: swift-test-stdlib-freebsd-x86_64
ERROR: command `['/wrkdirs/usr/ports/lang/swift6/work/swift-6.3.2/swift/utils/build-script-impl', '--workspace', '/wrkdirs/usr/ports/lang/swift6/work/swift-6.3.2', '--build-dir', '/wrkdirs/usr/ports/lang/swift6/work/swift-6.3.2/build/Ninja-Release', '--install-prefix', '/usr/local/swift6', '--host-target', 'freebsd-x86_64', '--stdlib-deployment-targets=freebsd-x86_64', '--host-cc', '/usr/bin/clang', '--host-cxx', '/usr/bin/clang++', '--darwin-xcrun-toolchain', 'default', '--darwin-deployment-version-osx=13.0', '--darwin-deployment-version-ios=16.0', '--darwin-deployment-version-tvos=16.0', '--darwin-deployment-version-watchos=6.0', '--darwin-deployment-version-xros=1.0', '--cmake', '/usr/local/bin/cmake', '--llvm-build-type', 'Release', '--swift-build-type', 'Release', '--swift-stdlib-build-type', 'Release', '--lldb-build-type', 'Release', '--foundation-build-type', 'Release', '--libdispatch-build-type', 'Release', '--xctest-build-type', 'Release', '--llbuild-build-type', 'R
elease', '--swift-enable-assertions', 'false', '--swift-stdlib-enable-assertions', 'false', '--swift-stdlib-enable-strict-availability', 'false', '--swift-analyze-code-coverage', 'false', '--llbuild-enable-assertions', 'false', '--lldb-assertions', 'false', '--cmake-generator', 'Ninja', '--cross-compile-append-host-target-to-destdir', 'true', '--cross-compile-build-swift-tools', 'true', '--build-jobs', '3', '--lit-jobs', '3', '--common-cmake-options=-G Ninja -DCMAKE_C_COMPILER:PATH=/usr/bin/clang -DCMAKE_CXX_COMPILER:PATH=/usr/bin/clang++ -DCMAKE_Swift_COMPILER:PATH= -DCMAKE_LIBTOOL:PATH= -DCMAKE_AR:PATH=/usr/bin/ar -DCMAKE_RANLIB:PATH=/usr/bin/ranlib -DLLVM_VERSION_MAJOR:STRING=21 -DLLVM_VERSION_MINOR:STRING=0 -DLLVM_VERSION_PATCH:STRING=0 -DCLANG_VERSION_MAJOR:STRING=21 -DCLANG_VERSION_MINOR:STRING=0 -DCLANG_VERSION_PATCH:STRING=0 -DCMAKE_MAKE_PROGRAM=/usr/local/bin/ninja', '--build-args=-j3 -v', '--dsymutil-jobs', '1', '--build-swift-libexec', 'true', '--swift-enable-back
tracing', 'true', '--build-swift-clang-overlays', 'true', '--build-swift-remote-mirror', 'true', '--swift-source-dirname', 'swift', '--swift-cmake-options=-DCMAKE_EXPORT_COMPILE_COMMANDS=TRUE -DSWIFT_FORCE_OPTIMIZED_TYPECHECKER:BOOL=FALSE -DSWIFT_STDLIB_ENABLE_STDLIBCORE_EXCLUSIVITY_CHECKING:BOOL=FALSE -DSWIFT_ENABLE_EXPERIMENTAL_DIFFERENTIABLE_PROGRAMMING:BOOL=TRUE -DSWIFT_ENABLE_EXPERIMENTAL_CONCURRENCY:BOOL=TRUE -DSWIFT_ENABLE_EXPERIMENTAL_CXX_INTEROP:BOOL=TRUE -DSWIFT_ENABLE_CXX_INTEROP_SWIFT_BRIDGING_HEADER:BOOL=TRUE -DSWIFT_ENABLE_EXPERIMENTAL_DISTRIBUTED:BOOL=TRUE -DSWIFT_ENABLE_BACKTRACING:BOOL=TRUE -DSWIFT_ENABLE_EXPERIMENTAL_OBSERVATION:BOOL=TRUE -DSWIFT_ENABLE_SYNCHRONIZATION:BOOL=TRUE -DSWIFT_ENABLE_VOLATILE:BOOL=TRUE -DSWIFT_ENABLE_RUNTIME_MODULE:BOOL=TRUE -DSWIFT_STDLIB_STATIC_PRINT=FALSE -DSWIFT_FREESTANDING_IS_DARWIN:BOOL=FALSE -DSWIFT_STDLIB_BUILD_PRIVATE:BOOL=TRUE -DSWIFT_STDLIB_ENABLE_UNICODE_DATA=TRUE -DSWIFT_SHOULD_BUILD_EMBEDDED_STDLIB=TRUE -DSWIFT_SHOU
LD_BUILD_EMBEDDED_STDLIB_CROSS_COMPILING=FALSE -DSWIFT_STDLIB_BUILD_SYMBOL_GRAPHS:BOOL=FALSE -DSWIFT_TOOLS_LD64_LTO_CODEGEN_ONLY_FOR_SUPPORTING_TARGETS:BOOL=FALSE -DSWIFT_ENABLE_EXPERIMENTAL_PARSER_VALIDATION:BOOL=TRUE -USWIFT_DEBUGINFO_NON_LTO_ARGS -DSWIFT_ENABLE_NEW_RUNTIME_BUILD:BOOL=FALSE -DSWIFT_DARWIN_TEST_DEPLOYMENT_VERSION_OSX:STRING=13.0 -DSWIFT_DARWIN_TEST_DEPLOYMENT_VERSION_IOS:STRING=16.0 -DSWIFT_DARWIN_TEST_DEPLOYMENT_VERSION_TVOS:STRING=16.0 -DSWIFT_DARWIN_TEST_DEPLOYMENT_VERSION_WATCHOS:STRING=6.0 -DSWIFT_DARWIN_TEST_DEPLOYMENT_VERSION_XROS:STRING=1.0', '--build-stdlib-deployment-targets', 'all', '--ninja-bin=/usr/local/bin/ninja', '--verbose-build', '--install-destdir', '/wrkdirs/usr/ports/lang/swift6/work/out5', '--install-llvm', '--install-swift', '--install-foundation', '--install-xctest', '--install-lldb', '--install-llbuild', '--skip-build-libcxx', '--install-libdispatch', '--skip-build-libxml2', '--skip-build-zlib', '--skip-build-curl', '--build-swift-d
ynamic-stdlib', '--build-swift-static-stdlib', '--build-swift-dynamic-sdk-overlay', '--build-swift-static-sdk-overlay', '--skip-build-android', '--skip-test-swift', '--skip-test-lldb', '--skip-test-llbuild', '--skip-test-xctest', '--skip-test-foundation', '--skip-test-libdispatch', '--skip-test-benchmarks', '--android-deploy-device-path', '/data/local/tmp', '--native-swift-tools-path=/wrkdirs/usr/ports/lang/swift6/work/swift6-bootstrap/usr/local/swift6/bin', "--extra-cmake-options='-DCMAKE_C_FLAGS_RELEASE=-O2 -pipe -fstack-protector-strong -isystem /usr/local/include -fno-strict-aliasing -DNDEBUG' '-DCMAKE_CXX_FLAGS_RELEASE=-O2 -pipe -fstack-protector-strong -isystem /usr/local/include -fno-strict-aliasing -isystem /usr/local/include -DNDEBUG' -DCLANG_DEFAULT_LINKER=lld -DLLVM_ENABLE_LLD=ON -DSWIFT_USE_LINKER=lld -DCMAKE_Swift_COMPILER=/wrkdirs/usr/ports/lang/swift6/work/swift6-bootstrap/usr/local/swift6/bin/swiftc -USWIFT_DARWIN_SUPPORTED_ARCHS -DSWIFT_PATH_TO_SWIFT_SY
NTAX_SOURCE:PATH=/wrkdirs/usr/ports/lang/swift6/work/swift-6.3.2/swift-syntax -DSWIFT_BUILD_SWIFT_SYNTAX:BOOL=TRUE -DSWIFT_EARLY_SWIFT_DRIVER_BUILD=/wrkdirs/usr/ports/lang/swift6/work/swift-6.3.2/build/Ninja-Release/earlyswiftdriver-freebsd-x86_64/release/bin", '--bootstrapping=hosttools', '--llvm-lit-args=-sv', '--llvm-install-components=llvm-ar;llvm-cov;llvm-profdata;IndexStore;clang;clang-resource-headers;compiler-rt;clangd;LTO;lld', '--musl-path=/usr/local/musl', '--linux-static-archs=x86_64;aarch64', '--only-execute', 'freebsd-x86_64-swift-build']` terminated with a non-zero exit status 1, aborting
*** Error code 1
Stop.
make: stopped making "build" in /usr/ports/lang/swift6