[package - 150arm64-default][print/pdftk] Failed for pdftk-3.3.3_3 in build

From: <pkg-fallout_at_FreeBSD.org>
Date: Tue, 07 Jul 2026 10:04:06 UTC
You are receiving this mail as a port that you maintain
is failing to build on the FreeBSD package build server.
Please investigate the failure and submit a PR to fix
build.

Maintainer:     ports@FreeBSD.org
Log URL:        https://pkg-status.freebsd.org/ampere5/data/150arm64-default/fd77dbcdcf06/logs/pdftk-3.3.3_3.log
Build URL:      https://pkg-status.freebsd.org/ampere5/build.html?mastername=150arm64-default&build=fd77dbcdcf06
Log:

=>> Building print/pdftk
build started at Tue Jul  7 10:03:44 UTC 2026
port directory: /usr/ports/print/pdftk
package name: pdftk-3.3.3_3
building for: FreeBSD 150arm64-default-job-03 15.0-RELEASE-p11 FreeBSD 15.0-RELEASE-p11 arm64
maintained by: ports@FreeBSD.org
Makefile datestamp: -rw-r--r--  1 root wheel 1321 May  7 01:02 /usr/ports/print/pdftk/Makefile
Ports top last git commit: fd77dbcdcf0659b6d458f06b1da69302cf76655e
Ports top unclean checkout: no
Port dir last git commit: 9391af4ce7dc05f83d7bdb06676ccc461aac6bfe
Port dir unclean checkout: no
Poudriere version: poudriere-git-3.4.8
Host OSVERSION: 1600018
Jail OSVERSION: 1500068
Job Id: 03

---Begin Environment---
SHELL=/bin/sh
OSVERSION=1500068
UNAME_v=FreeBSD 15.0-RELEASE-p11
UNAME_r=15.0-RELEASE-p11
BLOCKSIZE=K
MAIL=/var/mail/root
MM_CHARSET=UTF-8
LANG=C.UTF-8
STATUS=1
HOME=/root
PATH=/sbin:/bin:/usr/sbin:/usr/bin:/usr/local/sbin:/usr/local/bin:/root/bin
MAKE_OBJDIR_CHECK_WRITABLE=0
LOCALBASE=/usr/local
USER=root
POUDRIERE_NAME=poudriere-git
LIBEXECPREFIX=/usr/local/libexec/poudriere
POUDRIERE_VERSION=3.4.8
MASTERMNT=/usr/local/poudriere/data/.m/150arm64-default/ref
LC_COLLATE=C
POUDRIERE_BUILD_TYPE=bulk
PACKAGE_BUILDING=yes
SAVED_TERM=
OUTPUT_REDIRECTED_STDERR=4
OUTPUT_REDIRECTED=1
PWD=/usr/local/poudriere/data/.m/150arm64-default/03/.p
OUTPUT_REDIRECTED_STDOUT=3
P_PORTS_FEATURES=FLAVORS SUBPACKAGES SELECTED_OPTIONS
MASTERNAME=150arm64-default
SCRIPTPREFIX=/usr/local/share/poudriere
SCRIPTNAME=bulk.sh
OLDPWD=/usr/local/poudriere/data/.m/150arm64-default/ref/.p/pool
POUDRIERE_PKGNAME=poudriere-git-3.4.8
SCRIPTPATH=/usr/local/share/poudriere/bulk.sh
POUDRIEREPATH=/usr/local/bin/poudriere
---End Environment---

---Begin Poudriere Port Flags/Env---
PORT_FLAGS=
PKGENV=
FLAVOR=
MAKE_ARGS=
---End Poudriere Port Flags/Env---

---Begin OPTIONS List---
---End OPTIONS List---

--MAINTAINER--
ports@FreeBSD.org
--End MAINTAINER--

--CONFIGURE_ARGS--

--End CONFIGURE_ARGS--

--CONFIGURE_ENV--
XDG_DATA_HOME=/wrkdirs/usr/ports/print/pdftk/work  XDG_CONFIG_HOME=/wrkdirs/usr/ports/print/pdftk/work  XDG_CACHE_HOME=/wrkdirs/usr/ports/print/pdftk/work/.cache  HOME=/wrkdirs/usr/ports/print/pdftk/work TMPDIR="/tmp" PATH=/wrkdirs/usr/ports/print/pdftk/work/.bin:/sbin:/bin:/usr/sbin:/usr/bin:/usr/local/sbin:/usr/local/bin:/root/bin PKG_CONFIG_LIBDIR=/wrkdirs/usr/ports/print/pdftk/work/.pkgconfig:/usr/local/libdata/pkgconfig:/usr/local/share/pkgconfig:/usr/libdata/pkgconfig SHELL=/bin/sh CONFIG_SHELL=/bin/sh
--End CONFIGURE_ENV--

--MAKE_ENV--
JAVA_HOME=/usr/local/openjdk25 XDG_DATA_HOME=/wrkdirs/usr/ports/print/pdftk/work  XDG_CONFIG_HOME=/wrkdirs/usr/ports/print/pdftk/work  XDG_CACHE_HOME=/wrkdirs/usr/ports/print/pdftk/work/.cache  HOME=/wrkdirs/usr/ports/print/pdftk/work TMPDIR="/tmp" PATH=/wrkdirs/usr/ports/print/pdftk/work/.bin:/sbin:/bin:/usr/sbin:/usr/bin:/usr/local/sbin:/usr/local/bin:/root/bin PKG_CONFIG_LIBDIR=/wrkdirs/usr/ports/print/pdftk/work/.pkgconfig:/usr/local/libdata/pkgconfig:/usr/local/share/pkgconfig:/usr/libdata/pkgconfig MK_DEBUG_FILES=no MK_KERNEL_SYMBOLS=no SHELL=/bin/sh NO_LINT=YES PREFIX=/usr/local  LOCALBASE=/usr/local  CC="cc" CFLAGS="-O2 -pipe  -fstack-protector-strong -fno-strict-aliasing "  CPP="cpp" CPPFLAGS=""  LDFLAGS=" " LIBS=""  CXX="c++" CXXFLAGS="-O2 -pipe -fstack-protector-strong -fno-strict-aliasing   " BSD_INSTALL_PROGRAM="install  -s -m 555"  BSD_INSTALL_LIB="install  -s -m 0644"  BSD_INSTALL_SCRIPT="install  -m 555"  BSD_INSTALL_DATA="install  -m 0644"  BSD_INSTALL_MAN="
install  -m 444"
--End MAKE_ENV--

--PLIST_SUB--
JAVASHAREDIR="share/java"  JAVAJARDIR="share/java/classes" OSREL=15.0 PREFIX=%D LOCALBASE=/usr/local  RESETPREFIX=/usr/local LIB32DIR=lib DOCSDIR="share/doc/pdftk"  EXAMPLESDIR="share/examples/pdftk"  DATADIR="share/pdftk"  WWWDIR="www/pdftk"  ETCDIR="etc/pdftk"
--End PLIST_SUB--

--SUB_LIST--
CLASSPATH="/usr/local/share/java/classes/commons-lang3.jar:/usr/local/share/java/classes/bcprov.jar:/usr/local/share/java/classes/pdftk.jar"  JAVA="/usr/local/openjdk25/bin/java" JAVASHAREDIR="/usr/local/share/java"  JAVAJARDIR="/usr/local/share/java/classes"  JAVALIBDIR="/usr/local/share/java/classes" PREFIX=/usr/local LOCALBASE=/usr/local  DATADIR=/usr/local/share/pdftk DOCSDIR=/usr/local/share/doc/pdftk EXAMPLESDIR=/usr/local/share/examples/pdftk  WWWDIR=/usr/local/www/pdftk ETCDIR=/usr/local/etc/pdftk
--End SUB_LIST--

---Begin make.conf---
USE_PACKAGE_DEPENDS=yes
BATCH=yes
WRKDIRPREFIX=/wrkdirs
PORTSDIR=/usr/ports
PACKAGES=/packages
DISTDIR=/distfiles
PACKAGE_BUILDING=yes
PACKAGE_BUILDING_FLAVORS=yes
####  ####
# XXX: We really need this but cannot use it while 'make checksum' does not
# try the next mirror on checksum failure.  It currently retries the same
# failed mirror and then fails rather then trying another.  It *does*
# try the next if the size is mismatched though.
#MASTER_SITE_FREEBSD=yes
# Build ALLOW_MAKE_JOBS_PACKAGES with 3 jobs
MAKE_JOBS_NUMBER=3
#### Misc Poudriere ####
.include "/etc/make.conf.ports_env"
GID=0
UID=0
---End make.conf---
--Resource limits--
cpu time               (seconds, -t)  unlimited
file size           (512-blocks, -f)  unlimited
data seg size           (kbytes, -d)  1048576
stack size              (kbytes, -s)  1048576
core file size      (512-blocks, -c)  unlimited
max memory size         (kbytes, -m)  unlimited
locked memory           (kbytes, -l)  unlimited
max user processes              (-u)  89999
open files                      (-n)  8192
virtual mem size        (kbytes, -v)  unlimited
swap limit              (kbytes, -w)  unlimited
socket buffer size       (bytes, -b)  unlimited
pseudo-terminals                (-p)  unlimited
kqueues                         (-k)  unlimited
umtx shared locks               (-o)  unlimited
pipebuf                         (-y)  unlimited
--End resource limits--
=======================<phase: check-sanity   >============================
===== env: NO_DEPENDS=yes USER=root UID=0 GID=0
===>   NOTICE:

The pdftk port currently does not have a maintainer. As a result, it is
more likely to have unresolved issues, not be up-to-date, or even be removed in
the future. To volunteer to maintain this port, please create an issue at:

https://bugs.freebsd.org/bugzilla

More information about port maintainership is available at:

https://docs.freebsd.org/en/articles/contributing/#ports-contributing

===>  License GPLv2 accepted by the user
===========================================================================
=======================<phase: pkg-depends    >============================
===== env: USE_PACKAGE_DEPENDS_ONLY=1 USER=root UID=0 GID=0
===>   pdftk-3.3.3_3 depends on file: /usr/local/sbin/pkg - not found
===>   Installing existing package /packages/All/pkg-2.7.5.pkg
[150arm64-default-job-03] Installing pkg-2.7.5...
[150arm64-default-job-03] Extracting pkg-2.7.5: .......... done
===>   pdftk-3.3.3_3 depends on file: /usr/local/sbin/pkg - found
===>   Returning to build of pdftk-3.3.3_3
===========================================================================
=======================<phase: fetch-depends  >============================
===== env: USE_PACKAGE_DEPENDS_ONLY=1 USER=root UID=0 GID=0
===========================================================================
=======================<phase: fetch          >============================
===== env: NO_DEPENDS=yes USER=root UID=0 GID=0
===>   NOTICE:

The pdftk port currently does not have a maintainer. As a result, it is
more likely to have unresolved issues, not be up-to-date, or even be removed in
the future. To volunteer to maintain this port, please create an issue at:

https://bugs.freebsd.org/bugzilla

More information about port maintainership is available at:

https://docs.freebsd.org/en/articles/contributing/#ports-contributing

===>  License GPLv2 accepted by the user
===> Fetching all distfiles required by pdftk-3.3.3_3 for building
===========================================================================
=======================<phase: checksum       >============================
===== env: NO_DEPENDS=yes USER=root UID=0 GID=0
===>   NOTICE:

The pdftk port currently does not have a maintainer. As a result, it is
more likely to have unresolved issues, not be up-to-date, or even be removed in
the future. To volunteer to maintain this port, please create an issue at:

https://bugs.freebsd.org/bugzilla

More information about port maintainership is available at:

https://docs.freebsd.org/en/articles/contributing/#ports-contributing

===>  License GPLv2 accepted by the user
===> Fetching all distfiles required by pdftk-3.3.3_3 for building
=> SHA256 Checksum OK for pdftk-java-pdftk-e4292c8f1bd2580a44d3cbf3570a4505bd3a74b6_GL0.tar.gz.
===========================================================================
=======================<phase: extract-depends>============================
===== env: USE_PACKAGE_DEPENDS_ONLY=1 USER=root UID=0 GID=0
===========================================================================
=======================<phase: extract        >============================
===== env: NO_DEPENDS=yes USER=root UID=0 GID=0
===>   NOTICE:

The pdftk port currently does not have a maintainer. As a result, it is
more likely to have unresolved issues, not be up-to-date, or even be removed in
<snip>
[150arm64-default-job-03] |   |   | `-- Installing liblz4-1.10.0_2,1...
[150arm64-default-job-03] |   |   | `-- Extracting liblz4-1.10.0_2,1: .......... done
[150arm64-default-job-03] |   |   `-- Extracting zstd-1.5.7_2: .......... done
[150arm64-default-job-03] |   | `-- Extracting tiff-4.7.1_1: .......... done
[150arm64-default-job-03] |   `-- Extracting lcms2-2.19.1: .......... done
[150arm64-default-job-03] |   `-- Installing libX11-1.8.13_1,1...
[150arm64-default-job-03] |   | `-- Installing libxcb-1.17.0...
[150arm64-default-job-03] |   |   `-- Installing libXau-1.0.12...
[150arm64-default-job-03] |   |   `-- Extracting libXau-1.0.12: .......... done
[150arm64-default-job-03] |   |   `-- Installing libXdmcp-1.1.5...
[150arm64-default-job-03] |   |   | `-- Installing xorgproto-2025.1...
[150arm64-default-job-03] |   |   | `-- Extracting xorgproto-2025.1: .......... done
[150arm64-default-job-03] |   |   `-- Extracting libXdmcp-1.1.5: ......... done
[150arm64-default-job-03] |   | `-- Extracting libxcb-1.17.0: .......... done
[150arm64-default-job-03] |   `-- Extracting libX11-1.8.13_1,1: .......... done
[150arm64-default-job-03] |   `-- Installing libXext-1.3.7,1...
[150arm64-default-job-03] |   `-- Extracting libXext-1.3.7,1: .......... done
[150arm64-default-job-03] |   `-- Installing libXi-1.8.3,1...
[150arm64-default-job-03] |   | `-- Installing libXfixes-6.0.1...
[150arm64-default-job-03] |   | `-- Extracting libXfixes-6.0.1: .......... done
[150arm64-default-job-03] |   `-- Extracting libXi-1.8.3,1: .......... done
[150arm64-default-job-03] |   `-- Installing libXrandr-1.5.5...
[150arm64-default-job-03] |   | `-- Installing libXrender-0.9.12...
[150arm64-default-job-03] |   | `-- Extracting libXrender-0.9.12: .......... done
[150arm64-default-job-03] |   `-- Extracting libXrandr-1.5.5: .......... done
[150arm64-default-job-03] |   `-- Installing libXt-1.3.1,1...
[150arm64-default-job-03] |   | `-- Installing libICE-1.1.2,1...
[150arm64-default-job-03] |   | `-- Extracting libICE-1.1.2,1: .......... done
[150arm64-default-job-03] |   | `-- Installing libSM-1.2.6,1...
[150arm64-default-job-03] |   | `-- Extracting libSM-1.2.6,1: .......... done
[150arm64-default-job-03] |   `-- Extracting libXt-1.3.1,1: .......... done
[150arm64-default-job-03] |   `-- Installing libXtst-1.2.5...
[150arm64-default-job-03] |   `-- Extracting libXtst-1.2.5: .......... done
[150arm64-default-job-03] |   `-- Installing xorg-fonts-truetype-7.7_1...
[150arm64-default-job-03] |   | `-- Installing dejavu-2.37_4...
[150arm64-default-job-03] |   |   `-- Installing mkfontscale-1.2.4...
[150arm64-default-job-03] |   |   | `-- Installing libfontenc-1.1.9...
[150arm64-default-job-03] |   |   | `-- Extracting libfontenc-1.1.9: ......... done
[150arm64-default-job-03] |   |   `-- Extracting mkfontscale-1.2.4: ....... done
[150arm64-default-job-03] |   | `-- Extracting dejavu-2.37_4: .......... done
[150arm64-default-job-03] |   | `-- Installing encodings-1.1.0,1...
[150arm64-default-job-03] |   | `-- Extracting encodings-1.1.0,1: .......... done
[150arm64-default-job-03] |   | `-- Installing font-bh-ttf-1.0.4...
[150arm64-default-job-03] |   | `-- Extracting font-bh-ttf-1.0.4: .......... done
[150arm64-default-job-03] |   | `-- Installing font-misc-ethiopic-1.0.5...
[150arm64-default-job-03] |   | `-- Extracting font-misc-ethiopic-1.0.5: ...... done
[150arm64-default-job-03] |   | `-- Installing font-misc-meltho-1.0.4...
[150arm64-default-job-03] |   | `-- Extracting font-misc-meltho-1.0.4: .......... done
[150arm64-default-job-03] |   `-- Extracting xorg-fonts-truetype-7.7_1: ... done
[150arm64-default-job-03] `-- Extracting openjdk25-25.0.3+9.f.1: .......... done
[150arm64-default-job-03] Extracting apache-commons-lang3-3.19.0_2: .......... done
==> Running trigger: fontconfig.ucl
Running fc-cache to build fontconfig cache...
==> Running trigger: gio-modules.ucl
Generating GIO modules cache
==> Running trigger: glib-schemas.ucl
Compiling glib schemas
No schema files found: doing nothing.
=====
Message from freetype2-2.14.3:

--
The 2.7.x series now uses the new subpixel hinting mode (V40 port's option) as
the default, emulating a modern version of ClearType. This change inevitably
leads to different rendering results, and you might change port's options to
adapt it to your taste (or use the new "FREETYPE_PROPERTIES" environment
variable).

The environment variable "FREETYPE_PROPERTIES" can be used to control the
driver properties. Example:

FREETYPE_PROPERTIES=truetype:interpreter-version=35 \
	cff:no-stem-darkening=1 \
	autofitter:warping=1

This allows to select, say, the subpixel hinting mode at runtime for a given
application.

If LONG_PCF_NAMES port's option was enabled, the PCF family names may include
the foundry and information whether they contain wide characters. For example,
"Sony Fixed" or "Misc Fixed Wide", instead of "Fixed". This can be disabled at
run time with using pcf:no-long-family-names property, if needed. Example:

FREETYPE_PROPERTIES=pcf:no-long-family-names=1

How to recreate fontconfig cache with using such environment variable,
if needed:
# env FREETYPE_PROPERTIES=pcf:no-long-family-names=1 fc-cache -fsv

The controllable properties are listed in the section "Controlling FreeType
Modules" in the reference's table of contents
(/usr/local/share/doc/freetype2/reference/index.html, if documentation was installed).
=====
Message from python312-3.12.13_3:

--
Note that some standard Python modules are provided as separate ports
as they require additional dependencies. They are available as:

py312-gdbm       databases/py-gdbm@py312
py312-sqlite3    databases/py-sqlite3@py312
py312-tkinter    x11-toolkits/py-tkinter@py312
=====
Message from openjdk25-25.0.3+9.f.1:

--
This OpenJDK implementation may require procfs(5) mounted on /proc.

If you have not done it yet, please do the following:

	mount -t procfs proc /proc

To make it permanent, you need the following lines in /etc/fstab:

	proc	/proc		procfs		rw	0	0
===>   pdftk-3.3.3_3 depends on file: /usr/local/share/java/classes/commons-lang3.jar - found
===>   Returning to build of pdftk-3.3.3_3
===>   pdftk-3.3.3_3 depends on file: /usr/local/share/java/classes/bcprov.jar - not found
===>   Installing existing package /packages/All/bouncycastle-1.83.pkg
[150arm64-default-job-03] Installing bouncycastle-1.83...
[150arm64-default-job-03] `-- Installing javamail-1.6.2_4...
[150arm64-default-job-03] `-- Extracting javamail-1.6.2_4: .......... done
[150arm64-default-job-03] Extracting bouncycastle-1.83: .......... done
=====
Message from bouncycastle-1.83:

--
===>   NOTICE:

The bouncycastle port currently does not have a maintainer. As a result, it is
more likely to have unresolved issues, not be up-to-date, or even be removed in
the future. To volunteer to maintain this port, please create an issue at:

https://bugs.freebsd.org/bugzilla

More information about port maintainership is available at:

https://docs.freebsd.org/en/articles/contributing/#ports-contributing
===>   pdftk-3.3.3_3 depends on file: /usr/local/share/java/classes/bcprov.jar - found
===>   Returning to build of pdftk-3.3.3_3
===>   pdftk-3.3.3_3 depends on file: /usr/local/openjdk25/bin/java - found
===>   pdftk-3.3.3_3 depends on file: /usr/local/bin/ant - not found
===>   Installing existing package /packages/All/apache-ant-1.10.15_2.pkg
[150arm64-default-job-03] Installing apache-ant-1.10.15_2...
[150arm64-default-job-03] Extracting apache-ant-1.10.15_2: .......... done
===>   pdftk-3.3.3_3 depends on file: /usr/local/bin/ant - found
===>   Returning to build of pdftk-3.3.3_3
===========================================================================
=======================<phase: lib-depends    >============================
===== env: USE_PACKAGE_DEPENDS_ONLY=1 USER=root UID=0 GID=0
===========================================================================
=======================<phase: configure      >============================
===== env: NO_DEPENDS=yes USER=root UID=0 GID=0
===>  Configuring for pdftk-3.3.3_3
===========================================================================
=======================<phase: build          >============================
===== env: NO_DEPENDS=yes USER=root UID=0 GID=0
===>  Building for pdftk-3.3.3_3
Buildfile: /wrkdirs/usr/ports/print/pdftk/work/pdftk-e4292c8f1bd2580a44d3cbf3570a4505bd3a74b6/build.xml
Trying to override old definition of task javac

compile:
    [mkdir] Created dir: /wrkdirs/usr/ports/print/pdftk/work/pdftk-e4292c8f1bd2580a44d3cbf3570a4505bd3a74b6/build/classes
    [javac] Compiling 211 source files to /wrkdirs/usr/ports/print/pdftk/work/pdftk-e4292c8f1bd2580a44d3cbf3570a4505bd3a74b6/build/classes
    [javac] warning: [options] bootstrap class path is not set in conjunction with -source 8
    [javac]   not setting the bootstrap class path may lead to class files that cannot run on JDK 8
    [javac]     --release 8 is recommended instead of -source 8 -target 1.8 because it sets the bootstrap class path automatically
    [javac] warning: [options] source value 8 is obsolete and will be removed in a future release
    [javac] warning: [options] target value 8 is obsolete and will be removed in a future release
    [javac] warning: [options] To suppress warnings about obsolete options, use -Xlint:-options.
    [javac] /wrkdirs/usr/ports/print/pdftk/work/pdftk-e4292c8f1bd2580a44d3cbf3570a4505bd3a74b6/java/com/gitlab/pdftk_java/com/lowagie/text/pdf/PdfPKCS7.java:228: error: cannot find symbol
    [javac]         ASN1Sequence content = (ASN1Sequence)((DERTaggedObject)signedData.getObjectAt(1)).getObject();
    [javac]                                                                                          ^
    [javac]   symbol:   method getObject()
    [javac]   location: class DERTaggedObject
    [javac] /wrkdirs/usr/ports/print/pdftk/work/pdftk-e4292c8f1bd2580a44d3cbf3570a4505bd3a74b6/java/com/gitlab/pdftk_java/com/lowagie/text/pdf/PdfPKCS7.java:261: error: cannot find symbol
    [javac]             DEROctetString rsaDataContent = (DEROctetString)((DERTaggedObject)rsaData.getObjectAt(1)).getObject();
    [javac]                                                                                                      ^
    [javac]   symbol:   method getObject()
    [javac]   location: class DERTaggedObject
    [javac] /wrkdirs/usr/ports/print/pdftk/work/pdftk-e4292c8f1bd2580a44d3cbf3570a4505bd3a74b6/java/com/gitlab/pdftk_java/com/lowagie/text/pdf/PdfPKCS7.java:297: error: cannot find symbol
    [javac]             ASN1Sequence sseq = (ASN1Sequence)tagsig.getObject();
    [javac]                                                     ^
    [javac]   symbol:   method getObject()
    [javac]   location: variable tagsig of type ASN1TaggedObject
    [javac] Note: Some input files use or override a deprecated API.
    [javac] Note: Recompile with -Xlint:deprecation for details.
    [javac] Note: Some input files use unchecked or unsafe operations.
    [javac] Note: Recompile with -Xlint:unchecked for details.
    [javac] 3 errors
    [javac] 4 warnings

BUILD FAILED
/wrkdirs/usr/ports/print/pdftk/work/pdftk-e4292c8f1bd2580a44d3cbf3570a4505bd3a74b6/build.xml:16: Compile failed; see the compiler error output for details.

Total time: 8 seconds
*** Error code 1

Stop.
make: stopped making "build" in /usr/ports/print/pdftk