[package - main-arm64-default][www/pomerium-envoy-custom] Failed for pomerium-envoy-custom-1.36.8.p1 in build

From: <pkg-fallout_at_FreeBSD.org>
Date: Tue, 07 Jul 2026 00:24:16 UTC
You are receiving this mail as a port that you maintain
is failing to build on the FreeBSD package build server.
Please investigate the failure and submit a PR to fix
build.

Maintainer:     delphij@FreeBSD.org
Log URL:        https://pkg-status.freebsd.org/ampere2/data/main-arm64-default/p4503d4fcebc4_s830f690eb67/logs/pomerium-envoy-custom-1.36.8.p1.log
Build URL:      https://pkg-status.freebsd.org/ampere2/build.html?mastername=main-arm64-default&build=p4503d4fcebc4_s830f690eb67
Log:

=>> Building www/pomerium-envoy-custom
build started at Tue Jul  7 00:00:37 UTC 2026
port directory: /usr/ports/www/pomerium-envoy-custom
package name: pomerium-envoy-custom-1.36.8.p1
building for: FreeBSD main-arm64-default-job-13 16.0-CURRENT FreeBSD 16.0-CURRENT 1600019 arm64
maintained by: delphij@FreeBSD.org
Makefile datestamp: -rw-r--r--  1 root wheel 71017 Jul  4 01:02 /usr/ports/www/pomerium-envoy-custom/Makefile
Ports top last git commit: 4503d4fcebc45912c083a9b07c2753e55137f07d
Ports top unclean checkout: no
Port dir last git commit: 37d4040848fb47d7cd2c4f593f499b2cfdce4d55
Port dir unclean checkout: no
Poudriere version: poudriere-git-3.4.8
Host OSVERSION: 1600018
Jail OSVERSION: 1600019
Job Id: 13




!!! Jail is newer than host. (Jail: 1600019, Host: 1600018) !!!
!!! This is not supported. !!!
!!! Host kernel must be same or newer than jail. !!!
!!! Expect build failures. !!!



---Begin Environment---
SHELL=/bin/sh
OSVERSION=1600019
UNAME_v=FreeBSD 16.0-CURRENT 1600019
UNAME_r=16.0-CURRENT
BLOCKSIZE=K
MAIL=/var/mail/root
MM_CHARSET=UTF-8
LANG=C.UTF-8
STATUS=1
HOME=/root
PATH=/sbin:/bin:/usr/sbin:/usr/bin:/usr/local/sbin:/usr/local/bin:/root/bin
MAKE_OBJDIR_CHECK_WRITABLE=0
LOCALBASE=/usr/local
USER=root
POUDRIERE_NAME=poudriere-git
LIBEXECPREFIX=/usr/local/libexec/poudriere
POUDRIERE_VERSION=3.4.8
MASTERMNT=/usr/local/poudriere/data/.m/main-arm64-default/ref
LC_COLLATE=C
POUDRIERE_BUILD_TYPE=bulk
PACKAGE_BUILDING=yes
SAVED_TERM=
OUTPUT_REDIRECTED_STDERR=4
OUTPUT_REDIRECTED=1
PWD=/usr/local/poudriere/data/.m/main-arm64-default/13/.p
OUTPUT_REDIRECTED_STDOUT=3
P_PORTS_FEATURES=FLAVORS SUBPACKAGES SELECTED_OPTIONS
MASTERNAME=main-arm64-default
SCRIPTPREFIX=/usr/local/share/poudriere
SCRIPTNAME=bulk.sh
OLDPWD=/usr/local/poudriere/data/.m/main-arm64-default/ref/.p/pool
POUDRIERE_PKGNAME=poudriere-git-3.4.8
SCRIPTPATH=/usr/local/share/poudriere/bulk.sh
POUDRIEREPATH=/usr/local/bin/poudriere
---End Environment---

---Begin Poudriere Port Flags/Env---
PORT_FLAGS=
PKGENV=
FLAVOR=
MAKE_ARGS=
---End Poudriere Port Flags/Env---

---Begin OPTIONS List---
---End OPTIONS List---

--MAINTAINER--
delphij@FreeBSD.org
--End MAINTAINER--

--CONFIGURE_ARGS--

--End CONFIGURE_ARGS--

--CONFIGURE_ENV--
MAKE=/usr/local/bin/gmake PYTHON="/usr/local/bin/python3.12" XDG_DATA_HOME=/wrkdirs/usr/ports/www/pomerium-envoy-custom/work  XDG_CONFIG_HOME=/wrkdirs/usr/ports/www/pomerium-envoy-custom/work  XDG_CACHE_HOME=/wrkdirs/usr/ports/www/pomerium-envoy-custom/work/.cache  HOME=/wrkdirs/usr/ports/www/pomerium-envoy-custom/work TMPDIR="/tmp" PATH=/wrkdirs/usr/ports/www/pomerium-envoy-custom/work/.bin:/sbin:/bin:/usr/sbin:/usr/bin:/usr/local/sbin:/usr/local/bin:/root/bin PKG_CONFIG_LIBDIR=/wrkdirs/usr/ports/www/pomerium-envoy-custom/work/.pkgconfig:/usr/local/libdata/pkgconfig:/usr/local/share/pkgconfig:/usr/libdata/pkgconfig SHELL=/bin/sh CONFIG_SHELL=/bin/sh
--End CONFIGURE_ENV--

--MAKE_ENV--
NINJA_STATUS="[%p %s/%t] " XDG_DATA_HOME=/wrkdirs/usr/ports/www/pomerium-envoy-custom/work  XDG_CONFIG_HOME=/wrkdirs/usr/ports/www/pomerium-envoy-custom/work  XDG_CACHE_HOME=/wrkdirs/usr/ports/www/pomerium-envoy-custom/work/.cache  HOME=/wrkdirs/usr/ports/www/pomerium-envoy-custom/work TMPDIR="/tmp" PATH=/wrkdirs/usr/ports/www/pomerium-envoy-custom/work/.bin:/sbin:/bin:/usr/sbin:/usr/bin:/usr/local/sbin:/usr/local/bin:/root/bin PKG_CONFIG_LIBDIR=/wrkdirs/usr/ports/www/pomerium-envoy-custom/work/.pkgconfig:/usr/local/libdata/pkgconfig:/usr/local/share/pkgconfig:/usr/libdata/pkgconfig MK_DEBUG_FILES=no MK_KERNEL_SYMBOLS=no SHELL=/bin/sh NO_LINT=YES PREFIX=/usr/local  LOCALBASE=/usr/local  CC="cc" CFLAGS="-O2 -pipe  -fstack-protector-strong -fno-strict-aliasing "  CPP="cpp" CPPFLAGS=""  LDFLAGS=" " LIBS=""  CXX="c++" CXXFLAGS="-O2 -pipe -fstack-protector-strong -fno-strict-aliasing   " BSD_INSTALL_PROGRAM="install  -s -m 555"  BSD_INSTALL_LIB="install  -s -m 0644"  BSD_INSTALL_
SCRIPT="install  -m 555"  BSD_INSTALL_DATA="install  -m 0644"  BSD_INSTALL_MAN="install  -m 444"
--End MAKE_ENV--

--PLIST_SUB--
JAVASHAREDIR="share/java"  JAVAJARDIR="share/java/classes" PYTHON_INCLUDEDIR=include/python3.12  PYTHON_LIBDIR=lib/python3.12  PYTHON_PLATFORM=freebsd16  PYTHON_SITELIBDIR=lib/python3.12/site-packages  PYTHON_SUFFIX=312  PYTHON_BASESUFFIX=312  PYTHON_TAG=.cpython-312  PYTHON_SOABI=.cpython-312  PYTHON_VER=3.12  PYTHON_BASEVER=3.12  PYTHON_VERSION=python3.12 PYTHON2="@comment " PYTHON3="" OSREL=16.0 PREFIX=%D LOCALBASE=/usr/local  RESETPREFIX=/usr/local LIB32DIR=lib DOCSDIR="share/doc/pomerium-envoy-custom"  EXAMPLESDIR="share/examples/pomerium-envoy-custom"  DATADIR="share/pomerium-envoy-custom"  WWWDIR="www/pomerium-envoy-custom"  ETCDIR="etc/pomerium-envoy-custom"
--End PLIST_SUB--

--SUB_LIST--
WRKSRC=/wrkdirs/usr/ports/www/pomerium-envoy-custom/work/envoy-custom-1.36.8-p1  PYTHON_CMD=/usr/local/bin/python3.12 JAVASHAREDIR="/usr/local/share/java"  JAVAJARDIR="/usr/local/share/java/classes"  JAVALIBDIR="/usr/local/share/java/classes" JAVA_VERSION="21" PYTHON_INCLUDEDIR=/usr/local/include/python3.12  PYTHON_LIBDIR=/usr/local/lib/python3.12  PYTHON_PLATFORM=freebsd16  PYTHON_SITELIBDIR=/usr/local/lib/python3.12/site-packages  PYTHON_SUFFIX=312  PYTHON_BASESUFFIX=312  PYTHON_TAG=.cpython-312  PYTHON_SOABI=.cpython-312  PYTHON_VER=3.12  PYTHON_BASEVER=3.12  PYTHON_VERSION=python3.12 PYTHON2="@comment " PYTHON3="" PREFIX=/usr/local LOCALBASE=/usr/local  DATADIR=/usr/local/share/pomerium-envoy-custom DOCSDIR=/usr/local/share/doc/pomerium-envoy-custom EXAMPLESDIR=/usr/local/share/examples/pomerium-envoy-custom  WWWDIR=/usr/local/www/pomerium-envoy-custom ETCDIR=/usr/local/etc/pomerium-envoy-custom
--End SUB_LIST--

---Begin make.conf---
USE_PACKAGE_DEPENDS=yes
BATCH=yes
WRKDIRPREFIX=/wrkdirs
PORTSDIR=/usr/ports
PACKAGES=/packages
DISTDIR=/distfiles
PACKAGE_BUILDING=yes
PACKAGE_BUILDING_FLAVORS=yes
####  ####
# XXX: We really need this but cannot use it while 'make checksum' does not
# try the next mirror on checksum failure.  It currently retries the same
# failed mirror and then fails rather then trying another.  It *does*
# try the next if the size is mismatched though.
#MASTER_SITE_FREEBSD=yes
# Build ALLOW_MAKE_JOBS_PACKAGES with 3 jobs
MAKE_JOBS_NUMBER=3
#### Misc Poudriere ####
.include "/etc/make.conf.ports_env"
GID=0
UID=0
---End make.conf---
--Resource limits--
cpu time               (seconds, -t)  unlimited
file size           (512-blocks, -f)  unlimited
data seg size           (kbytes, -d)  1048576
stack size              (kbytes, -s)  1048576
core file size      (512-blocks, -c)  unlimited
max memory size         (kbytes, -m)  unlimited
locked memory           (kbytes, -l)  unlimited
max user processes              (-u)  89999
open files                      (-n)  8192
virtual mem size        (kbytes, -v)  unlimited
swap limit              (kbytes, -w)  unlimited
socket buffer size       (bytes, -b)  unlimited
pseudo-terminals                (-p)  unlimited
kqueues                         (-k)  unlimited
umtx shared locks               (-o)  unlimited
pipebuf                 (kbytes, -y)  unlimited
virtual machines                (-V)  unlimited
--End resource limits--
=======================<phase: check-sanity   >============================
===== env: NO_DEPENDS=yes USER=root UID=0 GID=0
===>  License APACHE20 accepted by the user
===========================================================================
=======================<phase: pkg-depends    >============================
===== env: USE_PACKAGE_DEPENDS_ONLY=1 USER=root UID=0 GID=0
===>   pomerium-envoy-custom-1.36.8.p1 depends on file: /usr/local/sbin/pkg - not found
===>   Installing existing package /packages/All/pkg-2.7.5.pkg
[main-arm64-default-job-13] Installing pkg-2.7.5...
[main-arm64-default-job-13] Extracting pkg-2.7.5: .......... done
===>   pomerium-envoy-custom-1.36.8.p1 depends on file: /usr/local/sbin/pkg - found
===>   Returning to build of pomerium-envoy-custom-1.36.8.p1
===========================================================================
=======================<phase: fetch-depends  >============================
===== env: USE_PACKAGE_DEPENDS_ONLY=1 USER=root UID=0 GID=0
===========================================================================
=======================<phase: fetch          >============================
===== env: NO_DEPENDS=yes USER=root UID=0 GID=0
===>  License APACHE20 accepted by the user
=> ee7784f95f506e2a606ae668f0d9f70f9d26af83.zip doesn't seem to exist in /portdistfiles/pomerium-envoy-custom.
=> Attempting to fetch https://github.com/envoyproxy/envoy/archive/ee7784f95f506e2a606ae668f0d9f70f9d26af83.zip
fetch: https://github.com/envoyproxy/envoy/archive/ee7784f95f506e2a606ae668f0d9f70f9d26af83.zip: size unknown
fetch: https://github.com/envoyproxy/envoy/archive/ee7784f95f506e2a606ae668f0d9f70f9d26af83.zip: size of remote file is not known
ee7784f95f506e2a606ae668f0d9f70f9d26af83.zip            39 MB   12 MBps    03s
=> V_10_2_P1.zip doesn't seem to exist in /portdistfiles/pomerium-envoy-custom.
=> Attempting to fetch https://github.com/openssh/openssh-portable/archive/V_10_2_P1.zip
fetch: https://github.com/openssh/openssh-portable/archive/V_10_2_P1.zip: size unknown
fetch: https://github.com/openssh/openssh-portable/archive/V_10_2_P1.zip: size of remote file is not known
V_10_2_P1.zip                                         2389 kB 9899 kBps    01s
=> a413fcc9c46a020a746907136a384c227f3cd095.zip doesn't seem to exist in /portdistfiles/pomerium-envoy-custom.
=> Attempting to fetch https://github.com/Neargye/magic_enum/archive/a413fcc9c46a020a746907136a384c227f3cd095.zip
fetch: https://github.com/Neargye/magic_enum/archive/a413fcc9c46a020a746907136a384c227f3cd095.zip: size unknown
fetch: https://github.com/Neargye/magic_enum/archive/a413fcc9c46a020a746907136a384c227f3cd095.zip: size of remote file is not known
a413fcc9c46a020a746907136a384c227f3cd095.zip           239 kB 6930 kBps    00s
=> v1.0.7.zip doesn't seem to exist in /portdistfiles/pomerium-envoy-custom.
=> Attempting to fetch https://github.com/cameron314/readerwriterqueue/archive/v1.0.7.zip
fetch: https://github.com/cameron314/readerwriterqueue/archive/v1.0.7.zip: size unknown
fetch: https://github.com/cameron314/readerwriterqueue/archive/v1.0.7.zip: size of remote file is not known
v1.0.7.zip                                              69 kB 4500 kBps    00s
=> bazel-skylib-1.7.1.tar.gz doesn't seem to exist in /portdistfiles/pomerium-envoy-custom.
=> Attempting to fetch https://github.com/bazelbuild/bazel-skylib/releases/download/1.7.1/bazel-skylib-1.7.1.tar.gz
bazel-skylib-1.7.1.tar.gz                               42 kB   47 MBps    00s
=> v1.0.4.zip doesn't seem to exist in /portdistfiles/pomerium-envoy-custom.
=> Attempting to fetch https://github.com/bufbuild/protoc-gen-validate/archive/refs/tags/v1.0.4.zip
fetch: https://github.com/bufbuild/protoc-gen-validate/archive/refs/tags/v1.0.4.zip: size unknown
fetch: https://github.com/bufbuild/protoc-gen-validate/archive/refs/tags/v1.0.4.zip: size of remote file is not known
v1.0.4.zip                                             287 kB 6446 kBps    00s
=> rules_jvm_external-6.1.tar.gz doesn't seem to exist in /portdistfiles/pomerium-envoy-custom.
=> Attempting to fetch https://github.com/bazelbuild/rules_jvm_external/releases/download/6.1/rules_jvm_external-6.1.tar.gz
rules_jvm_external-6.1.tar.gz                         4601 kB   53 MBps    00s
=> 114a745b2841a044e98cdbb19358ed29fcf4a5f1.tar.gz doesn't seem to exist in /portdistfiles/pomerium-envoy-custom.
=> Attempting to fetch https://github.com/googleapis/googleapis/archive/114a745b2841a044e98cdbb19358ed29fcf4a5f1.tar.gz
fetch: https://github.com/googleapis/googleapis/archive/114a745b2841a044e98cdbb19358ed29fcf4a5f1.tar.gz: size unknown
fetch: https://github.com/googleapis/googleapis/archive/114a745b2841a044e98cdbb19358ed29fcf4a5f1.tar.gz: size of remote file is not known
114a745b2841a044e98cdbb19358ed29fcf4a5f1.tar.gz        6621 kB 6071 kBps    01s
=> v0.4.1.tar.gz doesn't seem to exist in /portdistfiles/pomerium-envoy-custom.
=> Attempting to fetch https://github.com/census-instrumentation/opencensus-proto/archive/v0.4.1.tar.gz
fetch: https://github.com/census-instrumentation/opencensus-proto/archive/v0.4.1.tar.gz: size unknown
fetch: https://github.com/census-instrumentation/opencensus-proto/archive/v0.4.1.tar.gz: size of remote file is not known
v0.4.1.tar.gz                                          160 kB 7033 kBps    00s
=> v0.6.1.tar.gz doesn't seem to exist in /portdistfiles/pomerium-envoy-custom.
<snip>
[2,703 / 8,254] Foreign Cc - Configure: Building gperftools_build; 630s processwrapper-sandbox ... (31 actions running)
[2,709 / 8,254] Foreign Cc - Configure: Building gperftools_build; 631s processwrapper-sandbox ... (32 actions, 31 running)
[2,710 / 8,254] Foreign Cc - Configure: Building gperftools_build; 638s processwrapper-sandbox ... (31 actions, 30 running)
[2,710 / 8,254] Foreign Cc - Configure: Building gperftools_build; 639s processwrapper-sandbox ... (31 actions running)
[2,711 / 8,254] Foreign Cc - Configure: Building gperftools_build; 641s processwrapper-sandbox ... (31 actions, 30 running)
[2,714 / 8,254] Foreign Cc - Configure: Building gperftools_build; 642s processwrapper-sandbox ... (32 actions, 31 running)
[2,715 / 8,254] Foreign Cc - Configure: Building gperftools_build; 644s processwrapper-sandbox ... (31 actions, 30 running)
[2,715 / 8,254] Foreign Cc - Configure: Building gperftools_build; 645s processwrapper-sandbox ... (31 actions running)
[2,718 / 8,254] Foreign Cc - Configure: Building gperftools_build; 647s processwrapper-sandbox ... (31 actions, 30 running)
[2,718 / 8,254] Foreign Cc - Configure: Building gperftools_build; 648s processwrapper-sandbox ... (32 actions, 31 running)
[2,720 / 8,254] Foreign Cc - Configure: Building gperftools_build; 649s processwrapper-sandbox ... (32 actions, 31 running)
[2,721 / 8,254] Foreign Cc - Configure: Building gperftools_build; 651s processwrapper-sandbox ... (32 actions, 31 running)
[2,722 / 8,254] Foreign Cc - Configure: Building gperftools_build; 652s processwrapper-sandbox ... (32 actions, 31 running)
[2,723 / 8,254] Foreign Cc - Configure: Building gperftools_build; 654s processwrapper-sandbox ... (31 actions, 30 running)
[2,723 / 8,254] Foreign Cc - Configure: Building gperftools_build; 655s processwrapper-sandbox ... (32 actions, 31 running)
[2,724 / 8,254] Foreign Cc - Configure: Building gperftools_build; 659s processwrapper-sandbox ... (31 actions, 30 running)
[2,725 / 8,254] Foreign Cc - Configure: Building gperftools_build; 660s processwrapper-sandbox ... (31 actions, 30 running)
[2,726 / 8,254] Foreign Cc - Configure: Building gperftools_build; 661s processwrapper-sandbox ... (31 actions, 30 running)
[2,726 / 8,254] Foreign Cc - Configure: Building gperftools_build; 662s processwrapper-sandbox ... (32 actions, 31 running)
[2,727 / 8,254] Foreign Cc - Configure: Building gperftools_build; 664s processwrapper-sandbox ... (32 actions, 31 running)
[2,728 / 8,254] Foreign Cc - Configure: Building gperftools_build; 666s processwrapper-sandbox ... (31 actions, 30 running)
[2,728 / 8,254] Foreign Cc - Configure: Building gperftools_build; 667s processwrapper-sandbox ... (31 actions running)
[2,729 / 8,254] Foreign Cc - Configure: Building gperftools_build; 669s processwrapper-sandbox ... (31 actions, 30 running)
[2,731 / 8,254] Foreign Cc - Configure: Building gperftools_build; 670s processwrapper-sandbox ... (31 actions, 30 running)
[2,731 / 8,254] Foreign Cc - Configure: Building gperftools_build; 671s processwrapper-sandbox ... (31 actions running)
[2,733 / 8,254] Foreign Cc - Configure: Building gperftools_build; 672s processwrapper-sandbox ... (32 actions, 31 running)
[2,734 / 8,254] Foreign Cc - Configure: Building gperftools_build; 674s processwrapper-sandbox ... (31 actions, 30 running)
[2,734 / 8,254] Foreign Cc - Configure: Building gperftools_build; 675s processwrapper-sandbox ... (32 actions, 31 running)
[2,735 / 8,254] Foreign Cc - Configure: Building gperftools_build; 676s processwrapper-sandbox ... (32 actions, 31 running)
[2,736 / 8,254] Foreign Cc - Configure: Building gperftools_build; 683s processwrapper-sandbox ... (31 actions, 30 running)
[2,739 / 8,254] Foreign Cc - Configure: Building gperftools_build; 685s processwrapper-sandbox ... (32 actions, 31 running)
[2,740 / 8,254] Foreign Cc - Configure: Building gperftools_build; 689s processwrapper-sandbox ... (31 actions, 30 running)
[2,742 / 8,254] Foreign Cc - Configure: Building gperftools_build; 690s processwrapper-sandbox ... (32 actions, 31 running)
[2,747 / 8,254] Foreign Cc - Configure: Building gperftools_build; 691s processwrapper-sandbox ... (31 actions running)
[2,748 / 8,254] Foreign Cc - Configure: Building gperftools_build; 696s processwrapper-sandbox ... (31 actions, 30 running)
[2,749 / 8,254] Foreign Cc - Configure: Building gperftools_build; 697s processwrapper-sandbox ... (32 actions, 31 running)
[2,751 / 8,254] Foreign Cc - Configure: Building gperftools_build; 698s processwrapper-sandbox ... (31 actions running)
[2,752 / 8,254] Foreign Cc - Configure: Building gperftools_build; 700s processwrapper-sandbox ... (31 actions, 30 running)
[2,754 / 8,254] Foreign Cc - Configure: Building gperftools_build; 701s processwrapper-sandbox ... (32 actions, 31 running)
[2,755 / 8,254] Foreign Cc - Configure: Building gperftools_build; 702s processwrapper-sandbox ... (31 actions running)
[2,756 / 8,254] Foreign Cc - Configure: Building gperftools_build; 707s processwrapper-sandbox ... (31 actions, 30 running)
[2,758 / 8,254] Foreign Cc - Configure: Building gperftools_build; 708s processwrapper-sandbox ... (32 actions, 31 running)
[2,759 / 8,254] Foreign Cc - Configure: Building gperftools_build; 709s processwrapper-sandbox ... (31 actions running)
[2,762 / 8,254] Foreign Cc - Configure: Building gperftools_build; 711s processwrapper-sandbox ... (31 actions running)
[2,763 / 8,254] Foreign Cc - Configure: Building gperftools_build; 720s processwrapper-sandbox ... (31 actions, 30 running)
[2,765 / 8,254] Foreign Cc - Configure: Building gperftools_build; 721s processwrapper-sandbox ... (32 actions, 31 running)
[2,766 / 8,254] Foreign Cc - Configure: Building gperftools_build; 724s processwrapper-sandbox ... (31 actions, 30 running)
[2,766 / 8,254] Foreign Cc - Configure: Building gperftools_build; 725s processwrapper-sandbox ... (32 actions, 31 running)
[2,767 / 8,254] Foreign Cc - Configure: Building gperftools_build; 728s processwrapper-sandbox ... (31 actions, 30 running)
[2,768 / 8,254] Foreign Cc - Configure: Building gperftools_build; 729s processwrapper-sandbox ... (31 actions, 30 running)
[2,768 / 8,254] Foreign Cc - Configure: Building gperftools_build; 730s processwrapper-sandbox ... (32 actions, 31 running)
[2,769 / 8,254] Foreign Cc - Configure: Building gperftools_build; 732s processwrapper-sandbox ... (31 actions, 30 running)
[2,769 / 8,254] Foreign Cc - Configure: Building gperftools_build; 733s processwrapper-sandbox ... (32 actions, 31 running)
[2,770 / 8,254] Foreign Cc - Configure: Building gperftools_build; 735s processwrapper-sandbox ... (31 actions, 30 running)
[2,772 / 8,254] Foreign Cc - Configure: Building gperftools_build; 736s processwrapper-sandbox ... (31 actions, 30 running)
[2,774 / 8,254] Foreign Cc - Configure: Building gperftools_build; 737s processwrapper-sandbox ... (32 actions, 31 running)
[2,775 / 8,254] Foreign Cc - Configure: Building gperftools_build; 739s processwrapper-sandbox ... (31 actions, 30 running)
[2,776 / 8,254] Foreign Cc - Configure: Building gperftools_build; 740s processwrapper-sandbox ... (32 actions, 31 running)
[2,777 / 8,254] Foreign Cc - Configure: Building gperftools_build; 742s processwrapper-sandbox ... (31 actions, 30 running)
[2,777 / 8,254] Foreign Cc - Configure: Building gperftools_build; 743s processwrapper-sandbox ... (31 actions running)
[2,780 / 8,254] Foreign Cc - Configure: Building gperftools_build; 744s processwrapper-sandbox ... (31 actions, 30 running)
[2,781 / 8,254] Foreign Cc - Configure: Building gperftools_build; 746s processwrapper-sandbox ... (32 actions, 31 running)
[2,783 / 8,254] Foreign Cc - Configure: Building gperftools_build; 747s processwrapper-sandbox ... (32 actions, 31 running)
[2,784 / 8,254] Foreign Cc - Configure: Building gperftools_build; 749s processwrapper-sandbox ... (31 actions, 30 running)
[2,784 / 8,254] Foreign Cc - Configure: Building gperftools_build; 750s processwrapper-sandbox ... (31 actions running)
[2,785 / 8,254] Foreign Cc - Configure: Building gperftools_build; 755s processwrapper-sandbox ... (31 actions, 30 running)
[2,788 / 8,254] Foreign Cc - Configure: Building gperftools_build; 756s processwrapper-sandbox ... (32 actions, 31 running)
[2,789 / 8,254] Foreign Cc - Configure: Building gperftools_build; 758s processwrapper-sandbox ... (32 actions, 31 running)
[2,790 / 8,254] Foreign Cc - Configure: Building gperftools_build; 759s processwrapper-sandbox ... (31 actions running)
[2,791 / 8,254] Foreign Cc - Configure: Building gperftools_build; 766s processwrapper-sandbox ... (31 actions, 30 running)
[2,794 / 8,254] Foreign Cc - Configure: Building gperftools_build; 767s processwrapper-sandbox ... (32 actions, 31 running)
[2,796 / 8,254] Foreign Cc - Configure: Building gperftools_build; 769s processwrapper-sandbox ... (31 actions, 30 running)
[2,797 / 8,254] Foreign Cc - Configure: Building gperftools_build; 770s processwrapper-sandbox ... (32 actions, 31 running)
[2,798 / 8,254] Foreign Cc - Configure: Building gperftools_build; 775s processwrapper-sandbox ... (31 actions, 30 running)
[2,798 / 8,254] Foreign Cc - Configure: Building gperftools_build; 776s processwrapper-sandbox ... (32 actions, 31 running)
[2,799 / 8,254] Foreign Cc - Configure: Building gperftools_build; 778s processwrapper-sandbox ... (31 actions, 30 running)
[2,799 / 8,254] Foreign Cc - Configure: Building gperftools_build; 779s processwrapper-sandbox ... (32 actions, 31 running)
[2,800 / 8,254] Foreign Cc - Configure: Building gperftools_build; 780s processwrapper-sandbox ... (32 actions, 31 running)
[2,801 / 8,254] Foreign Cc - Configure: Building gperftools_build; 782s processwrapper-sandbox ... (32 actions, 31 running)
[2,802 / 8,254] Foreign Cc - Configure: Building gperftools_build; 783s processwrapper-sandbox ... (32 actions, 31 running)
[2,803 / 8,254] Foreign Cc - Configure: Building gperftools_build; 785s processwrapper-sandbox ... (31 actions, 30 running)
[2,803 / 8,254] Foreign Cc - Configure: Building gperftools_build; 786s processwrapper-sandbox ... (32 actions, 31 running)
[2,804 / 8,254] Foreign Cc - Configure: Building gperftools_build; 788s processwrapper-sandbox ... (31 actions, 30 running)
[2,804 / 8,254] Foreign Cc - Configure: Building gperftools_build; 789s processwrapper-sandbox ... (32 actions, 31 running)
[2,807 / 8,254] Foreign Cc - Configure: Building gperftools_build; 791s processwrapper-sandbox ... (31 actions, 30 running)
[2,807 / 8,254] Foreign Cc - Configure: Building gperftools_build; 792s processwrapper-sandbox ... (32 actions, 31 running)
[2,808 / 8,254] Foreign Cc - Configure: Building gperftools_build; 800s processwrapper-sandbox ... (31 actions, 30 running)
[2,810 / 8,254] Foreign Cc - Configure: Building gperftools_build; 801s processwrapper-sandbox ... (31 actions, 30 running)
[2,810 / 8,254] Foreign Cc - Configure: Building gperftools_build; 802s processwrapper-sandbox ... (31 actions running)
[2,811 / 8,254] Foreign Cc - Configure: Building gperftools_build; 805s processwrapper-sandbox ... (31 actions, 30 running)
[2,813 / 8,254] Foreign Cc - Configure: Building gperftools_build; 806s processwrapper-sandbox ... (31 actions running)
[2,815 / 8,254] Foreign Cc - Configure: Building gperftools_build; 808s processwrapper-sandbox ... (32 actions, 31 running)
[2,816 / 8,254] Foreign Cc - Configure: Building gperftools_build; 810s processwrapper-sandbox ... (32 actions, 31 running)
[2,818 / 8,254] Foreign Cc - Configure: Building gperftools_build; 812s processwrapper-sandbox ... (32 actions, 31 running)
[2,819 / 8,254] Foreign Cc - Configure: Building gperftools_build; 814s processwrapper-sandbox ... (31 actions running)
[2,821 / 8,254] Foreign Cc - Configure: Building gperftools_build; 815s processwrapper-sandbox ... (32 actions, 31 running)
[2,822 / 8,254] Foreign Cc - Configure: Building gperftools_build; 818s processwrapper-sandbox ... (31 actions, 30 running)
[2,822 / 8,254] Foreign Cc - Configure: Building gperftools_build; 819s processwrapper-sandbox ... (32 actions, 31 running)
[2,823 / 8,254] Foreign Cc - Configure: Building gperftools_build; 820s processwrapper-sandbox ... (32 actions, 31 running)
[2,824 / 8,254] Foreign Cc - Configure: Building gperftools_build; 822s processwrapper-sandbox ... (32 actions, 31 running)
[2,825 / 8,254] Foreign Cc - Configure: Building gperftools_build; 826s processwrapper-sandbox ... (31 actions, 30 running)
[2,827 / 8,254] Foreign Cc - Configure: Building gperftools_build; 827s processwrapper-sandbox ... (31 actions, 30 running)
[2,828 / 8,254] Foreign Cc - Configure: Building gperftools_build; 828s processwrapper-sandbox ... (32 actions, 31 running)
[2,829 / 8,254] Foreign Cc - Configure: Building gperftools_build; 831s processwrapper-sandbox ... (31 actions, 30 running)
[2,830 / 8,254] Foreign Cc - Configure: Building gperftools_build; 832s processwrapper-sandbox ... (31 actions, 30 running)
[2,830 / 8,254] Foreign Cc - Configure: Building gperftools_build; 833s processwrapper-sandbox ... (31 actions running)
[2,831 / 8,254] Foreign Cc - Configure: Building gperftools_build; 837s processwrapper-sandbox ... (31 actions, 30 running)
[2,832 / 8,254] Foreign Cc - Configure: Building gperftools_build; 838s processwrapper-sandbox ... (32 actions, 31 running)
[2,833 / 8,254] Foreign Cc - Configure: Building gperftools_build; 839s processwrapper-sandbox ... (31 actions running)
[2,834 / 8,254] Foreign Cc - Configure: Building gperftools_build; 842s processwrapper-sandbox ... (31 actions, 30 running)
[2,836 / 8,254] Foreign Cc - Configure: Building gperftools_build; 844s processwrapper-sandbox ... (31 actions, 30 running)
[2,837 / 8,254] Foreign Cc - Configure: Building gperftools_build; 845s processwrapper-sandbox ... (32 actions, 31 running)
[2,838 / 8,254] Foreign Cc - Configure: Building gperftools_build; 848s processwrapper-sandbox ... (31 actions, 30 running)
[2,838 / 8,254] Foreign Cc - Configure: Building gperftools_build; 849s processwrapper-sandbox ... (32 actions, 31 running)
[2,841 / 8,254] Foreign Cc - Configure: Building gperftools_build; 851s processwrapper-sandbox ... (32 actions, 31 running)
[2,842 / 8,254] Foreign Cc - Configure: Building gperftools_build; 854s processwrapper-sandbox ... (31 actions, 30 running)
[2,842 / 8,254] Foreign Cc - Configure: Building gperftools_build; 855s processwrapper-sandbox ... (31 actions running)
[2,843 / 8,254] Foreign Cc - Configure: Building gperftools_build; 857s processwrapper-sandbox ... (31 actions, 30 running)
[2,844 / 8,254] Foreign Cc - Configure: Building gperftools_build; 858s processwrapper-sandbox ... (32 actions, 31 running)
[2,845 / 8,254] Foreign Cc - Configure: Building gperftools_build; 863s processwrapper-sandbox ... (31 actions, 30 running)
[2,845 / 8,254] Foreign Cc - Configure: Building gperftools_build; 864s processwrapper-sandbox ... (31 actions running)
[2,847 / 8,254] Foreign Cc - Configure: Building gperftools_build; 865s processwrapper-sandbox ... (32 actions, 31 running)
[2,848 / 8,254] Foreign Cc - Configure: Building gperftools_build; 867s processwrapper-sandbox ... (31 actions, 30 running)
[2,848 / 8,254] Foreign Cc - Configure: Building gperftools_build; 868s processwrapper-sandbox ... (31 actions running)
[2,849 / 8,254] Foreign Cc - Configure: Building gperftools_build; 870s processwrapper-sandbox ... (31 actions, 30 running)
[2,851 / 8,254] Foreign Cc - Configure: Building gperftools_build; 871s processwrapper-sandbox ... (32 actions, 31 running)
[2,852 / 8,254] Foreign Cc - Configure: Building gperftools_build; 873s processwrapper-sandbox ... (31 actions, 30 running)
[2,852 / 8,254] Foreign Cc - Configure: Building gperftools_build; 874s processwrapper-sandbox ... (31 actions running)
[2,853 / 8,254] Foreign Cc - Configure: Building gperftools_build; 879s processwrapper-sandbox ... (31 actions, 30 running)
[2,854 / 8,254] Foreign Cc - Configure: Building gperftools_build; 880s processwrapper-sandbox ... (32 actions, 31 running)
[2,855 / 8,254] Foreign Cc - Configure: Building gperftools_build; 882s processwrapper-sandbox ... (31 actions, 30 running)
[2,856 / 8,254] Foreign Cc - Configure: Building gperftools_build; 883s processwrapper-sandbox ... (32 actions, 31 running)
[2,857 / 8,254] Foreign Cc - Configure: Building gperftools_build; 884s processwrapper-sandbox ... (32 actions, 31 running)
[2,859 / 8,254] Foreign Cc - Configure: Building gperftools_build; 886s processwrapper-sandbox ... (31 actions, 30 running)
[2,859 / 8,254] Foreign Cc - Configure: Building gperftools_build; 887s processwrapper-sandbox ... (32 actions, 31 running)
[2,860 / 8,254] Foreign Cc - Configure: Building gperftools_build; 891s processwrapper-sandbox ... (31 actions, 30 running)
[2,861 / 8,254] Foreign Cc - Configure: Building gperftools_build; 892s processwrapper-sandbox ... (31 actions, 30 running)
[2,863 / 8,254] Foreign Cc - Configure: Building gperftools_build; 893s processwrapper-sandbox ... (31 actions, 30 running)
[2,864 / 8,254] Foreign Cc - Configure: Building gperftools_build; 894s processwrapper-sandbox ... (32 actions, 31 running)
[2,865 / 8,254] Foreign Cc - Configure: Building gperftools_build; 901s processwrapper-sandbox ... (31 actions, 30 running)
[2,865 / 8,254] Foreign Cc - Configure: Building gperftools_build; 902s processwrapper-sandbox ... (32 actions, 31 running)
[2,866 / 8,254] Foreign Cc - Configure: Building gperftools_build; 904s processwrapper-sandbox ... (31 actions, 30 running)
[2,866 / 8,254] Foreign Cc - Configure: Building gperftools_build; 905s processwrapper-sandbox ... (32 actions, 31 running)
[2,867 / 8,254] Foreign Cc - Configure: Building gperftools_build; 907s processwrapper-sandbox ... (31 actions, 30 running)
[2,868 / 8,254] Foreign Cc - Configure: Building gperftools_build; 908s processwrapper-sandbox ... (31 actions, 30 running)
[2,869 / 8,254] Foreign Cc - Configure: Building gperftools_build; 909s processwrapper-sandbox ... (30 actions running)
[2,870 / 8,254] Foreign Cc - Configure: Building gperftools_build; 911s processwrapper-sandbox ... (29 actions running)
[2,872 / 8,254] Foreign Cc - Configure: Building gperftools_build; 918s processwrapper-sandbox ... (27 actions running)
[2,873 / 8,254] Foreign Cc - Configure: Building gperftools_build; 919s processwrapper-sandbox ... (26 actions running)
[2,874 / 8,254] Foreign Cc - Configure: Building gperftools_build; 921s processwrapper-sandbox ... (25 actions running)
[2,875 / 8,254] Foreign Cc - Configure: Building gperftools_build; 923s processwrapper-sandbox ... (24 actions running)
[2,876 / 8,254] Foreign Cc - Configure: Building gperftools_build; 925s processwrapper-sandbox ... (23 actions running)
[2,878 / 8,254] Foreign Cc - Configure: Building gperftools_build; 929s processwrapper-sandbox ... (22 actions, 21 running)
[2,880 / 8,254] Foreign Cc - Configure: Building gperftools_build; 930s processwrapper-sandbox ... (20 actions running)
[2,882 / 8,254] Foreign Cc - Configure: Building gperftools_build; 936s processwrapper-sandbox ... (19 actions, 18 running)
[2,883 / 8,254] Foreign Cc - Configure: Building gperftools_build; 937s processwrapper-sandbox ... (18 actions running)
[2,884 / 8,254] Foreign Cc - Configure: Building gperftools_build; 938s processwrapper-sandbox ... (18 actions, 17 running)
[2,886 / 8,254] Foreign Cc - Configure: Building gperftools_build; 940s processwrapper-sandbox ... (16 actions running)
[2,889 / 8,254] Foreign Cc - Configure: Building gperftools_build; 942s processwrapper-sandbox ... (14 actions, 13 running)
[2,891 / 8,254] Foreign Cc - Configure: Building gperftools_build; 943s processwrapper-sandbox ... (12 actions running)
[2,893 / 8,254] Foreign Cc - Configure: Building gperftools_build; 945s processwrapper-sandbox ... (11 actions running)
[2,896 / 8,254] Foreign Cc - Configure: Building gperftools_build; 947s processwrapper-sandbox ... (9 actions running)
[2,897 / 8,254] Foreign Cc - Configure: Building gperftools_build; 949s processwrapper-sandbox ... (8 actions running)
[2,898 / 8,254] Foreign Cc - Configure: Building gperftools_build; 951s processwrapper-sandbox ... (7 actions running)
[2,899 / 8,254] Foreign Cc - Configure: Building gperftools_build; 952s processwrapper-sandbox ... (6 actions running)
[2,900 / 8,254] Foreign Cc - Configure: Building gperftools_build; 956s processwrapper-sandbox ... (5 actions running)
[2,901 / 8,254] Foreign Cc - Configure: Building gperftools_build; 958s processwrapper-sandbox ... (5 actions, 4 running)
[2,905 / 8,254] Foreign Cc - Configure: Building gperftools_build; 959s processwrapper-sandbox ... (3 actions, 2 running)
[2,992 / 8,254] Foreign Cc - Configure: Building gperftools_build; 960s processwrapper-sandbox ... (31 actions, 30 running)
[3,128 / 8,254] Foreign Cc - Configure: Building gperftools_build; 961s processwrapper-sandbox ... (30 actions, 29 running)
[3,248 / 8,254] Foreign Cc - Configure: Building gperftools_build; 962s processwrapper-sandbox ... (31 actions, 30 running)
[3,270 / 8,254] Foreign Cc - Configure: Building gperftools_build; 963s processwrapper-sandbox ... (31 actions, 30 running)
[3,276 / 8,254] Foreign Cc - Configure: Building gperftools_build; 964s processwrapper-sandbox ... (31 actions running)
[3,282 / 8,254] Foreign Cc - Configure: Building gperftools_build; 965s processwrapper-sandbox ... (31 actions running)
[3,285 / 8,254] Foreign Cc - Configure: Building gperftools_build; 967s processwrapper-sandbox ... (31 actions, 30 running)
[3,287 / 8,254] Foreign Cc - Configure: Building gperftools_build; 968s processwrapper-sandbox ... (31 actions, 30 running)
[3,293 / 8,254] Foreign Cc - Configure: Building gperftools_build; 969s processwrapper-sandbox ... (31 actions, 30 running)
[3,298 / 8,254] Foreign Cc - Configure: Building gperftools_build; 970s processwrapper-sandbox ... (31 actions running)
[3,299 / 8,254] Foreign Cc - Configure: Building gperftools_build; 973s processwrapper-sandbox ... (31 actions, 30 running)
ERROR: /wrkdirs/usr/ports/www/pomerium-envoy-custom/work/bazel-out/external/com_envoyproxy_protoc_gen_validate/BUILD.bazel:11:10: GoLink external/com_envoyproxy_protoc_gen_validate/protoc-gen-validate_/protoc-gen-validate [for tool] failed: (Exit 1): builder failed: error executing GoLink command (from target @@com_envoyproxy_protoc_gen_validate//:protoc-gen-validate) bazel-out/freebsd-opt-exec-ST-a828a81199fe/bin/external/go_sdk/builder_reset/builder link -sdk external/go_sdk -goroot bazel-out/freebsd-opt-exec-ST-a828a81199fe/bin/external/io_bazel_rules_go/stdlib_ ... (remaining 146 arguments skipped)

Use --sandbox_debug to see verbose messages from the sandbox and retain the sandbox build root for debugging
external/go_sdk/pkg/tool/freebsd_arm64/link: running /tmp/592503777/builder-cc failed: exit status 1
/tmp/592503777/builder-cc -s -fuse-ld=bfd -Wl,--build-id=0x498919aff001d8366249403a2544fba2d833084f -o bazel-out/freebsd-opt-exec-ST-a828a81199fe/bin/external/com_envoyproxy_protoc_gen_validate/protoc-gen-validate_/protoc-gen-validate -rdynamic /tmp/go-link-2460560219/go.o /tmp/go-link-2460560219/000000.o /tmp/go-link-2460560219/000001.o /tmp/go-link-2460560219/000002.o /tmp/go-link-2460560219/000003.o /tmp/go-link-2460560219/000004.o /tmp/go-link-2460560219/000005.o /tmp/go-link-2460560219/000006.o /tmp/go-link-2460560219/000007.o /tmp/go-link-2460560219/000008.o /tmp/go-link-2460560219/000009.o /tmp/go-link-2460560219/000010.o /tmp/go-link-2460560219/000011.o /tmp/go-link-2460560219/000012.o /tmp/go-link-2460560219/000013.o /tmp/go-link-2460560219/000014.o /tmp/go-link-2460560219/000015.o -Wl,-z,relro,-z,now -no-canonical-prefixes -lm -pthread -Wl,-z,relro,-z,now -no-canonical-prefixes -lm -pthread -lpthread -Wl,-z,relro,-z,now -no-canonical-prefixes -lm
clang: error: invalid linker name in argument '-fuse-ld=bfd'

link: error running subcommand external/go_sdk/pkg/tool/freebsd_arm64/link: exit status 2
[3,301 / 8,254] Foreign Cc - Configure: Building gperftools_build; 974s processwrapper-sandbox ... (31 actions, 30 running)
Target //:envoy failed to build
Use --verbose_failures to see the command lines of failed build steps.
ERROR: /wrkdirs/usr/ports/www/pomerium-envoy-custom/work/envoy-custom-1.36.8-p1/api/extensions/filters/network/ssh/BUILD:7:18 Compiling api/extensions/filters/network/ssh/ssh.pb.validate.cc failed: (Exit 1): builder failed: error executing GoLink command (from target @@com_envoyproxy_protoc_gen_validate//:protoc-gen-validate) bazel-out/freebsd-opt-exec-ST-a828a81199fe/bin/external/go_sdk/builder_reset/builder link -sdk external/go_sdk -goroot bazel-out/freebsd-opt-exec-ST-a828a81199fe/bin/external/io_bazel_rules_go/stdlib_ ... (remaining 146 arguments skipped)

Use --sandbox_debug to see verbose messages from the sandbox and retain the sandbox build root for debugging
INFO: Elapsed time: 1077.860s, Critical Path: 974.82s
INFO: 3332 processes: 845 internal, 2487 processwrapper-sandbox.
ERROR: Build did NOT complete successfully
*** Error code 1

Stop.
make: stopped making "build" in /usr/ports/www/pomerium-envoy-custom