[package - 143arm64-quarterly][audio/vamp-plugin-sdk] Failed for vamp-plugin-sdk-2.9.0_2 in build

From: <pkg-fallout_at_FreeBSD.org>
Date: Fri, 06 Feb 2026 19:27:39 UTC
You are receiving this mail as a port that you maintain
is failing to build on the FreeBSD package build server.
Please investigate the failure and submit a PR to fix
build.

Maintainer:     uddka@student.kit.edu
Log URL:        https://pkg-status.freebsd.org/ampere4/data/143arm64-quarterly/d8a974967f40/logs/vamp-plugin-sdk-2.9.0_2.log
Build URL:      https://pkg-status.freebsd.org/ampere4/build.html?mastername=143arm64-quarterly&build=d8a974967f40
Log:

=>> Building audio/vamp-plugin-sdk
build started at Fri Feb  6 19:27:03 UTC 2026
port directory: /usr/ports/audio/vamp-plugin-sdk
package name: vamp-plugin-sdk-2.9.0_2
building for: FreeBSD 143arm64-quarterly-job-23 14.3-RELEASE-p8 FreeBSD 14.3-RELEASE-p8 arm64
maintained by: uddka@student.kit.edu
Makefile datestamp: -rw-r--r--  1 root wheel 593 Jan 15 01:01 /usr/ports/audio/vamp-plugin-sdk/Makefile
Ports top last git commit: d8a974967f40dfa0b2b78c5aa7f0774ef80dab8f
Ports top unclean checkout: no
Port dir last git commit: 9514ac9990434680c9394df1a07b7b7469198293
Port dir unclean checkout: no
Poudriere version: poudriere-git-3.4.4-15-g61aba751
Host OSVERSION: 1600007
Jail OSVERSION: 1403000
Job Id: 23

---Begin Environment---
SHELL=/bin/sh
OSVERSION=1403000
UNAME_v=FreeBSD 14.3-RELEASE-p8
UNAME_r=14.3-RELEASE-p8
BLOCKSIZE=K
MAIL=/var/mail/root
MM_CHARSET=UTF-8
LANG=C.UTF-8
STATUS=1
HOME=/root
PATH=/sbin:/bin:/usr/sbin:/usr/bin:/usr/local/sbin:/usr/local/bin:/root/bin
MAKE_OBJDIR_CHECK_WRITABLE=0
LOCALBASE=/usr/local
USER=root
POUDRIERE_NAME=poudriere-git
LIBEXECPREFIX=/usr/local/libexec/poudriere
POUDRIERE_VERSION=3.4.4-15-g61aba751
MASTERMNT=/usr/local/poudriere/data/.m/143arm64-quarterly/ref
LC_COLLATE=C
POUDRIERE_BUILD_TYPE=bulk
PACKAGE_BUILDING=yes
SAVED_TERM=
OUTPUT_REDIRECTED_STDERR=4
OUTPUT_REDIRECTED=1
PWD=/usr/local/poudriere/data/.m/143arm64-quarterly/23/.p
OUTPUT_REDIRECTED_STDOUT=3
P_PORTS_FEATURES=FLAVORS SUBPACKAGES SELECTED_OPTIONS
MASTERNAME=143arm64-quarterly
SCRIPTPREFIX=/usr/local/share/poudriere
SCRIPTNAME=bulk.sh
OLDPWD=/usr/local/poudriere/data/.m/143arm64-quarterly/ref/.p/pool
POUDRIERE_PKGNAME=poudriere-git-3.4.4-15-g61aba751
SCRIPTPATH=/usr/local/share/poudriere/bulk.sh
POUDRIEREPATH=/usr/local/bin/poudriere
---End Environment---

---Begin Poudriere Port Flags/Env---
PORT_FLAGS=
PKGENV=
FLAVOR=
MAKE_ARGS=
---End Poudriere Port Flags/Env---

---Begin OPTIONS List---
---End OPTIONS List---

--MAINTAINER--
uddka@student.kit.edu
--End MAINTAINER--

--CONFIGURE_ARGS--
--prefix=/usr/local ${_LATE_CONFIGURE_ARGS}
--End CONFIGURE_ARGS--

--CONFIGURE_ENV--
MAKE=/usr/local/bin/gmake PKG_CONFIG=pkgconf XDG_DATA_HOME=/wrkdirs/usr/ports/audio/vamp-plugin-sdk/work  XDG_CONFIG_HOME=/wrkdirs/usr/ports/audio/vamp-plugin-sdk/work  XDG_CACHE_HOME=/wrkdirs/usr/ports/audio/vamp-plugin-sdk/work/.cache  HOME=/wrkdirs/usr/ports/audio/vamp-plugin-sdk/work TMPDIR="/tmp" PATH=/wrkdirs/usr/ports/audio/vamp-plugin-sdk/work/.bin:/sbin:/bin:/usr/sbin:/usr/bin:/usr/local/sbin:/usr/local/bin:/root/bin PKG_CONFIG_LIBDIR=/wrkdirs/usr/ports/audio/vamp-plugin-sdk/work/.pkgconfig:/usr/local/libdata/pkgconfig:/usr/local/share/pkgconfig:/usr/libdata/pkgconfig SHELL=/bin/sh CONFIG_SHELL=/bin/sh CONFIG_SITE=/usr/ports/Templates/config.site lt_cv_sys_max_cmd_len=524288
--End CONFIGURE_ENV--

--MAKE_ENV--
XDG_DATA_HOME=/wrkdirs/usr/ports/audio/vamp-plugin-sdk/work  XDG_CONFIG_HOME=/wrkdirs/usr/ports/audio/vamp-plugin-sdk/work  XDG_CACHE_HOME=/wrkdirs/usr/ports/audio/vamp-plugin-sdk/work/.cache  HOME=/wrkdirs/usr/ports/audio/vamp-plugin-sdk/work TMPDIR="/tmp" PATH=/wrkdirs/usr/ports/audio/vamp-plugin-sdk/work/.bin:/sbin:/bin:/usr/sbin:/usr/bin:/usr/local/sbin:/usr/local/bin:/root/bin PKG_CONFIG_LIBDIR=/wrkdirs/usr/ports/audio/vamp-plugin-sdk/work/.pkgconfig:/usr/local/libdata/pkgconfig:/usr/local/share/pkgconfig:/usr/libdata/pkgconfig MK_DEBUG_FILES=no MK_KERNEL_SYMBOLS=no SHELL=/bin/sh NO_LINT=YES PREFIX=/usr/local  LOCALBASE=/usr/local  CC="cc" CFLAGS="-O2 -pipe  -fstack-protector-strong -fno-strict-aliasing "  CPP="cpp" CPPFLAGS=""  LDFLAGS=" " LIBS=""  CXX="c++" CXXFLAGS="-O2 -pipe -fstack-protector-strong -fno-strict-aliasing  " BSD_INSTALL_PROGRAM="install  -s -m 555"  BSD_INSTALL_LIB="install  -s -m 0644"  BSD_INSTALL_SCRIPT="install  -m 555"  BSD_INSTALL_DATA="install 
 -m 0644"  BSD_INSTALL_MAN="install  -m 444"
--End MAKE_ENV--

--PLIST_SUB--
OSREL=14.3 PREFIX=%D LOCALBASE=/usr/local  RESETPREFIX=/usr/local LIB32DIR=lib DOCSDIR="share/doc/vamp-plugin-sdk"  EXAMPLESDIR="share/examples/vamp-plugin-sdk"  DATADIR="share/vamp-plugin-sdk"  WWWDIR="www/vamp-plugin-sdk"  ETCDIR="etc/vamp-plugin-sdk"
--End PLIST_SUB--

--SUB_LIST--
PREFIX=/usr/local LOCALBASE=/usr/local  DATADIR=/usr/local/share/vamp-plugin-sdk DOCSDIR=/usr/local/share/doc/vamp-plugin-sdk EXAMPLESDIR=/usr/local/share/examples/vamp-plugin-sdk  WWWDIR=/usr/local/www/vamp-plugin-sdk ETCDIR=/usr/local/etc/vamp-plugin-sdk
--End SUB_LIST--

---Begin make.conf---
USE_PACKAGE_DEPENDS=yes
BATCH=yes
WRKDIRPREFIX=/wrkdirs
PORTSDIR=/usr/ports
PACKAGES=/packages
DISTDIR=/distfiles
PACKAGE_BUILDING=yes
PACKAGE_BUILDING_FLAVORS=yes
####  ####
# XXX: We really need this but cannot use it while 'make checksum' does not
# try the next mirror on checksum failure.  It currently retries the same
# failed mirror and then fails rather then trying another.  It *does*
# try the next if the size is mismatched though.
#MASTER_SITE_FREEBSD=yes
# Build ALLOW_MAKE_JOBS_PACKAGES with 3 jobs
MAKE_JOBS_NUMBER=3
#### Misc Poudriere ####
.include "/etc/make.conf.ports_env"
GID=0
UID=0
---End make.conf---
--Resource limits--
cpu time               (seconds, -t)  unlimited
file size           (512-blocks, -f)  unlimited
data seg size           (kbytes, -d)  1048576
stack size              (kbytes, -s)  1048576
core file size      (512-blocks, -c)  unlimited
max memory size         (kbytes, -m)  unlimited
locked memory           (kbytes, -l)  unlimited
max user processes              (-u)  89999
open files                      (-n)  8192
virtual mem size        (kbytes, -v)  unlimited
swap limit              (kbytes, -w)  unlimited
socket buffer size       (bytes, -b)  unlimited
pseudo-terminals                (-p)  unlimited
kqueues                         (-k)  unlimited
umtx shared locks               (-o)  unlimited
pipebuf                         (-y)  unlimited
--End resource limits--
=======================<phase: check-sanity   >============================
===== env: NO_DEPENDS=yes USER=root UID=0 GID=0
===>  License MIT accepted by the user
===========================================================================
=======================<phase: pkg-depends    >============================
===== env: USE_PACKAGE_DEPENDS_ONLY=1 USER=root UID=0 GID=0
===>   vamp-plugin-sdk-2.9.0_2 depends on file: /usr/local/sbin/pkg - not found
===>   Installing existing package /packages/All/pkg-2.5.1.pkg
[143arm64-quarterly-job-23] Installing pkg-2.5.1...
[143arm64-quarterly-job-23] Extracting pkg-2.5.1: .......... done
===>   vamp-plugin-sdk-2.9.0_2 depends on file: /usr/local/sbin/pkg - found
===>   Returning to build of vamp-plugin-sdk-2.9.0_2
===========================================================================
=======================<phase: fetch-depends  >============================
===== env: USE_PACKAGE_DEPENDS_ONLY=1 USER=root UID=0 GID=0
===========================================================================
=======================<phase: fetch          >============================
===== env: NO_DEPENDS=yes USER=root UID=0 GID=0
===>  License MIT accepted by the user
===> Fetching all distfiles required by vamp-plugin-sdk-2.9.0_2 for building
===========================================================================
=======================<phase: checksum       >============================
===== env: NO_DEPENDS=yes USER=root UID=0 GID=0
===>  License MIT accepted by the user
===> Fetching all distfiles required by vamp-plugin-sdk-2.9.0_2 for building
=> SHA256 Checksum OK for vamp-plugin-sdk-2.9.0.tar.gz.
===========================================================================
=======================<phase: extract-depends>============================
===== env: USE_PACKAGE_DEPENDS_ONLY=1 USER=root UID=0 GID=0
===========================================================================
=======================<phase: extract        >============================
===== env: NO_DEPENDS=yes USER=root UID=0 GID=0
===>  License MIT accepted by the user
===> Fetching all distfiles required by vamp-plugin-sdk-2.9.0_2 for building
===>  Extracting for vamp-plugin-sdk-2.9.0_2
=> SHA256 Checksum OK for vamp-plugin-sdk-2.9.0.tar.gz.
===========================================================================
=======================<phase: patch-depends  >============================
===== env: USE_PACKAGE_DEPENDS_ONLY=1 USER=root UID=0 GID=0
===========================================================================
=======================<phase: patch          >============================
===== env: NO_DEPENDS=yes USER=root UID=0 GID=0
===>  Patching for vamp-plugin-sdk-2.9.0_2
===>  Applying FreeBSD patches for vamp-plugin-sdk-2.9.0_2 from /usr/ports/audio/vamp-plugin-sdk/files
===========================================================================
=======================<phase: build-depends  >============================
===== env: USE_PACKAGE_DEPENDS_ONLY=1 USER=root UID=0 GID=0
===>   vamp-plugin-sdk-2.9.0_2 depends on package: gmake>=4.4.1 - not found
===>   Installing existing package /packages/All/gmake-4.4.1.pkg
[143arm64-quarterly-job-23] Installing gmake-4.4.1...
[143arm64-quarterly-job-23] `-- Installing gettext-runtime-0.26...
[143arm64-quarterly-job-23] |   `-- Installing indexinfo-0.3.1_1...
[143arm64-quarterly-job-23] |   `-- Extracting indexinfo-0.3.1_1: .... done
[143arm64-quarterly-job-23] `-- Extracting gettext-runtime-0.26: .......... done
[143arm64-quarterly-job-23] Extracting gmake-4.4.1: .......... done
===>   vamp-plugin-sdk-2.9.0_2 depends on package: gmake>=4.4.1 - found
===>   Returning to build of vamp-plugin-sdk-2.9.0_2
===>   vamp-plugin-sdk-2.9.0_2 depends on package: pkgconf>=1.3.0_1 - not found
===>   Installing existing package /packages/All/pkgconf-2.4.3,1.pkg
[143arm64-quarterly-job-23] Installing pkgconf-2.4.3,1...
[143arm64-quarterly-job-23] Extracting pkgconf-2.4.3,1: .......... done
===>   vamp-plugin-sdk-2.9.0_2 depends on package: pkgconf>=1.3.0_1 - found
===>   Returning to build of vamp-plugin-sdk-2.9.0_2
===========================================================================
=======================<phase: lib-depends    >============================
===== env: USE_PACKAGE_DEPENDS_ONLY=1 USER=root UID=0 GID=0
===>   vamp-plugin-sdk-2.9.0_2 depends on shared library: libsndfile.so - not found
===>   Installing existing package /packages/All/libsndfile-1.2.2_2.pkg
[143arm64-quarterly-job-23] Installing libsndfile-1.2.2_2...
[143arm64-quarterly-job-23] `-- Installing flac-1.5.0,1...
[143arm64-quarterly-job-23] |   `-- Installing libogg-1.3.6,4...
[143arm64-quarterly-job-23] |   `-- Extracting libogg-1.3.6,4: .......... done
[143arm64-quarterly-job-23] `-- Extracting flac-1.5.0,1: .......... done
[143arm64-quarterly-job-23] `-- Installing lame-3.100_5...
[143arm64-quarterly-job-23] `-- Extracting lame-3.100_5: .......... done
[143arm64-quarterly-job-23] `-- Installing libvorbis-1.3.7_2,3...
[143arm64-quarterly-job-23] `-- Extracting libvorbis-1.3.7_2,3: .......... done
[143arm64-quarterly-job-23] `-- Installing mpg123-1.33.4...
[143arm64-quarterly-job-23] `-- Extracting mpg123-1.33.4: .......... done
[143arm64-quarterly-job-23] `-- Installing opus-1.6...
[143arm64-quarterly-job-23] `-- Extracting opus-1.6: .......... done
[143arm64-quarterly-job-23] Extracting libsndfile-1.2.2_2: .......... done
===>   vamp-plugin-sdk-2.9.0_2 depends on shared library: libsndfile.so - found (/usr/local/lib/libsndfile.so)
===>   Returning to build of vamp-plugin-sdk-2.9.0_2
===========================================================================
=======================<phase: configure      >============================
===== env: NO_DEPENDS=yes USER=root UID=0 GID=0
===>  Configuring for vamp-plugin-sdk-2.9.0_2
configure: loading site script /usr/ports/Templates/config.site
checking whether the C++ compiler works... yes
checking for C++ compiler default output file name... a.out
checking for suffix of executables... 
checking whether we are cross compiling... no
checking for suffix of object files... o
checking whether we are using the GNU C++ compiler... yes
checking whether c++ accepts -g... yes
checking for gcc... cc
checking whether we are using the GNU C compiler... yes
checking whether cc accepts -g... yes
checking for cc option to accept ISO C89... none needed
checking how to run the C preprocessor... cpp
checking for grep that handles long lines and -e... (cached) /usr/bin/grep
checking for egrep... (cached) /usr/bin/egrep
checking for ANSI C header files... (cached) yes
checking for sys/types.h... (cached) yes
checking for sys/stat.h... (cached) yes
checking for stdlib.h... (cached) yes
checking for string.h... (cached) yes
checking for memory.h... (cached) yes
checking for strings.h... (cached) yes
checking for inttypes.h... (cached) yes
checking for stdint.h... (cached) yes
checking for unistd.h... (cached) yes
checking whether byte ordering is bigendian... no
checking whether c++ supports C++11 features by default... yes
checking for library containing dlopen... none required
checking pkg-config is at least version 0.9.0... yes
checking for SNDFILE... yes
configure: creating ./config.status
config.status: creating Makefile
===========================================================================
=======================<phase: build          >============================
===== env: NO_DEPENDS=yes USER=root UID=0 GID=0
===>  Building for vamp-plugin-sdk-2.9.0_2
c++ -std=c++11 -I. -O2 -pipe -fstack-protector-strong -fno-strict-aliasing   -fPIC -Wall -Wextra -std=c++11 -I/usr/local/include -I/usr/local/include/opus    -c -o src/vamp-sdk/PluginAdapter.o src/vamp-sdk/PluginAdapter.cpp
c++ -std=c++11 -I. -O2 -pipe -fstack-protector-strong -fno-strict-aliasing   -fPIC -Wall -Wextra -std=c++11 -I/usr/local/include -I/usr/local/include/opus    -c -o src/vamp-sdk/RealTime.o src/vamp-sdk/RealTime.cpp
c++ -std=c++11 -I. -O2 -pipe -fstack-protector-strong -fno-strict-aliasing   -fPIC -Wall -Wextra -std=c++11 -I/usr/local/include -I/usr/local/include/opus    -c -o src/vamp-sdk/FFT.o src/vamp-sdk/FFT.cpp
cc -O2 -pipe  -fstack-protector-strong -fno-strict-aliasing  -fPIC -Wall -Wextra   -c -o src/vamp-sdk/acsymbols.o src/vamp-sdk/acsymbols.c
c++ -std=c++11 -I. -O2 -pipe -fstack-protector-strong -fno-strict-aliasing   -fPIC -Wall -Wextra -std=c++11 -I/usr/local/include -I/usr/local/include/opus    -c -o src/vamp-hostsdk/Files.o src/vamp-hostsdk/Files.cpp
c++ -std=c++11 -I. -O2 -pipe -fstack-protector-strong -fno-strict-aliasing   -fPIC -Wall -Wextra -std=c++11 -I/usr/local/include -I/usr/local/include/opus    -c -o src/vamp-hostsdk/PluginHostAdapter.o src/vamp-hostsdk/PluginHostAdapter.cpp
c++ -std=c++11 -I. -O2 -pipe -fstack-protector-strong -fno-strict-aliasing   -fPIC -Wall -Wextra -std=c++11 -I/usr/local/include -I/usr/local/include/opus    -c -o src/vamp-hostsdk/RealTime.o src/vamp-hostsdk/RealTime.cpp
c++ -std=c++11 -I. -O2 -pipe -fstack-protector-strong -fno-strict-aliasing   -fPIC -Wall -Wextra -std=c++11 -I/usr/local/include -I/usr/local/include/opus    -c -o src/vamp-hostsdk/PluginBufferingAdapter.o src/vamp-hostsdk/PluginBufferingAdapter.cpp
c++ -std=c++11 -I. -O2 -pipe -fstack-protector-strong -fno-strict-aliasing   -fPIC -Wall -Wextra -std=c++11 -I/usr/local/include -I/usr/local/include/opus    -c -o src/vamp-hostsdk/PluginChannelAdapter.o src/vamp-hostsdk/PluginChannelAdapter.cpp
c++ -std=c++11 -I. -O2 -pipe -fstack-protector-strong -fno-strict-aliasing   -fPIC -Wall -Wextra -std=c++11 -I/usr/local/include -I/usr/local/include/opus    -c -o src/vamp-hostsdk/PluginInputDomainAdapter.o src/vamp-hostsdk/PluginInputDomainAdapter.cpp
c++ -std=c++11 -I. -O2 -pipe -fstack-protector-strong -fno-strict-aliasing   -fPIC -Wall -Wextra -std=c++11 -I/usr/local/include -I/usr/local/include/opus    -c -o src/vamp-hostsdk/PluginLoader.o src/vamp-hostsdk/PluginLoader.cpp
c++ -std=c++11 -I. -O2 -pipe -fstack-protector-strong -fno-strict-aliasing   -fPIC -Wall -Wextra -std=c++11 -I/usr/local/include -I/usr/local/include/opus    -c -o src/vamp-hostsdk/PluginSummarisingAdapter.o src/vamp-hostsdk/PluginSummarisingAdapter.cpp
src/vamp-hostsdk/PluginSummarisingAdapter.cpp:732:29: warning: definition of implicit copy constructor for 'ValueDurationFloatPair' is deprecated because it has a user-provided copy assignment operator [-Wdeprecated-copy-with-user-provided-copy]
  732 |     ValueDurationFloatPair &operator=(const ValueDurationFloatPair &p) {
      |                             ^
/usr/include/c++/v1/__memory/allocator.h:165:24: note: in implicit copy constructor for '_VampHost::Vamp::HostExt::ValueDurationFloatPair' first required here
  165 |     ::new ((void*)__p) _Up(std::forward<_Args>(__args)...);
      |                        ^
/usr/include/c++/v1/__memory/allocator_traits.h:319:9: note: in instantiation of function template specialization 'std::allocator<_VampHost::Vamp::HostExt::ValueDurationFloatPair>::construct<_VampHost::Vamp::HostExt::ValueDurationFloatPair, _VampHost::Vamp::HostExt::ValueDurationFloatPair>' requested here
  319 |     __a.construct(__p, std::forward<_Args>(__args)...);
      |         ^
/usr/include/c++/v1/vector:961:21: note: in instantiation of function template specialization 'std::allocator_traits<std::allocator<_VampHost::Vamp::HostExt::ValueDurationFloatPair>>::construct<_VampHost::Vamp::HostExt::ValueDurationFloatPair, _VampHost::Vamp::HostExt::ValueDurationFloatPair, 0>' requested here
  961 |     __alloc_traits::construct(this->__alloc(), std::__to_address(__tx.__pos_), std::forward<_Args>(__args)...);
      |                     ^
/usr/include/c++/v1/vector:1523:5: note: in instantiation of function template specialization 'std::vector<_VampHost::Vamp::HostExt::ValueDurationFloatPair>::__construct_one_at_end<_VampHost::Vamp::HostExt::ValueDurationFloatPair>' requested here
 1523 |     __construct_one_at_end(std::move(__x));
      |     ^
src/vamp-hostsdk/PluginSummarisingAdapter.cpp:822:28: note: in instantiation of member function 'std::vector<_VampHost::Vamp::HostExt::ValueDurationFloatPair>::push_back' requested here
  822 |                     valvec.push_back
      |                            ^
c++ -std=c++11 -I. -O2 -pipe -fstack-protector-strong -fno-strict-aliasing   -fPIC -Wall -Wextra -std=c++11 -I/usr/local/include -I/usr/local/include/opus    -c -o src/vamp-hostsdk/PluginWrapper.o src/vamp-hostsdk/PluginWrapper.cpp
c++ -std=c++11 -I. -O2 -pipe -fstack-protector-strong -fno-strict-aliasing   -fPIC -Wall -Wextra -std=c++11 -I/usr/local/include -I/usr/local/include/opus    -c -o src/vamp-hostsdk/host-c.o src/vamp-hostsdk/host-c.cpp
1 warning generated.
cc -O2 -pipe  -fstack-protector-strong -fno-strict-aliasing  -fPIC -Wall -Wextra   -c -o src/vamp-hostsdk/acsymbols.o src/vamp-hostsdk/acsymbols.c
c++   -shared -Wl,-Bsymbolic -Wl,-soname=libvamp-sdk.so.2 -o libvamp-sdk.so src/vamp-sdk/PluginAdapter.o src/vamp-sdk/RealTime.o src/vamp-sdk/FFT.o src/vamp-sdk/acsymbols.o
c++ -std=c++11 -I. -O2 -pipe -fstack-protector-strong -fno-strict-aliasing   -fPIC -Wall -Wextra -std=c++11 -I/usr/local/include -I/usr/local/include/opus    -c -o examples/SpectralCentroid.o examples/SpectralCentroid.cpp
c++ -std=c++11 -I. -O2 -pipe -fstack-protector-strong -fno-strict-aliasing   -fPIC -Wall -Wextra -std=c++11 -I/usr/local/include -I/usr/local/include/opus    -c -o examples/PowerSpectrum.o examples/PowerSpectrum.cpp
c++ -std=c++11 -I. -O2 -pipe -fstack-protector-strong -fno-strict-aliasing   -fPIC -Wall -Wextra -std=c++11 -I/usr/local/include -I/usr/local/include/opus    -c -o examples/PercussionOnsetDetector.o examples/PercussionOnsetDetector.cpp
c++ -std=c++11 -I. -O2 -pipe -fstack-protector-strong -fno-strict-aliasing   -fPIC -Wall -Wextra -std=c++11 -I/usr/local/include -I/usr/local/include/opus    -c -o examples/FixedTempoEstimator.o examples/FixedTempoEstimator.cpp
c++ -std=c++11 -I. -O2 -pipe -fstack-protector-strong -fno-strict-aliasing   -fPIC -Wall -Wextra -std=c++11 -I/usr/local/include -I/usr/local/include/opus    -c -o examples/AmplitudeFollower.o examples/AmplitudeFollower.cpp
c++ -std=c++11 -I. -O2 -pipe -fstack-protector-strong -fno-strict-aliasing   -fPIC -Wall -Wextra -std=c++11 -I/usr/local/include -I/usr/local/include/opus    -c -o examples/ZeroCrossing.o examples/ZeroCrossing.cpp
c++ -std=c++11 -I. -O2 -pipe -fstack-protector-strong -fno-strict-aliasing   -fPIC -Wall -Wextra -std=c++11 -I/usr/local/include -I/usr/local/include/opus    -c -o examples/plugins.o examples/plugins.cpp
c++ -std=c++11 -I. -O2 -pipe -fstack-protector-strong -fno-strict-aliasing   -fPIC -Wall -Wextra -std=c++11 -I/usr/local/include -I/usr/local/include/opus    -c -o host/vamp-simple-host.o host/vamp-simple-host.cpp
c++ -std=c++11 -I. -O2 -pipe -fstack-protector-strong -fno-strict-aliasing   -fPIC -Wall -Wextra -std=c++11 -I/usr/local/include -I/usr/local/include/opus    -c -o rdf/generator/vamp-rdf-template-generator.o rdf/generator/vamp-rdf-template-generator.cpp
ar r libvamp-sdk.a src/vamp-sdk/PluginAdapter.o src/vamp-sdk/RealTime.o src/vamp-sdk/FFT.o src/vamp-sdk/acsymbols.o
ar: warning: creating libvamp-sdk.a
ar r libvamp-hostsdk.a src/vamp-hostsdk/Files.o src/vamp-hostsdk/PluginHostAdapter.o src/vamp-hostsdk/RealTime.o src/vamp-hostsdk/PluginBufferingAdapter.o src/vamp-hostsdk/PluginChannelAdapter.o src/vamp-hostsdk/PluginInputDomainAdapter.o src/vamp-hostsdk/PluginLoader.o src/vamp-hostsdk/PluginSummarisingAdapter.o src/vamp-hostsdk/PluginWrapper.o src/vamp-hostsdk/host-c.o src/vamp-hostsdk/acsymbols.o
ar: warning: creating libvamp-hostsdk.a
c++   -shared -Wl,-Bsymbolic -Wl,-soname=libvamp-hostsdk.so.3 -o libvamp-hostsdk.so src/vamp-hostsdk/Files.o src/vamp-hostsdk/PluginHostAdapter.o src/vamp-hostsdk/RealTime.o src/vamp-hostsdk/PluginBufferingAdapter.o src/vamp-hostsdk/PluginChannelAdapter.o src/vamp-hostsdk/PluginInputDomainAdapter.o src/vamp-hostsdk/PluginLoader.o src/vamp-hostsdk/PluginSummarisingAdapter.o src/vamp-hostsdk/PluginWrapper.o src/vamp-hostsdk/host-c.o src/vamp-hostsdk/acsymbols.o
c++    -o host/vamp-simple-host host/vamp-simple-host.o ./libvamp-hostsdk.a -L/usr/local/lib -lsndfile 
c++    -o rdf/generator/vamp-rdf-template-generator rdf/generator/vamp-rdf-template-generator.o ./libvamp-hostsdk.a 
ranlib ./libvamp-sdk.a
c++   -shared -Wl,-Bsymbolic -Wl,--version-script=build/vamp-plugin.map -o examples/vamp-example-plugins.so examples/SpectralCentroid.o examples/PowerSpectrum.o examples/PercussionOnsetDetector.o examples/FixedTempoEstimator.o examples/AmplitudeFollower.o examples/ZeroCrossing.o examples/plugins.o ./libvamp-sdk.a
ranlib ./libvamp-hostsdk.a
c++: error: unable to execute command: Bus error (core dumped)
c++: error: linker command failed due to signal (use -v to see invocation)
gmake: *** [Makefile:271: rdf/generator/vamp-rdf-template-generator] Error 1
gmake: *** Waiting for unfinished jobs....
===> Compilation failed unexpectedly.
Try to set MAKE_JOBS_UNSAFE=yes and rebuild before reporting the failure to
the maintainer.
*** Error code 1

Stop.
make: stopped in /usr/ports/audio/vamp-plugin-sdk