[package - 150amd64-default][audio/solfege] Failed for solfege-nosound-3.23.5.p2_2 in build

From: <pkg-fallout_at_FreeBSD.org>
Date: Sun, 23 Aug 2026 00:06:23 UTC
You are receiving this mail as a port that you maintain
is failing to build on the FreeBSD package build server.
Please investigate the failure and submit a PR to fix
build.

Maintainer:     m.ne@gmx.net
Log URL:        https://pkg-status.freebsd.org/beefy23/data/150amd64-default/6255cb20bc1d/logs/solfege-nosound-3.23.5.p2_2.log
Build URL:      https://pkg-status.freebsd.org/beefy23/build.html?mastername=150amd64-default&build=6255cb20bc1d
Log:

=>> Building audio/solfege
build started at Sun Aug 23 00:06:07 UTC 2026
port directory: /usr/ports/audio/solfege
package name: solfege-nosound-3.23.5.p2_2
building for: FreeBSD 150amd64-default-job-35 15.0-RELEASE-p12 FreeBSD 15.0-RELEASE-p12 amd64
maintained by: m.ne@gmx.net
Makefile datestamp: -rw-r--r--  1 root wheel 1455 Sep 30  2025 /usr/ports/audio/solfege/Makefile
Ports top last git commit: 6255cb20bc1d37f427cbcc66046bc46a71b23ee8
Ports top unclean checkout: no
Port dir last git commit: b64b73fd938d5b2788547d16ed6a76493acc9142
Port dir unclean checkout: no
Poudriere version: poudriere-git-3.4.8
Host OSVERSION: 1600019
Jail OSVERSION: 1500068
Job Id: 35

---Begin Environment---
SHELL=/bin/sh
OSVERSION=1500068
UNAME_v=FreeBSD 15.0-RELEASE-p12
UNAME_r=15.0-RELEASE-p12
BLOCKSIZE=K
MAIL=/var/mail/root
MM_CHARSET=UTF-8
LANG=C.UTF-8
STATUS=1
HOME=/root
PATH=/sbin:/bin:/usr/sbin:/usr/bin:/usr/local/sbin:/usr/local/bin:/root/bin
MAKE_OBJDIR_CHECK_WRITABLE=0
LOCALBASE=/usr/local
USER=root
POUDRIERE_NAME=poudriere-git
LIBEXECPREFIX=/usr/local/libexec/poudriere
POUDRIERE_VERSION=3.4.8
MASTERMNT=/usr/local/poudriere/data/.m/150amd64-default/ref
LC_COLLATE=C
POUDRIERE_BUILD_TYPE=bulk
PACKAGE_BUILDING=yes
SAVED_TERM=
OUTPUT_REDIRECTED_STDERR=4
OUTPUT_REDIRECTED=1
PWD=/usr/local/poudriere/data/.m/150amd64-default/35/.p
OUTPUT_REDIRECTED_STDOUT=3
P_PORTS_FEATURES=FLAVORS SUBPACKAGES SELECTED_OPTIONS
MASTERNAME=150amd64-default
SCRIPTPREFIX=/usr/local/share/poudriere
SCRIPTNAME=bulk.sh
OLDPWD=/usr/local/poudriere/data/.m/150amd64-default/ref/.p/pool
POUDRIERE_PKGNAME=poudriere-git-3.4.8
SCRIPTPATH=/usr/local/share/poudriere/bulk.sh
POUDRIEREPATH=/usr/local/bin/poudriere
---End Environment---

---Begin Poudriere Port Flags/Env---
PORT_FLAGS=
PKGENV=
FLAVOR=
MAKE_ARGS=
---End Poudriere Port Flags/Env---

---Begin OPTIONS List---
---End OPTIONS List---

--MAINTAINER--
m.ne@gmx.net
--End MAINTAINER--

--CONFIGURE_ARGS--
--disable-oss-sound  --enable-docbook-stylesheet=/usr/local/share/xsl/docbook/xhtml/chunk.xsl --prefix=/usr/local ${_LATE_CONFIGURE_ARGS}
--End CONFIGURE_ARGS--

--CONFIGURE_ENV--
ac_cv_path_XML2PO="" MAKE=/usr/local/bin/gmake PKG_CONFIG=pkgconf PYTHON="/usr/local/bin/python3.12" XDG_DATA_HOME=/wrkdirs/usr/ports/audio/solfege/work  XDG_CONFIG_HOME=/wrkdirs/usr/ports/audio/solfege/work  XDG_CACHE_HOME=/wrkdirs/usr/ports/audio/solfege/work/.cache  HOME=/wrkdirs/usr/ports/audio/solfege/work TMPDIR="/tmp" PATH=/wrkdirs/usr/ports/audio/solfege/work/.bin:/sbin:/bin:/usr/sbin:/usr/bin:/usr/local/sbin:/usr/local/bin:/root/bin PKG_CONFIG_LIBDIR=/wrkdirs/usr/ports/audio/solfege/work/.pkgconfig:/usr/local/libdata/pkgconfig:/usr/local/share/pkgconfig:/usr/libdata/pkgconfig SHELL=/bin/sh CONFIG_SHELL=/bin/sh DEFAULT_AUTOCONF=2.73 CONFIG_SITE=/usr/ports/Templates/config.site lt_cv_sys_max_cmd_len=524288
--End CONFIGURE_ENV--

--MAKE_ENV--
XDG_DATA_HOME=/wrkdirs/usr/ports/audio/solfege/work  XDG_CONFIG_HOME=/wrkdirs/usr/ports/audio/solfege/work  XDG_CACHE_HOME=/wrkdirs/usr/ports/audio/solfege/work/.cache  HOME=/wrkdirs/usr/ports/audio/solfege/work TMPDIR="/tmp" PATH=/wrkdirs/usr/ports/audio/solfege/work/.bin:/sbin:/bin:/usr/sbin:/usr/bin:/usr/local/sbin:/usr/local/bin:/root/bin PKG_CONFIG_LIBDIR=/wrkdirs/usr/ports/audio/solfege/work/.pkgconfig:/usr/local/libdata/pkgconfig:/usr/local/share/pkgconfig:/usr/libdata/pkgconfig MK_DEBUG_FILES=no MK_KERNEL_SYMBOLS=no SHELL=/bin/sh NO_LINT=YES DEFAULT_AUTOCONF=2.73 PREFIX=/usr/local  LOCALBASE=/usr/local  CC="cc" CFLAGS="-O2 -pipe  -fstack-protector-strong -fno-strict-aliasing "  CPP="cpp" CPPFLAGS=""  LDFLAGS=" " LIBS=""  CXX="c++" CXXFLAGS="-O2 -pipe -fstack-protector-strong -fno-strict-aliasing   " BSD_INSTALL_PROGRAM="install  -s -m 555"  BSD_INSTALL_LIB="install  -s -m 0644"  BSD_INSTALL_SCRIPT="install  -m 555"  BSD_INSTALL_DATA="install  -m 0644"  BSD_INSTALL_MA
N="install  -m 444"
--End MAKE_ENV--

--PLIST_SUB--
GTK2_VERSION="2.10.0"  GTK3_VERSION="3.0.0"  GTK4_VERSION="4.0.0" PYTHON_INCLUDEDIR=include/python3.12  PYTHON_LIBDIR=lib/python3.12  PYTHON_PLATFORM=freebsd15  PYTHON_SITELIBDIR=lib/python3.12/site-packages  PYTHON_SUFFIX=312  PYTHON_BASESUFFIX=312  PYTHON_TAG=.cpython-312  PYTHON_SOABI=.cpython-312  PYTHON_VER=3.12  PYTHON_BASEVER=3.12  PYTHON_VERSION=python3.12 PYTHON2="@comment " PYTHON3="" OSREL=15.0 PREFIX=%D LOCALBASE=/usr/local  RESETPREFIX=/usr/local LIB32DIR=lib DOCSDIR="share/doc/solfege"  EXAMPLESDIR="share/examples/solfege"  DATADIR="share/solfege"  WWWDIR="www/solfege"  ETCDIR="etc/solfege"
--End PLIST_SUB--

--SUB_LIST--
PYTHON_INCLUDEDIR=/usr/local/include/python3.12  PYTHON_LIBDIR=/usr/local/lib/python3.12  PYTHON_PLATFORM=freebsd15  PYTHON_SITELIBDIR=/usr/local/lib/python3.12/site-packages  PYTHON_SUFFIX=312  PYTHON_BASESUFFIX=312  PYTHON_TAG=.cpython-312  PYTHON_SOABI=.cpython-312  PYTHON_VER=3.12  PYTHON_BASEVER=3.12  PYTHON_VERSION=python3.12 PYTHON2="@comment " PYTHON3="" PREFIX=/usr/local LOCALBASE=/usr/local  DATADIR=/usr/local/share/solfege DOCSDIR=/usr/local/share/doc/solfege EXAMPLESDIR=/usr/local/share/examples/solfege  WWWDIR=/usr/local/www/solfege ETCDIR=/usr/local/etc/solfege
--End SUB_LIST--

---Begin make.conf---
USE_PACKAGE_DEPENDS=yes
BATCH=yes
WRKDIRPREFIX=/wrkdirs
PORTSDIR=/usr/ports
PACKAGES=/packages
DISTDIR=/distfiles
PACKAGE_BUILDING=yes
PACKAGE_BUILDING_FLAVORS=yes
####  ####
# XXX: We really need this but cannot use it while 'make checksum' does not
# try the next mirror on checksum failure.  It currently retries the same
# failed mirror and then fails rather then trying another.  It *does*
# try the next if the size is mismatched though.
#MASTER_SITE_FREEBSD=yes
# Build ALLOW_MAKE_JOBS_PACKAGES with 3 jobs
MAKE_JOBS_NUMBER=3
#### Misc Poudriere ####
.include "/etc/make.conf.ports_env"
GID=0
UID=0
---End make.conf---
--Resource limits--
cpu time               (seconds, -t)  unlimited
file size           (512-blocks, -f)  unlimited
data seg size           (kbytes, -d)  33554432
stack size              (kbytes, -s)  524288
core file size      (512-blocks, -c)  unlimited
max memory size         (kbytes, -m)  unlimited
locked memory           (kbytes, -l)  unlimited
max user processes              (-u)  89999
open files                      (-n)  8192
virtual mem size        (kbytes, -v)  unlimited
swap limit              (kbytes, -w)  unlimited
socket buffer size       (bytes, -b)  unlimited
pseudo-terminals                (-p)  unlimited
kqueues                         (-k)  unlimited
umtx shared locks               (-o)  unlimited
pipebuf                         (-y)  unlimited
--End resource limits--
=======================<phase: check-sanity   >============================
===== env: NO_DEPENDS=yes USER=root UID=0 GID=0
===>  License GPLv3 accepted by the user
===========================================================================
=======================<phase: pkg-depends    >============================
===== env: USE_PACKAGE_DEPENDS_ONLY=1 USER=root UID=0 GID=0
===>   solfege-nosound-3.23.5.p2_2 depends on file: /usr/local/sbin/pkg - not found
===>   Installing existing package /packages/All/pkg-2.8.4.pkg
[150amd64-default-job-35] Installing pkg-2.8.4...
[150amd64-default-job-35] Extracting pkg-2.8.4: .......... done
===>   solfege-nosound-3.23.5.p2_2 depends on file: /usr/local/sbin/pkg - found
===>   Returning to build of solfege-nosound-3.23.5.p2_2
===========================================================================
=======================<phase: fetch-depends  >============================
===== env: USE_PACKAGE_DEPENDS_ONLY=1 USER=root UID=0 GID=0
===========================================================================
=======================<phase: fetch          >============================
===== env: NO_DEPENDS=yes USER=root UID=0 GID=0
===>  License GPLv3 accepted by the user
===> Fetching all distfiles required by solfege-nosound-3.23.5.p2_2 for building
===========================================================================
=======================<phase: checksum       >============================
===== env: NO_DEPENDS=yes USER=root UID=0 GID=0
===>  License GPLv3 accepted by the user
===> Fetching all distfiles required by solfege-nosound-3.23.5.p2_2 for building
=> SHA256 Checksum OK for solfege-3.23.5pre2.tar.gz.
===========================================================================
=======================<phase: extract-depends>============================
===== env: USE_PACKAGE_DEPENDS_ONLY=1 USER=root UID=0 GID=0
===========================================================================
=======================<phase: extract        >============================
===== env: NO_DEPENDS=yes USER=root UID=0 GID=0
===>  License GPLv3 accepted by the user
===> Fetching all distfiles required by solfege-nosound-3.23.5.p2_2 for building
===>  Extracting for solfege-nosound-3.23.5.p2_2
=> SHA256 Checksum OK for solfege-3.23.5pre2.tar.gz.
===========================================================================
=======================<phase: patch-depends  >============================
===== env: USE_PACKAGE_DEPENDS_ONLY=1 USER=root UID=0 GID=0
===========================================================================
=======================<phase: patch          >============================
===== env: NO_DEPENDS=yes USER=root UID=0 GID=0
===>  Patching for solfege-nosound-3.23.5.p2_2
===========================================================================
=======================<phase: build-depends  >============================
===== env: USE_PACKAGE_DEPENDS_ONLY=1 USER=root UID=0 GID=0
===>   solfege-nosound-3.23.5.p2_2 depends on package: docbook-xsl>0 - not found
===>   Installing existing package /packages/All/docbook-xsl-1.79.1_1,1.pkg
[150amd64-default-job-35] Installing docbook-xsl-1.79.1_1,1...
[150amd64-default-job-35] `-- Installing docbook-1.5...
[150amd64-default-job-35] |   `-- Installing docbook-sgml-4.5_1...
[150amd64-default-job-35] |   | `-- Installing iso8879-1986_3...
[150amd64-default-job-35] |   |   `-- Installing xmlcatmgr-2.2_4...
[150amd64-default-job-35] |   |   `-- Extracting xmlcatmgr-2.2_4: ......... done
 + Creating /usr/local/share/sgml/catalog
 + Registering CATALOG catalog.ports (SGML)
 + Creating /usr/local/share/sgml/catalog.ports
 + Creating /usr/local/share/xml/catalog
 + Registering nextCatalog catalog.ports (XML)
 + Creating /usr/local/share/xml/catalog.ports
[150amd64-default-job-35] |   | `-- Extracting iso8879-1986_3: .......... done
[150amd64-default-job-35] |   `-- Extracting docbook-sgml-4.5_1: .......... done
[150amd64-default-job-35] |   `-- Installing docbook-xml-5.0_3...
[150amd64-default-job-35] |   | `-- Installing xmlcharent-0.3_2...
[150amd64-default-job-35] |   | `-- Extracting xmlcharent-0.3_2: .......... done
[150amd64-default-job-35] |   `-- Extracting docbook-xml-5.0_3: .......... done
[150amd64-default-job-35] |   `-- Installing sdocbook-xml-1.1_2,2...
[150amd64-default-job-35] |   `-- Extracting sdocbook-xml-1.1_2,2: .......... done
[150amd64-default-job-35] `-- Extracting docbook-1.5: ... done
[150amd64-default-job-35] Extracting docbook-xsl-1.79.1_1,1: .......... done
=====
Message from xmlcatmgr-2.2_4:
<snip>
configure.ac:134: the top level
configure.ac:150: warning: The macro 'AC_HEADER_STDC' is obsolete.
configure.ac:150: You should run autoupdate.
./lib/autoconf/headers.m4:664: AC_HEADER_STDC is expanded from...
configure.ac:150: the top level
configure.ac:166: warning: The macro 'AC_PROG_GCC_TRADITIONAL' is obsolete.
configure.ac:166: You should run autoupdate.
./lib/autoconf/c.m4:1802: AC_PROG_GCC_TRADITIONAL is expanded from...
configure.ac:166: the top level
configure: loading site script /usr/ports/Templates/config.site
checking for gcc... cc
checking whether the C compiler works... yes
checking for C compiler default output file name... a.out
checking for suffix of executables... 
checking whether we are cross compiling... no
checking for suffix of object files... o
checking whether the compiler supports GNU C... yes
checking whether cc accepts -g... yes
checking for cc option to enable C23 features... unsupported
checking for cc option to enable C11 features... none needed
checking whether /usr/local/bin/python3.12 version is >= 3.0... yes
checking for /usr/local/bin/python3.12 version... 3.12
checking for /usr/local/bin/python3.12 platform... freebsd15
checking for GNU default /usr/local/bin/python3.12 prefix... ${prefix}
checking for GNU default /usr/local/bin/python3.12 exec_prefix... ${exec_prefix}
checking for /usr/local/bin/python3.12 script directory (pythondir)... ${PYTHON_PREFIX}/lib/python3.12/site-packages
checking for /usr/local/bin/python3.12 extension module directory (pyexecdir)... ${PYTHON_EXEC_PREFIX}/lib/python3.12/site-packages
checking how to run the C preprocessor... cpp
checking for headers required to compile python extensions... found
checking for a BSD-compatible install... /usr/bin/install -c
checking whether /usr/local/bin/gmake sets $(MAKE)... yes
checking for swig... no
checking for lilypond... no
checking for git... /usr/local/bin/git
checking for gs... no
checking for txt2man... /usr/local/bin/txt2man
./configure: -version: not found
./configure: --version: not found
checking for xgettext... /usr/local/bin/xgettext
checking for msgfmt... /usr/local/bin/msgfmt
checking for msgmerge... /usr/local/bin/msgmerge
checking for msggrep... /usr/local/bin/msggrep
checking for makeinfo... /usr/local/bin/makeinfo
checking for sed... (cached) /usr/bin/sed
checking for cat... /bin/cat
checking for itstool... no
checking for xsltproc... no
checking for /usr/local/share/xsl/docbook/xhtml/chunk.xsl... yes
checking for stdio.h... (cached) yes
checking for stdlib.h... (cached) yes
checking for string.h... (cached) yes
checking for inttypes.h... (cached) yes
checking for stdint.h... (cached) yes
checking for strings.h... (cached) yes
checking for sys/stat.h... (cached) yes
checking for sys/types.h... (cached) yes
checking for unistd.h... (cached) yes
checking for sys/soundcard.h... yes
checking for grep that handles long lines and -e... (cached) /usr/bin/grep
checking for egrep... (cached) /usr/bin/egrep
checking for fcntl.h... (cached) yes
checking for sys/ioctl.h... (cached) yes
checking for unistd.h... (cached) yes
checking for an ANSI C-conforming const... yes
configure: creating ./config.status
config.status: creating run-solfege.py
config.status: creating solfege/buildinfo.py
config.status: creating topdocs/defs.texi
config.status: creating windowsinstaller.iss
config.status: creating Makefile
config.status: WARNING:  'Makefile.in' seems to ignore the --datarootdir setting
config.status: creating autopackage/default.apspec
config.status: creating help/C/solfege.xml
config.status: creating config.h
configure: 
configure: Please remember to rerun configure if you change swig versions!
configure: 
configure: itstool was not found. This is no big deal, but it mean that the
configure: translated user manuals will not be updated if you make changes
configure: to the english manual.
===========================================================================
=======================<phase: build          >============================
===== env: NO_DEPENDS=yes USER=root UID=0 GID=0
===>  Building for solfege-nosound-3.23.5.p2_2
/usr/local/bin/msgfmt po/ca.po -o po/ca.mo
/usr/local/bin/msgfmt po/cs.po -o po/cs.mo
/usr/local/bin/msgfmt po/da.po -o po/da.mo
/usr/local/bin/msgfmt po/de.po -o po/de.mo
/usr/local/bin/msgfmt po/eo.po -o po/eo.mo
/usr/local/bin/msgfmt po/es.po -o po/es.mo
/usr/local/bin/msgfmt po/et.po -o po/et.mo
/usr/local/bin/msgfmt po/fa.po -o po/fa.mo
/usr/local/bin/msgfmt po/fi.po -o po/fi.mo
/usr/local/bin/msgfmt po/fr.po -o po/fr.mo
/usr/local/bin/msgfmt po/gl.po -o po/gl.mo
/usr/local/bin/msgfmt po/hr.po -o po/hr.mo
/usr/local/bin/msgfmt po/hu.po -o po/hu.mo
/usr/local/bin/msgfmt po/it.po -o po/it.mo
/usr/local/bin/msgfmt po/nb.po -o po/nb.mo
/usr/local/bin/msgfmt po/nl.po -o po/nl.mo
/usr/local/bin/msgfmt po/pl.po -o po/pl.mo
/usr/local/bin/msgfmt po/pt_BR.po -o po/pt_BR.mo
/usr/local/bin/msgfmt po/ru.po -o po/ru.mo
/usr/local/bin/msgfmt po/sk.po -o po/sk.mo
/usr/local/bin/msgfmt po/sv.po -o po/sv.mo
/usr/local/bin/msgfmt po/tr.po -o po/tr.mo
/usr/local/bin/msgfmt po/vi.po -o po/vi.mo
/usr/local/bin/msgfmt po/zh_CN.po -o po/zh_CN.mo
/usr/local/bin/python3.12 tools/generate_lessonfiles.py
/wrkdirs/usr/ports/audio/solfege/work/solfege-3.23.5pre2/solfege/filesystem.py:77: SyntaxWarning: invalid escape sequence '\P'
  Return the name of the C:\Program files folder.
/wrkdirs/usr/ports/audio/solfege/work/solfege-3.23.5pre2/solfege/lessonfile.py:234: SyntaxWarning: invalid escape sequence '\s'
  [rn][mod1][num][\s-]
/wrkdirs/usr/ports/audio/solfege/work/solfege-3.23.5pre2/solfege/lessonfile.py:237: SyntaxWarning: invalid escape sequence '\d'
  (?P<p2>[^\d\s-]*)
/wrkdirs/usr/ports/audio/solfege/work/solfege-3.23.5pre2/solfege/lessonfile.py:403: SyntaxWarning: invalid escape sequence '\s'
  and not relative to the complete mpd string with added \staff{ } etc.
/wrkdirs/usr/ports/audio/solfege/work/solfege-3.23.5pre2/solfege/lessonfile.py:743: SyntaxWarning: invalid escape sequence '\s'
  and not relative to the complete mpd string with added \staff{ } etc.
/wrkdirs/usr/ports/audio/solfege/work/solfege-3.23.5pre2/solfege/lessonfile.py:782: SyntaxWarning: invalid escape sequence '\m'
  k = "c \major"
/wrkdirs/usr/ports/audio/solfege/work/solfege-3.23.5pre2/solfege/lessonfile.py:783: SyntaxWarning: invalid escape sequence '\k'
  music = "\\staff{ \key %s\\stemUp <%s> }\n" \
/wrkdirs/usr/ports/audio/solfege/work/solfege-3.23.5pre2/solfege/lessonfile.py:785: SyntaxWarning: invalid escape sequence '\k'
  "\\staff{ \key %s\\clef bass \\stemUp <%s>}\n"\
/wrkdirs/usr/ports/audio/solfege/work/solfege-3.23.5pre2/solfege/lessonfile.py:1024: SyntaxWarning: invalid escape sequence '\s'
  more than one \staff command in a line.
/wrkdirs/usr/ports/audio/solfege/work/solfege-3.23.5pre2/solfege/lessonfile.py:1062: SyntaxWarning: invalid escape sequence '\d'
  m = re.match("(\d+)\s*x", s)
/wrkdirs/usr/ports/audio/solfege/work/solfege-3.23.5pre2/solfege/lessonfile.py:1077: SyntaxWarning: invalid escape sequence '\w'
  self.m_translation_re = re.compile("(?P<varname>\w+)\[(?P<lang>[\w_+]+)\]")
/wrkdirs/usr/ports/audio/solfege/work/solfege-3.23.5pre2/solfege/lessonfile.py:1233: SyntaxWarning: invalid escape sequence '\m'
  key = "c \major"
/wrkdirs/usr/ports/audio/solfege/work/solfege-3.23.5pre2/solfege/lessonfile.py:1259: SyntaxWarning: invalid escape sequence '\m'
  key -- the key the question is written in, for example "c \major"
/wrkdirs/usr/ports/audio/solfege/work/solfege-3.23.5pre2/solfege/lessonfile.py:1525: SyntaxWarning: invalid escape sequence '\d'
  m = re.match("([\d\.]+)%", self.header.test_requirement)
/wrkdirs/usr/ports/audio/solfege/work/solfege-3.23.5pre2/solfege/lessonfile.py:2106: SyntaxWarning: invalid escape sequence '\s'
  r = re.compile("header\s*{.*?}", re.MULTILINE | re.DOTALL)
/usr/local/bin/python3.12 tools/gen_regression_lessonfiles.py
/wrkdirs/usr/ports/audio/solfege/work/solfege-3.23.5pre2/tools/gen_regression_lessonfiles.py:72: SyntaxWarning: invalid escape sequence '\c'
  "\clef xxx c4 d e }",
/wrkdirs/usr/ports/audio/solfege/work/solfege-3.23.5pre2/tools/gen_regression_lessonfiles.py:87: SyntaxWarning: invalid escape sequence '\c'
  "\\staff{ \clef ERROR \n c",
/wrkdirs/usr/ports/audio/solfege/work/solfege-3.23.5pre2/tools/gen_regression_lessonfiles.py:88: SyntaxWarning: invalid escape sequence '\c'
  "\\staff{ \clef \n ERROR \n c",
LC_ALL=C makeinfo -I topdocs --no-split --no-headers --output INSTALL topdocs/INSTALL.texi
LC_ALL=C makeinfo -I topdocs --no-split --no-headers --output README topdocs/README.texi
/wrkdirs/usr/ports/audio/solfege/work/solfege-3.23.5pre2/solfege/cfg.py:87: SyntaxWarning: invalid escape sequence '\['
  section_re = re.compile("^\[([\w\:\/-_]*?)\]")
/wrkdirs/usr/ports/audio/solfege/work/solfege-3.23.5pre2/solfege/cfg.py:88: SyntaxWarning: invalid escape sequence '\w'
  value_re = re.compile("^([\w-]*?)=(.*)")
/wrkdirs/usr/ports/audio/solfege/work/solfege-3.23.5pre2/solfege/dataparser.py:61: SyntaxWarning: invalid escape sequence '\s'
  (\s+)|  #space
/wrkdirs/usr/ports/audio/solfege/work/solfege-3.23.5pre2/solfege/dataparser.py:230: SyntaxWarning: invalid escape sequence '\s'
  r = re.compile("#.*?coding\s*[:=]\s*([\w_.-]+)")
/wrkdirs/usr/ports/audio/solfege/work/solfege-3.23.5pre2/solfege/dataparser.py:247: SyntaxWarning: invalid escape sequence '\s'
  r = re.compile(b"#.*?coding\s*[:=]\s*([\w_.-]+)")
/wrkdirs/usr/ports/audio/solfege/work/solfege-3.23.5pre2/solfege/dataparser.py:403: SyntaxWarning: invalid escape sequence '\w'
  self.m_translation_re = re.compile("(?P<varname>\w+)\[(?P<lang>[\w_+]+)\]")
/wrkdirs/usr/ports/audio/solfege/work/solfege-3.23.5pre2/solfege/lfmod.py:45: SyntaxWarning: invalid escape sequence '\w'
  translation_re = re.compile("(?P<varname>\w+)\[(?P<lang>[\w_+]+)\]")
/wrkdirs/usr/ports/audio/solfege/work/solfege-3.23.5pre2/solfege/mpd/duration.py:40: SyntaxWarning: invalid escape sequence '\d'
  tre = re.compile("^(\d+)(\.*)$")
/wrkdirs/usr/ports/audio/solfege/work/solfege-3.23.5pre2/solfege/mpd/interval.py:309: SyntaxWarning: invalid escape sequence '\d'
  m = re.match("(m|M|d|a|p)(\d+)", s)
/wrkdirs/usr/ports/audio/solfege/work/solfege-3.23.5pre2/solfege/mpd/mpdutils.py:82: SyntaxWarning: invalid escape sequence '\['
  re_note = re.compile("(?P<beamstart>(\[\s*)?)(?P<chordstart>(\<\s*)?)(?P<pitchname>[a-zA-Z]+[',]*)(\d+\.*)?")
/wrkdirs/usr/ports/audio/solfege/work/solfege-3.23.5pre2/solfege/osutils.py:211: SyntaxWarning: invalid escape sequence '\c'
  %PROGRAMFILES%\csound\bin\csound.exe
LC_ALL=C makeinfo -I topdocs --no-split --no-headers --output FAQ topdocs/FAQ.texi
LC_ALL=C makeinfo -I topdocs --no-split --no-headers --output INSTALL.win32 topdocs/INSTALL.win32.texi
/usr/local/bin/python3.12 tools/gen_rhythms_table.py
/usr/local/bin/python3.12 -c "import tools.buildutil; tools.buildutil.create_languages_py()"
/wrkdirs/usr/ports/audio/solfege/work/solfege-3.23.5pre2/tools/buildutil.py:57: SyntaxWarning: invalid escape sequence '\s'
  options = re.sub('--disable-exception-handler\s*',
/usr/local/bin/python3.12 -c "import tools.buildutil; tools.buildutil.create_versions_file('/usr/local/bin/git')"
mkdir -p share/locale/ca/LC_MESSAGES
cp po/ca.mo share/locale/ca/LC_MESSAGES/solfege.mo
Traceback (most recent call last):
  File "<string>", line 1, in <module>
  File "/wrkdirs/usr/ports/audio/solfege/work/solfege-3.23.5pre2/tools/buildutil.py", line 87, in create_versions_file
    version_info = {'git_sha': get_last_git_sha(git)}
                               ^^^^^^^^^^^^^^^^^^^^^
  File "/wrkdirs/usr/ports/audio/solfege/work/solfege-3.23.5pre2/tools/buildutil.py", line 83, in get_last_git_sha
    raise Exception("git_last_git_sha failed")
Exception: git_last_git_sha failed
mkdir -p share/locale/cs/LC_MESSAGES
cp po/cs.mo share/locale/cs/LC_MESSAGES/solfege.mo
mkdir -p share/locale/da/LC_MESSAGES
gmake: *** [Makefile:212: solfege/_version.py] Error 1
gmake: *** Waiting for unfinished jobs....
cp po/da.mo share/locale/da/LC_MESSAGES/solfege.mo
===> Compilation failed unexpectedly.
Try to set MAKE_JOBS_UNSAFE=yes and rebuild before reporting the failure to
the maintainer.
*** Error code 1

Stop.
make: stopped making "build" in /usr/ports/audio/solfege