[package - 144i386-default][devel/llvm23] Failed for llvm23-lite-23.1.0.r2 in build
- Go to: [ bottom of page ] [ top of archives ] [ this month ]
Date: Wed, 05 Aug 2026 04:46:12 UTC
You are receiving this mail as a port that you maintain
is failing to build on the FreeBSD package build server.
Please investigate the failure and submit a PR to fix
build.
Maintainer: brooks@FreeBSD.org
Log URL: https://pkg-status.freebsd.org/beefy18/data/144i386-default/21e0e5c9488a/logs/llvm23-lite-23.1.0.r2.log
Build URL: https://pkg-status.freebsd.org/beefy18/build.html?mastername=144i386-default&build=21e0e5c9488a
Log:
=>> Building devel/llvm23
build started at Wed Aug 5 04:44:05 UTC 2026
port directory: /usr/ports/devel/llvm23
package name: llvm23-lite-23.1.0.r2
building for: FreeBSD 144i386-default-job-08 14.4-RELEASE-p8 FreeBSD 14.4-RELEASE-p8 i386
maintained by: brooks@FreeBSD.org
Makefile datestamp: -rw-r--r-- 1 root wheel 25961 Aug 4 01:01 /usr/ports/devel/llvm23/Makefile
Ports top last git commit: 21e0e5c9488ae02961d52e6caa4288589f947b45
Ports top unclean checkout: no
Port dir last git commit: 02fb4e16e84b146342795569abbd28d20a7f2730
Port dir unclean checkout: no
Poudriere version: poudriere-git-3.4.8
Host OSVERSION: 1600019
Jail OSVERSION: 1404000
Job Id: 08
---Begin Environment---
SHELL=/bin/sh
BLOCKSIZE=K
MAIL=/var/mail/root
MM_CHARSET=UTF-8
LANG=C.UTF-8
OSVERSION=1404000
STATUS=1
HOME=/root
PATH=/sbin:/bin:/usr/sbin:/usr/bin:/usr/local/sbin:/usr/local/bin:/root/bin
MAKE_OBJDIR_CHECK_WRITABLE=0
UNAME_m=i386
UNAME_p=i386
UNAME_r=14.4-RELEASE-p8
LOCALBASE=/usr/local
UNAME_v=FreeBSD 14.4-RELEASE-p8
USER=root
POUDRIERE_NAME=poudriere-git
LIBEXECPREFIX=/usr/local/libexec/poudriere
POUDRIERE_VERSION=3.4.8
MASTERMNT=/usr/local/poudriere/data/.m/144i386-default/ref
LC_COLLATE=C
POUDRIERE_BUILD_TYPE=bulk
PACKAGE_BUILDING=yes
SAVED_TERM=
OUTPUT_REDIRECTED_STDERR=4
OUTPUT_REDIRECTED=1
PWD=/usr/local/poudriere/data/.m/144i386-default/08/.p
OUTPUT_REDIRECTED_STDOUT=3
P_PORTS_FEATURES=FLAVORS SUBPACKAGES SELECTED_OPTIONS
MASTERNAME=144i386-default
SCRIPTPREFIX=/usr/local/share/poudriere
SCRIPTNAME=bulk.sh
OLDPWD=/usr/local/poudriere/data/.m/144i386-default/ref/.p/pool
POUDRIERE_PKGNAME=poudriere-git-3.4.8
SCRIPTPATH=/usr/local/share/poudriere/bulk.sh
POUDRIEREPATH=/usr/local/bin/poudriere
---End Environment---
---Begin Poudriere Port Flags/Env---
PORT_FLAGS=
PKGENV=
FLAVOR=lite
MAKE_ARGS= FLAVOR=lite
---End Poudriere Port Flags/Env---
---Begin OPTIONS List---
===> The following configuration options are available for llvm23-lite-23.1.0.r2:
BE_AMDGPU=on: AMD GPU backend (required by mesa)
BE_WASM=on: WebAssembly backend (required by firefox via wasi)
CLANG=on: Build clang
COMPILER_RT=off: Sanitizer libraries
DOCS=on: Build and/or install documentation
LLD=on: Install lld, the LLVM linker
STATIC_LIBS=off: Install static libraries (does not effect sanitizers)
====> Options available for the single BACKENDS: you have to select exactly one of them
BE_FREEBSD=off: Backends for FreeBSD architectures
BE_NATIVE=on: Backend(s) for this architecture (X86)
BE_STANDARD=off: All non-experimental backends
===> Use 'make config' to modify these settings
---End OPTIONS List---
--MAINTAINER--
brooks@FreeBSD.org
--End MAINTAINER--
--CONFIGURE_ARGS--
--End CONFIGURE_ARGS--
--CONFIGURE_ENV--
PYTHON="/usr/local/bin/python3.12" ac_cv_path_PERL=/usr/local/bin/perl ac_cv_path_PERL_PATH=/usr/local/bin/perl PERL_USE_UNSAFE_INC=1 XDG_DATA_HOME=/wrkdirs/usr/ports/devel/llvm23/work-lite XDG_CONFIG_HOME=/wrkdirs/usr/ports/devel/llvm23/work-lite XDG_CACHE_HOME=/wrkdirs/usr/ports/devel/llvm23/work-lite/.cache HOME=/wrkdirs/usr/ports/devel/llvm23/work-lite TMPDIR="/tmp" PATH=/wrkdirs/usr/ports/devel/llvm23/work-lite/.bin:/sbin:/bin:/usr/sbin:/usr/bin:/usr/local/sbin:/usr/local/bin:/root/bin PKG_CONFIG_LIBDIR=/wrkdirs/usr/ports/devel/llvm23/work-lite/.pkgconfig:/usr/local/libdata/pkgconfig:/usr/local/share/pkgconfig:/usr/libdata/pkgconfig SHELL=/bin/sh CONFIG_SHELL=/bin/sh
--End CONFIGURE_ENV--
--MAKE_ENV--
NINJA_STATUS="[%p %s/%t] " PERL_USE_UNSAFE_INC=1 XDG_DATA_HOME=/wrkdirs/usr/ports/devel/llvm23/work-lite XDG_CONFIG_HOME=/wrkdirs/usr/ports/devel/llvm23/work-lite XDG_CACHE_HOME=/wrkdirs/usr/ports/devel/llvm23/work-lite/.cache HOME=/wrkdirs/usr/ports/devel/llvm23/work-lite TMPDIR="/tmp" PATH=/wrkdirs/usr/ports/devel/llvm23/work-lite/.bin:/sbin:/bin:/usr/sbin:/usr/bin:/usr/local/sbin:/usr/local/bin:/root/bin PKG_CONFIG_LIBDIR=/wrkdirs/usr/ports/devel/llvm23/work-lite/.pkgconfig:/usr/local/libdata/pkgconfig:/usr/local/share/pkgconfig:/usr/libdata/pkgconfig MK_DEBUG_FILES=no MK_KERNEL_SYMBOLS=no SHELL=/bin/sh NO_LINT=YES DESTDIR=/wrkdirs/usr/ports/devel/llvm23/work-lite/stage PREFIX=/usr/local LOCALBASE=/usr/local CC="cc" CFLAGS="-O2 -pipe -fstack-protector-strong -fno-strict-aliasing " CPP="cpp" CPPFLAGS="" LDFLAGS=" " LIBS="" CXX="c++" CXXFLAGS="-O2 -pipe -fstack-protector-strong -fno-strict-aliasing " BSD_INSTALL_PROGRAM="install -s -m 555" BSD_INSTALL_LIB="insta
ll -s -m 0644" BSD_INSTALL_SCRIPT="install -m 555" BSD_INSTALL_DATA="install -m 0644" BSD_INSTALL_MAN="install -m 444"
--End MAKE_ENV--
--PLIST_SUB--
CONFIGURE_TARGET=i386-portbld-freebsd14.4 LLVM_MAJOR_MINOR=23.1 LLVM_MAJOR=23 LLVM_RELEASE=23.1.0 LLVM_SUFFIX=23 PORTDOCS="" BE_AMDGPU="" NO_BE_AMDGPU="@comment " BE_FREEBSD="@comment " NO_BE_FREEBSD="" BE_NATIVE="" NO_BE_NATIVE="@comment " BE_STANDARD="@comment " NO_BE_STANDARD="" BE_WASM="" NO_BE_WASM="@comment " CLANG="" NO_CLANG="@comment " COMPILER_RT="@comment " NO_COMPILER_RT="" DOCS="" NO_DOCS="@comment " LLD="" NO_LLD="@comment " STATIC_LIBS="@comment " NO_STATIC_LIBS="" CMAKE_BUILD_TYPE="release" PYTHON_INCLUDEDIR=include/python3.12 PYTHON_LIBDIR=lib/python3.12 PYTHON_PLATFORM=freebsd14 PYTHON_SITELIBDIR=lib/python3.12/site-packages PYTHON_SUFFIX=312 PYTHON_BASESUFFIX=312 PYTHON_TAG=.cpython-312 PYTHON_SOABI=.cpython-312 PYTHON_VER=3.12 PYTHON_BASEVER=3.12 PYTHON_VERSION=python3.12 PYTHON2="@comment " PYTHON3="" EXTRAS="@comment " FLANG="@comment " GOLD="@comment " LIT="@comment " LLDB="@comment " MLIR="@comment " OPENMP="@comment " POLLY="@comment "
PYCLANG="@comment " OSREL=14.4 PREFIX=%D LOCALBASE=/usr/local RESETPREFIX=/usr/local LIB32DIR=lib PERL_VERSION=5.42.3 PERL_VER=5.42 PERL5_MAN1=lib/perl5/site_perl/man/man1 PERL5_MAN3=lib/perl5/site_perl/man/man3 SITE_PERL=lib/perl5/site_perl SITE_ARCH=lib/perl5/site_perl/mach/5.42 DOCSDIR="share/doc/llvm23" EXAMPLESDIR="share/examples/llvm" DATADIR="share/llvm23" WWWDIR="www/llvm" ETCDIR="etc/llvm"
--End PLIST_SUB--
--SUB_LIST--
LLVM_PREFIX="/usr/local/llvm23" LLVM_SUFFIX="23" BE_AMDGPU="" NO_BE_AMDGPU="@comment " BE_FREEBSD="@comment " NO_BE_FREEBSD="" BE_NATIVE="" NO_BE_NATIVE="@comment " BE_STANDARD="@comment " NO_BE_STANDARD="" BE_WASM="" NO_BE_WASM="@comment " CLANG="" NO_CLANG="@comment " XCC=clang23 XCXX=clang++23 XCPP=clang-cpp23 XLD=ld.lld23 X_COMPILER_TYPE=clang COMPILER_RT="@comment " NO_COMPILER_RT="" DOCS="" NO_DOCS="@comment " LLD="" NO_LLD="@comment " STATIC_LIBS="@comment " NO_STATIC_LIBS="" PYTHON_INCLUDEDIR=/usr/local/include/python3.12 PYTHON_LIBDIR=/usr/local/lib/python3.12 PYTHON_PLATFORM=freebsd14 PYTHON_SITELIBDIR=/usr/local/lib/python3.12/site-packages PYTHON_SUFFIX=312 PYTHON_BASESUFFIX=312 PYTHON_TAG=.cpython-312 PYTHON_SOABI=.cpython-312 PYTHON_VER=3.12 PYTHON_BASEVER=3.12 PYTHON_VERSION=python3.12 PYTHON2="@comment " PYTHON3="" PREFIX=/usr/local LOCALBASE=/usr/local DATADIR=/usr/local/share/llvm23 DOCSDIR=/usr/local/share/doc/llvm23 EXAMPLESDIR=/usr/local/s
hare/examples/llvm WWWDIR=/usr/local/www/llvm ETCDIR=/usr/local/etc/llvm
--End SUB_LIST--
---Begin make.conf---
USE_PACKAGE_DEPENDS=yes
BATCH=yes
WRKDIRPREFIX=/wrkdirs
PORTSDIR=/usr/ports
PACKAGES=/packages
DISTDIR=/distfiles
PACKAGE_BUILDING=yes
PACKAGE_BUILDING_FLAVORS=yes
MACHINE=i386
MACHINE_ARCH=i386
ARCH=${MACHINE_ARCH}
#### ####
# XXX: We really need this but cannot use it while 'make checksum' does not
# try the next mirror on checksum failure. It currently retries the same
# failed mirror and then fails rather then trying another. It *does*
# try the next if the size is mismatched though.
#MASTER_SITE_FREEBSD=yes
# Build ALLOW_MAKE_JOBS_PACKAGES with 3 jobs
MAKE_JOBS_NUMBER=3
#### Misc Poudriere ####
.include "/etc/make.conf.ports_env"
GID=0
UID=0
---End make.conf---
--Resource limits--
cpu time (seconds, -t) unlimited
file size (512-blocks, -f) unlimited
data seg size (kbytes, -d) 524288
stack size (kbytes, -s) 65536
core file size (512-blocks, -c) unlimited
max memory size (kbytes, -m) unlimited
locked memory (kbytes, -l) unlimited
max user processes (-u) 89999
open files (-n) 8192
virtual mem size (kbytes, -v) unlimited
swap limit (kbytes, -w) unlimited
socket buffer size (bytes, -b) unlimited
pseudo-terminals (-p) unlimited
kqueues (-k) unlimited
umtx shared locks (-o) unlimited
pipebuf (-y) unlimited
--End resource limits--
=======================<phase: check-sanity >============================
===== env: NO_DEPENDS=yes USER=root UID=0 GID=0
===> License BSD3CLAUSE LLVM LLVM2 MIT PD REGEX accepted by the user
===========================================================================
=======================<phase: pkg-depends >============================
===== env: USE_PACKAGE_DEPENDS_ONLY=1 USER=root UID=0 GID=0
===> llvm23-lite-23.1.0.r2 depends on file: /usr/local/sbin/pkg - not found
===> Installing existing package /packages/All/pkg-2.8.1_1.pkg
[144i386-default-job-08] Installing pkg-2.8.1_1...
[144i386-default-job-08] Extracting pkg-2.8.1_1: .......... done
===> llvm23-lite-23.1.0.r2 depends on file: /usr/local/sbin/pkg - found
===> Returning to build of llvm23-lite-23.1.0.r2
===========================================================================
=======================<phase: fetch-depends >============================
===== env: USE_PACKAGE_DEPENDS_ONLY=1 USER=root UID=0 GID=0
===========================================================================
=======================<phase: fetch >============================
===== env: NO_DEPENDS=yes USER=root UID=0 GID=0
===> License BSD3CLAUSE LLVM LLVM2 MIT PD REGEX accepted by the user
===> Fetching all distfiles required by llvm23-lite-23.1.0.r2 for building
===========================================================================
=======================<phase: checksum >============================
===== env: NO_DEPENDS=yes USER=root UID=0 GID=0
===> License BSD3CLAUSE LLVM LLVM2 MIT PD REGEX accepted by the user
===> Fetching all distfiles required by llvm23-lite-23.1.0.r2 for building
=> SHA256 Checksum OK for llvm-project-23.1.0-rc2.src.tar.xz.
===========================================================================
=======================<phase: extract-depends>============================
===== env: USE_PACKAGE_DEPENDS_ONLY=1 USER=root UID=0 GID=0
===========================================================================
=======================<phase: extract >============================
===== env: NO_DEPENDS=yes USER=root UID=0 GID=0
===> License BSD3CLAUSE LLVM LLVM2 MIT PD REGEX accepted by the user
===> Fetching all distfiles required by llvm23-lite-23.1.0.r2 for building
===> Extracting for llvm23-lite-23.1.0.r2
=> SHA256 Checksum OK for llvm-project-23.1.0-rc2.src.tar.xz.
===========================================================================
=======================<phase: patch-depends >============================
===== env: USE_PACKAGE_DEPENDS_ONLY=1 USER=root UID=0 GID=0
===========================================================================
=======================<phase: patch >============================
===== env: NO_DEPENDS=yes USER=root UID=0 GID=0
===> Patching for llvm23-lite-23.1.0.r2
===> Applying FreeBSD patches for llvm23-lite-23.1.0.r2 from /usr/ports/devel/llvm23/files
/usr/bin/sed -i.bak -e 's|import lit|import lit23|' -e 's|from lit|from lit23|' -e 's|lit\.|lit23.|g' /wrkdirs/usr/ports/devel/llvm23/work-lite/llvm-project-23.1.0-rc2.src/llvm/utils/lit/lit.py /wrkdirs/usr/ports/devel/llvm23/work-lite/llvm-project-23.1.0-rc2.src/llvm/utils/lit/lit/*.py /wrkdirs/usr/ports/devel/llvm23/work-lite/llvm-project-23.1.0-rc2.src/llvm/utils/lit/lit/formats/*.py
/usr/bin/sed -i.bak -e 's,/usr/local/,/usr/local/,' /wrkdirs/usr/ports/devel/llvm23/work-lite/llvm-project-23.1.0-rc2.src/llvm/CMakeLists.txt
/usr/bin/sed -i.bak -e 's|%%LLVM_PREFIX%%|/usr/local/llvm23|' /wrkdirs/usr/ports/devel/llvm23/work-lite/llvm-project-23.1.0-rc2.src/clang/lib/Driver/ToolChains/CommonArgs.cpp
/usr/bin/sed -i.bak -e 's|%%LLVM_SUFFIX%%|23|' /wrkdirs/usr/ports/devel/llvm23/work-lite/llvm-project-23.1.0-rc2.src/clang/tools/clang-format/clang-format.py /wrkdirs/usr/ports/devel/llvm23/work-lite/llvm-project-23.1.0-rc2.src/clang/tools/clang-format/clang-format-sublime.py /wrkdirs/usr/ports/devel/llvm23/work-lite/llvm-project-23.1.0-rc2.src/clang/tools/clang-format/git-clang-format
/usr/bin/sed -i.bak -e "s|'indexsidebar.html'|['indexsidebar.html']|" /wrkdirs/usr/ports/devel/llvm23/work-lite/llvm-project-23.1.0-rc2.src/lld/docs/conf.py
===========================================================================
=======================<phase: build-depends >============================
===== env: USE_PACKAGE_DEPENDS_ONLY=1 USER=root UID=0 GID=0
===> llvm23-lite-23.1.0.r2 depends on package: py312-myst-parser>0 - not found
===> Installing existing package /packages/All/py312-myst-parser-5.1.0_1.pkg
<snip>
-- Performing Test CXX_WSUGGEST_OVERRIDE_ALLOWS_ONLY_FINAL - Success
-- Performing Test C_WCOMMENT_ALLOWS_LINE_WRAP
-- Performing Test C_WCOMMENT_ALLOWS_LINE_WRAP - Success
-- Performing Test C_SUPPORTS_MISLEADING_INDENTATION_FLAG
-- Performing Test C_SUPPORTS_MISLEADING_INDENTATION_FLAG - Success
-- Performing Test CXX_SUPPORTS_MISLEADING_INDENTATION_FLAG
-- Performing Test CXX_SUPPORTS_MISLEADING_INDENTATION_FLAG - Success
-- Performing Test C_SUPPORTS_CTAD_MAYBE_UNSUPPORTED_FLAG
-- Performing Test C_SUPPORTS_CTAD_MAYBE_UNSUPPORTED_FLAG - Success
-- Performing Test CXX_SUPPORTS_CTAD_MAYBE_UNSUPPORTED_FLAG
-- Performing Test CXX_SUPPORTS_CTAD_MAYBE_UNSUPPORTED_FLAG - Success
-- Performing Test LINKER_SUPPORTS_COLOR_DIAGNOSTICS
-- Performing Test LINKER_SUPPORTS_COLOR_DIAGNOSTICS - Success
-- Precompiled headers enabled.
-- Looking for os_signpost_interval_begin
-- Looking for os_signpost_interval_begin - not found
-- Looking for flock
-- Looking for flock - found
-- Linker detection: LLD
-- Performing Test LLVM_LINKER_SUPPORTS_B_SYMBOLIC_FUNCTIONS
-- Performing Test LLVM_LINKER_SUPPORTS_B_SYMBOLIC_FUNCTIONS - Success
-- Performing Test HAS_WERROR_GLOBAL_CTORS
-- Performing Test HAS_WERROR_GLOBAL_CTORS - Success
-- Performing Test LLVM_HAS_NOGLOBAL_CTOR_MUTEX
-- Performing Test LLVM_HAS_NOGLOBAL_CTOR_MUTEX - Failed
-- Looking for __x86_64__
-- Looking for __x86_64__ - not found
-- Could NOT find Git (missing: GIT_EXECUTABLE)
-- Looking for logf128
-- Looking for logf128 - not found
-- Targeting X86
-- Targeting AMDGPU
-- Targeting WebAssembly
-- LLD version: 23.1.0
-- Could NOT find Git (missing: GIT_EXECUTABLE)
-- Could NOT find Git (missing: GIT_EXECUTABLE)
-- Sphinx enabled.
-- Found Sphinx: /usr/local/bin/sphinx-build-3.12
-- Looking for sys/resource.h
-- Looking for sys/resource.h - found
-- Looking for dlfcn.h
-- Looking for dlfcn.h - found
-- Looking for dladdr
-- Looking for dladdr - found
-- Clang version: 23.1.0
-- Could NOT find Git (missing: GIT_EXECUTABLE)
-- Could NOT find Git (missing: GIT_EXECUTABLE)
-- Performing Test HAVE_LINKER_FLAG_LONG_PLT
-- Performing Test HAVE_LINKER_FLAG_LONG_PLT - Success
-- Found Perl: /usr/local/bin/perl (found version "5.42.3")
-- Found Python3: /usr/local/bin/python3.12 (found version "3.12.13") found components: Interpreter
-- Sphinx enabled.
-- Not building llvm-mt because libxml2 is not available
-- Registering ExampleIRTransforms as a pass plugin (static build: OFF)
-- Registering Bye as a pass plugin (static build: OFF)
-- Sphinx enabled.
-- Could NOT find Git (missing: GIT_EXECUTABLE)
-- Google Benchmark version: v1.9.5, normalized to 1.9.5
-- Looking for shm_open in rt
-- Looking for shm_open in rt - found
-- Performing Test HAVE_CXX_FLAG_WALL
-- Performing Test HAVE_CXX_FLAG_WALL - Success
-- Performing Test HAVE_CXX_FLAG_WEXTRA
-- Performing Test HAVE_CXX_FLAG_WEXTRA - Success
-- Performing Test HAVE_CXX_FLAG_WSHADOW
-- Performing Test HAVE_CXX_FLAG_WSHADOW - Success
-- Performing Test HAVE_CXX_FLAG_WFLOAT_EQUAL
-- Performing Test HAVE_CXX_FLAG_WFLOAT_EQUAL - Success
-- Performing Test HAVE_CXX_FLAG_WOLD_STYLE_CAST
-- Performing Test HAVE_CXX_FLAG_WOLD_STYLE_CAST - Success
-- Performing Test HAVE_CXX_FLAG_WCONVERSION
-- Performing Test HAVE_CXX_FLAG_WCONVERSION - Success
-- Performing Test HAVE_CXX_FLAG_WFORMAT_2
-- Performing Test HAVE_CXX_FLAG_WFORMAT_2 - Success
-- Performing Test HAVE_CXX_FLAG_WSUGGEST_OVERRIDE
-- Performing Test HAVE_CXX_FLAG_WSUGGEST_OVERRIDE - Success
-- Performing Test HAVE_CXX_FLAG_PEDANTIC
-- Performing Test HAVE_CXX_FLAG_PEDANTIC - Success
-- Performing Test HAVE_CXX_FLAG_PEDANTIC_ERRORS
-- Performing Test HAVE_CXX_FLAG_PEDANTIC_ERRORS - Success
-- Performing Test HAVE_CXX_FLAG_WSHORTEN_64_TO_32
-- Performing Test HAVE_CXX_FLAG_WSHORTEN_64_TO_32 - Success
-- Performing Test HAVE_CXX_FLAG_FSTRICT_ALIASING
-- Performing Test HAVE_CXX_FLAG_FSTRICT_ALIASING - Success
-- Performing Test HAVE_CXX_FLAG_WNO_DEPRECATED_DECLARATIONS
-- Performing Test HAVE_CXX_FLAG_WNO_DEPRECATED_DECLARATIONS - Success
-- Performing Test HAVE_CXX_FLAG_FNO_EXCEPTIONS
-- Performing Test HAVE_CXX_FLAG_FNO_EXCEPTIONS - Success
-- Performing Test HAVE_CXX_FLAG_WSTRICT_ALIASING
-- Performing Test HAVE_CXX_FLAG_WSTRICT_ALIASING - Success
-- Performing Test HAVE_CXX_FLAG_WTHREAD_SAFETY
-- Performing Test HAVE_CXX_FLAG_WTHREAD_SAFETY - Success
-- Enabling additional flags: -DINCLUDE_DIRECTORIES=/wrkdirs/usr/ports/devel/llvm23/work-lite/llvm-project-23.1.0-rc2.src/third-party/benchmark/include
-- Performing Test THREAD_SAFETY_ATTRIBUTES -- success
-- Performing Test HAVE_CXX_FLAG_COVERAGE
-- Performing Test HAVE_CXX_FLAG_COVERAGE - Success
CMake Warning at /wrkdirs/usr/ports/devel/llvm23/work-lite/llvm-project-23.1.0-rc2.src/third-party/benchmark/CMakeLists.txt:329 (message):
Using std::regex with exceptions disabled is not fully supported
-- Performing Test STEADY_CLOCK -- success
-- Performing Test PTHREAD_AFFINITY -- failed
-- Configuring done (34.8s)
-- Generating done (12.9s)
CMake Warning:
Manually-specified variables were not used by the project:
BOOST_PYTHON_SUFFIX
CMAKE_COLOR_MAKEFILE
CMAKE_VERBOSE_MAKEFILE
FETCHCONTENT_FULLY_DISCONNECTED
Python_ADDITIONAL_VERSIONS
Python_EXECUTABLE
-- Build files have been written to: /wrkdirs/usr/ports/devel/llvm23/work-lite/.build
===========================================================================
=======================<phase: build >============================
===== env: NO_DEPENDS=yes USER=root UID=0 GID=0
===> Building for llvm23-lite-23.1.0.r2
[ 0% 3/4883] /usr/bin/c++ -DLLVM_EXPORTS -D_FILE_OFFSET_BITS=64 -D_LARGEFILE_SOURCE -D__STDC_CONSTANT_MACROS -D__STDC_FORMAT_MACROS -D__STDC_LIMIT_MACROS -I/wrkdirs/usr/ports/devel/llvm23/work-lite/.build/lib/Demangle -I/wrkdirs/usr/ports/devel/llvm23/work-lite/llvm-project-23.1.0-rc2.src/llvm/lib/Demangle -I/wrkdirs/usr/ports/devel/llvm23/work-lite/.build/include -I/wrkdirs/usr/ports/devel/llvm23/work-lite/llvm-project-23.1.0-rc2.src/llvm/include -O2 -pipe -fstack-protector-strong -fno-strict-aliasing -fPIC -fno-semantic-interposition -fvisibility-inlines-hidden -Werror=date-time -Werror=unguarded-availability-new -Wall -Wextra -Wno-unused-parameter -Wwrite-strings -Wcast-qual -Wmissing-field-initializers -pedantic -Wno-long-long -Wc++98-compat-extra-semi -Wimplicit-fallthrough -Wcovered-switch-default -Wno-noexcept-type -Wnon-virtual-dtor -Wdelete-non-virtual-dtor -Wsuggest-override -Wstring-conversion -Wno-pass-failed -Wmisleading-indentation -Wctad-maybe-unsupported -fd
iagnostics-color -ffunction-sections -fdata-sections -Xclang -fno-pch-timestamp -O2 -pipe -fstack-protector-strong -fno-strict-aliasing -DNDEBUG -std=c++17 -fno-exceptions -funwind-tables -MD -MT lib/Demangle/CMakeFiles/LLVMDemangle.dir/Demangle.cpp.o -MF lib/Demangle/CMakeFiles/LLVMDemangle.dir/Demangle.cpp.o.d -o lib/Demangle/CMakeFiles/LLVMDemangle.dir/Demangle.cpp.o -c /wrkdirs/usr/ports/devel/llvm23/work-lite/llvm-project-23.1.0-rc2.src/llvm/lib/Demangle/Demangle.cpp
[ 0% 4/4883] /usr/bin/c++ -DLLVM_EXPORTS -D_FILE_OFFSET_BITS=64 -D_LARGEFILE_SOURCE -D__STDC_CONSTANT_MACROS -D__STDC_FORMAT_MACROS -D__STDC_LIMIT_MACROS -I/wrkdirs/usr/ports/devel/llvm23/work-lite/.build/lib/Demangle -I/wrkdirs/usr/ports/devel/llvm23/work-lite/llvm-project-23.1.0-rc2.src/llvm/lib/Demangle -I/wrkdirs/usr/ports/devel/llvm23/work-lite/.build/include -I/wrkdirs/usr/ports/devel/llvm23/work-lite/llvm-project-23.1.0-rc2.src/llvm/include -O2 -pipe -fstack-protector-strong -fno-strict-aliasing -fPIC -fno-semantic-interposition -fvisibility-inlines-hidden -Werror=date-time -Werror=unguarded-availability-new -Wall -Wextra -Wno-unused-parameter -Wwrite-strings -Wcast-qual -Wmissing-field-initializers -pedantic -Wno-long-long -Wc++98-compat-extra-semi -Wimplicit-fallthrough -Wcovered-switch-default -Wno-noexcept-type -Wnon-virtual-dtor -Wdelete-non-virtual-dtor -Wsuggest-override -Wstring-conversion -Wno-pass-failed -Wmisleading-indentation -Wctad-maybe-unsupported -fd
iagnostics-color -ffunction-sections -fdata-sections -Xclang -fno-pch-timestamp -O2 -pipe -fstack-protector-strong -fno-strict-aliasing -DNDEBUG -std=c++17 -fno-exceptions -funwind-tables -MD -MT lib/Demangle/CMakeFiles/LLVMDemangle.dir/MicrosoftDemangle.cpp.o -MF lib/Demangle/CMakeFiles/LLVMDemangle.dir/MicrosoftDemangle.cpp.o.d -o lib/Demangle/CMakeFiles/LLVMDemangle.dir/MicrosoftDemangle.cpp.o -c /wrkdirs/usr/ports/devel/llvm23/work-lite/llvm-project-23.1.0-rc2.src/llvm/lib/Demangle/MicrosoftDemangle.cpp
[ 0% 5/4883] /usr/bin/c++ -DLLVM_EXPORTS -D_FILE_OFFSET_BITS=64 -D_LARGEFILE_SOURCE -D__STDC_CONSTANT_MACROS -D__STDC_FORMAT_MACROS -D__STDC_LIMIT_MACROS -I/wrkdirs/usr/ports/devel/llvm23/work-lite/.build/lib/Demangle -I/wrkdirs/usr/ports/devel/llvm23/work-lite/llvm-project-23.1.0-rc2.src/llvm/lib/Demangle -I/wrkdirs/usr/ports/devel/llvm23/work-lite/.build/include -I/wrkdirs/usr/ports/devel/llvm23/work-lite/llvm-project-23.1.0-rc2.src/llvm/include -O2 -pipe -fstack-protector-strong -fno-strict-aliasing -fPIC -fno-semantic-interposition -fvisibility-inlines-hidden -Werror=date-time -Werror=unguarded-availability-new -Wall -Wextra -Wno-unused-parameter -Wwrite-strings -Wcast-qual -Wmissing-field-initializers -pedantic -Wno-long-long -Wc++98-compat-extra-semi -Wimplicit-fallthrough -Wcovered-switch-default -Wno-noexcept-type -Wnon-virtual-dtor -Wdelete-non-virtual-dtor -Wsuggest-override -Wstring-conversion -Wno-pass-failed -Wmisleading-indentation -Wctad-maybe-unsupported -fd
iagnostics-color -ffunction-sections -fdata-sections -Xclang -fno-pch-timestamp -O2 -pipe -fstack-protector-strong -fno-strict-aliasing -DNDEBUG -std=c++17 -fno-exceptions -funwind-tables -MD -MT lib/Demangle/CMakeFiles/LLVMDemangle.dir/MicrosoftDemangleNodes.cpp.o -MF lib/Demangle/CMakeFiles/LLVMDemangle.dir/MicrosoftDemangleNodes.cpp.o.d -o lib/Demangle/CMakeFiles/LLVMDemangle.dir/MicrosoftDemangleNodes.cpp.o -c /wrkdirs/usr/ports/devel/llvm23/work-lite/llvm-project-23.1.0-rc2.src/llvm/lib/Demangle/MicrosoftDemangleNodes.cpp
[ 0% 6/4883] /usr/bin/c++ -DLLVM_EXPORTS -D_FILE_OFFSET_BITS=64 -D_LARGEFILE_SOURCE -D__STDC_CONSTANT_MACROS -D__STDC_FORMAT_MACROS -D__STDC_LIMIT_MACROS -I/wrkdirs/usr/ports/devel/llvm23/work-lite/.build/lib/Demangle -I/wrkdirs/usr/ports/devel/llvm23/work-lite/llvm-project-23.1.0-rc2.src/llvm/lib/Demangle -I/wrkdirs/usr/ports/devel/llvm23/work-lite/.build/include -I/wrkdirs/usr/ports/devel/llvm23/work-lite/llvm-project-23.1.0-rc2.src/llvm/include -O2 -pipe -fstack-protector-strong -fno-strict-aliasing -fPIC -fno-semantic-interposition -fvisibility-inlines-hidden -Werror=date-time -Werror=unguarded-availability-new -Wall -Wextra -Wno-unused-parameter -Wwrite-strings -Wcast-qual -Wmissing-field-initializers -pedantic -Wno-long-long -Wc++98-compat-extra-semi -Wimplicit-fallthrough -Wcovered-switch-default -Wno-noexcept-type -Wnon-virtual-dtor -Wdelete-non-virtual-dtor -Wsuggest-override -Wstring-conversion -Wno-pass-failed -Wmisleading-indentation -Wctad-maybe-unsupported -fd
iagnostics-color -ffunction-sections -fdata-sections -Xclang -fno-pch-timestamp -O2 -pipe -fstack-protector-strong -fno-strict-aliasing -DNDEBUG -std=c++17 -fno-exceptions -funwind-tables -MD -MT lib/Demangle/CMakeFiles/LLVMDemangle.dir/DLangDemangle.cpp.o -MF lib/Demangle/CMakeFiles/LLVMDemangle.dir/DLangDemangle.cpp.o.d -o lib/Demangle/CMakeFiles/LLVMDemangle.dir/DLangDemangle.cpp.o -c /wrkdirs/usr/ports/devel/llvm23/work-lite/llvm-project-23.1.0-rc2.src/llvm/lib/Demangle/DLangDemangle.cpp
[ 0% 7/4883] /usr/bin/c++ -DLLVM_EXPORTS -D_FILE_OFFSET_BITS=64 -D_LARGEFILE_SOURCE -D__STDC_CONSTANT_MACROS -D__STDC_FORMAT_MACROS -D__STDC_LIMIT_MACROS -I/wrkdirs/usr/ports/devel/llvm23/work-lite/.build/lib/Demangle -I/wrkdirs/usr/ports/devel/llvm23/work-lite/llvm-project-23.1.0-rc2.src/llvm/lib/Demangle -I/wrkdirs/usr/ports/devel/llvm23/work-lite/.build/include -I/wrkdirs/usr/ports/devel/llvm23/work-lite/llvm-project-23.1.0-rc2.src/llvm/include -O2 -pipe -fstack-protector-strong -fno-strict-aliasing -fPIC -fno-semantic-interposition -fvisibility-inlines-hidden -Werror=date-time -Werror=unguarded-availability-new -Wall -Wextra -Wno-unused-parameter -Wwrite-strings -Wcast-qual -Wmissing-field-initializers -pedantic -Wno-long-long -Wc++98-compat-extra-semi -Wimplicit-fallthrough -Wcovered-switch-default -Wno-noexcept-type -Wnon-virtual-dtor -Wdelete-non-virtual-dtor -Wsuggest-override -Wstring-conversion -Wno-pass-failed -Wmisleading-indentation -Wctad-maybe-unsupported -fd
iagnostics-color -ffunction-sections -fdata-sections -Xclang -fno-pch-timestamp -O2 -pipe -fstack-protector-strong -fno-strict-aliasing -DNDEBUG -std=c++17 -fno-exceptions -funwind-tables -MD -MT lib/Demangle/CMakeFiles/LLVMDemangle.dir/RustDemangle.cpp.o -MF lib/Demangle/CMakeFiles/LLVMDemangle.dir/RustDemangle.cpp.o.d -o lib/Demangle/CMakeFiles/LLVMDemangle.dir/RustDemangle.cpp.o -c /wrkdirs/usr/ports/devel/llvm23/work-lite/llvm-project-23.1.0-rc2.src/llvm/lib/Demangle/RustDemangle.cpp
[ 0% 8/4883] /usr/bin/cc -DLLVM_EXPORTS -D_FILE_OFFSET_BITS=64 -D_LARGEFILE_SOURCE -D__STDC_CONSTANT_MACROS -D__STDC_FORMAT_MACROS -D__STDC_LIMIT_MACROS -I/wrkdirs/usr/ports/devel/llvm23/work-lite/.build/lib/Support -I/wrkdirs/usr/ports/devel/llvm23/work-lite/llvm-project-23.1.0-rc2.src/llvm/lib/Support -I/wrkdirs/usr/ports/devel/llvm23/work-lite/.build/include -I/wrkdirs/usr/ports/devel/llvm23/work-lite/llvm-project-23.1.0-rc2.src/llvm/include -I/wrkdirs/usr/ports/devel/llvm23/work-lite/llvm-project-23.1.0-rc2.src/llvm/../third-party/siphash/include -I/wrkdirs/usr/ports/devel/llvm23/work-lite/llvm-project-23.1.0-rc2.src/llvm/../libc -isystem /usr/local/include -O2 -pipe -fstack-protector-strong -fno-strict-aliasing -fPIC -fno-semantic-interposition -Werror=date-time -Werror=unguarded-availability-new -Wall -Wextra -Wno-unused-parameter -Wwrite-strings -Wcast-qual -Wmissing-field-initializers -pedantic -Wno-long-long -Wc++98-compat-extra-semi -Wimplicit-fallthrough -Wcover
ed-switch-default -Wstring-conversion -Wmisleading-indentation -Wctad-maybe-unsupported -fdiagnostics-color -ffunction-sections -fdata-sections -O2 -pipe -fstack-protector-strong -fno-strict-aliasing -DNDEBUG -Wno-c99-extensions -MD -MT lib/Support/CMakeFiles/LLVMSupport.dir/regcomp.c.o -MF lib/Support/CMakeFiles/LLVMSupport.dir/regcomp.c.o.d -o lib/Support/CMakeFiles/LLVMSupport.dir/regcomp.c.o -c /wrkdirs/usr/ports/devel/llvm23/work-lite/llvm-project-23.1.0-rc2.src/llvm/lib/Support/regcomp.c
[ 0% 9/4883] /usr/bin/cc -DLLVM_EXPORTS -D_FILE_OFFSET_BITS=64 -D_LARGEFILE_SOURCE -D__STDC_CONSTANT_MACROS -D__STDC_FORMAT_MACROS -D__STDC_LIMIT_MACROS -I/wrkdirs/usr/ports/devel/llvm23/work-lite/.build/lib/Support -I/wrkdirs/usr/ports/devel/llvm23/work-lite/llvm-project-23.1.0-rc2.src/llvm/lib/Support -I/wrkdirs/usr/ports/devel/llvm23/work-lite/.build/include -I/wrkdirs/usr/ports/devel/llvm23/work-lite/llvm-project-23.1.0-rc2.src/llvm/include -I/wrkdirs/usr/ports/devel/llvm23/work-lite/llvm-project-23.1.0-rc2.src/llvm/../third-party/siphash/include -I/wrkdirs/usr/ports/devel/llvm23/work-lite/llvm-project-23.1.0-rc2.src/llvm/../libc -isystem /usr/local/include -O2 -pipe -fstack-protector-strong -fno-strict-aliasing -fPIC -fno-semantic-interposition -Werror=date-time -Werror=unguarded-availability-new -Wall -Wextra -Wno-unused-parameter -Wwrite-strings -Wcast-qual -Wmissing-field-initializers -pedantic -Wno-long-long -Wc++98-compat-extra-semi -Wimplicit-fallthrough -Wcover
ed-switch-default -Wstring-conversion -Wmisleading-indentation -Wctad-maybe-unsupported -fdiagnostics-color -ffunction-sections -fdata-sections -O2 -pipe -fstack-protector-strong -fno-strict-aliasing -DNDEBUG -Wno-c99-extensions -MD -MT lib/Support/CMakeFiles/LLVMSupport.dir/regerror.c.o -MF lib/Support/CMakeFiles/LLVMSupport.dir/regerror.c.o.d -o lib/Support/CMakeFiles/LLVMSupport.dir/regerror.c.o -c /wrkdirs/usr/ports/devel/llvm23/work-lite/llvm-project-23.1.0-rc2.src/llvm/lib/Support/regerror.c
[ 0% 10/4883] /usr/bin/cc -DLLVM_EXPORTS -D_FILE_OFFSET_BITS=64 -D_LARGEFILE_SOURCE -D__STDC_CONSTANT_MACROS -D__STDC_FORMAT_MACROS -D__STDC_LIMIT_MACROS -I/wrkdirs/usr/ports/devel/llvm23/work-lite/.build/lib/Support -I/wrkdirs/usr/ports/devel/llvm23/work-lite/llvm-project-23.1.0-rc2.src/llvm/lib/Support -I/wrkdirs/usr/ports/devel/llvm23/work-lite/.build/include -I/wrkdirs/usr/ports/devel/llvm23/work-lite/llvm-project-23.1.0-rc2.src/llvm/include -I/wrkdirs/usr/ports/devel/llvm23/work-lite/llvm-project-23.1.0-rc2.src/llvm/../third-party/siphash/include -I/wrkdirs/usr/ports/devel/llvm23/work-lite/llvm-project-23.1.0-rc2.src/llvm/../libc -isystem /usr/local/include -O2 -pipe -fstack-protector-strong -fno-strict-aliasing -fPIC -fno-semantic-interposition -Werror=date-time -Werror=unguarded-availability-new -Wall -Wextra -Wno-unused-parameter -Wwrite-strings -Wcast-qual -Wmissing-field-initializers -pedantic -Wno-long-long -Wc++98-compat-extra-semi -Wimplicit-fallthrough -Wcove
red-switch-default -Wstring-conversion -Wmisleading-indentation -Wctad-maybe-unsupported -fdiagnostics-color -ffunction-sections -fdata-sections -O2 -pipe -fstack-protector-strong -fno-strict-aliasing -DNDEBUG -Wno-c99-extensions -MD -MT lib/Support/CMakeFiles/LLVMSupport.dir/regexec.c.o -MF lib/Support/CMakeFiles/LLVMSupport.dir/regexec.c.o.d -o lib/Support/CMakeFiles/LLVMSupport.dir/regexec.c.o -c /wrkdirs/usr/ports/devel/llvm23/work-lite/llvm-project-23.1.0-rc2.src/llvm/lib/Support/regexec.c
[ 0% 11/4883] /usr/bin/cc -DLLVM_EXPORTS -D_FILE_OFFSET_BITS=64 -D_LARGEFILE_SOURCE -D__STDC_CONSTANT_MACROS -D__STDC_FORMAT_MACROS -D__STDC_LIMIT_MACROS -I/wrkdirs/usr/ports/devel/llvm23/work-lite/.build/lib/Support -I/wrkdirs/usr/ports/devel/llvm23/work-lite/llvm-project-23.1.0-rc2.src/llvm/lib/Support -I/wrkdirs/usr/ports/devel/llvm23/work-lite/.build/include -I/wrkdirs/usr/ports/devel/llvm23/work-lite/llvm-project-23.1.0-rc2.src/llvm/include -I/wrkdirs/usr/ports/devel/llvm23/work-lite/llvm-project-23.1.0-rc2.src/llvm/../third-party/siphash/include -I/wrkdirs/usr/ports/devel/llvm23/work-lite/llvm-project-23.1.0-rc2.src/llvm/../libc -isystem /usr/local/include -O2 -pipe -fstack-protector-strong -fno-strict-aliasing -fPIC -fno-semantic-interposition -Werror=date-time -Werror=unguarded-availability-new -Wall -Wextra -Wno-unused-parameter -Wwrite-strings -Wcast-qual -Wmissing-field-initializers -pedantic -Wno-long-long -Wc++98-compat-extra-semi -Wimplicit-fallthrough -Wcove
red-switch-default -Wstring-conversion -Wmisleading-indentation -Wctad-maybe-unsupported -fdiagnostics-color -ffunction-sections -fdata-sections -O2 -pipe -fstack-protector-strong -fno-strict-aliasing -DNDEBUG -Wno-c99-extensions -MD -MT lib/Support/CMakeFiles/LLVMSupport.dir/regfree.c.o -MF lib/Support/CMakeFiles/LLVMSupport.dir/regfree.c.o.d -o lib/Support/CMakeFiles/LLVMSupport.dir/regfree.c.o -c /wrkdirs/usr/ports/devel/llvm23/work-lite/llvm-project-23.1.0-rc2.src/llvm/lib/Support/regfree.c
[ 0% 12/4883] /usr/bin/cc -DLLVM_EXPORTS -D_FILE_OFFSET_BITS=64 -D_LARGEFILE_SOURCE -D__STDC_CONSTANT_MACROS -D__STDC_FORMAT_MACROS -D__STDC_LIMIT_MACROS -I/wrkdirs/usr/ports/devel/llvm23/work-lite/.build/lib/Support -I/wrkdirs/usr/ports/devel/llvm23/work-lite/llvm-project-23.1.0-rc2.src/llvm/lib/Support -I/wrkdirs/usr/ports/devel/llvm23/work-lite/.build/include -I/wrkdirs/usr/ports/devel/llvm23/work-lite/llvm-project-23.1.0-rc2.src/llvm/include -I/wrkdirs/usr/ports/devel/llvm23/work-lite/llvm-project-23.1.0-rc2.src/llvm/../third-party/siphash/include -I/wrkdirs/usr/ports/devel/llvm23/work-lite/llvm-project-23.1.0-rc2.src/llvm/../libc -isystem /usr/local/include -O2 -pipe -fstack-protector-strong -fno-strict-aliasing -fPIC -fno-semantic-interposition -Werror=date-time -Werror=unguarded-availability-new -Wall -Wextra -Wno-unused-parameter -Wwrite-strings -Wcast-qual -Wmissing-field-initializers -pedantic -Wno-long-long -Wc++98-compat-extra-semi -Wimplicit-fallthrough -Wcove
red-switch-default -Wstring-conversion -Wmisleading-indentation -Wctad-maybe-unsupported -fdiagnostics-color -ffunction-sections -fdata-sections -O2 -pipe -fstack-protector-strong -fno-strict-aliasing -DNDEBUG -Wno-c99-extensions -MD -MT lib/Support/CMakeFiles/LLVMSupport.dir/regstrlcpy.c.o -MF lib/Support/CMakeFiles/LLVMSupport.dir/regstrlcpy.c.o.d -o lib/Support/CMakeFiles/LLVMSupport.dir/regstrlcpy.c.o -c /wrkdirs/usr/ports/devel/llvm23/work-lite/llvm-project-23.1.0-rc2.src/llvm/lib/Support/regstrlcpy.c
[ 0% 13/4883] /usr/bin/c++ -DLLVM_EXPORTS -D_FILE_OFFSET_BITS=64 -D_LARGEFILE_SOURCE -D__STDC_CONSTANT_MACROS -D__STDC_FORMAT_MACROS -D__STDC_LIMIT_MACROS -I/wrkdirs/usr/ports/devel/llvm23/work-lite/.build/lib/Demangle -I/wrkdirs/usr/ports/devel/llvm23/work-lite/llvm-project-23.1.0-rc2.src/llvm/lib/Demangle -I/wrkdirs/usr/ports/devel/llvm23/work-lite/.build/include -I/wrkdirs/usr/ports/devel/llvm23/work-lite/llvm-project-23.1.0-rc2.src/llvm/include -O2 -pipe -fstack-protector-strong -fno-strict-aliasing -fPIC -fno-semantic-interposition -fvisibility-inlines-hidden -Werror=date-time -Werror=unguarded-availability-new -Wall -Wextra -Wno-unused-parameter -Wwrite-strings -Wcast-qual -Wmissing-field-initializers -pedantic -Wno-long-long -Wc++98-compat-extra-semi -Wimplicit-fallthrough -Wcovered-switch-default -Wno-noexcept-type -Wnon-virtual-dtor -Wdelete-non-virtual-dtor -Wsuggest-override -Wstring-conversion -Wno-pass-failed -Wmisleading-indentation -Wctad-maybe-unsupported -f
diagnostics-color -ffunction-sections -fdata-sections -Xclang -fno-pch-timestamp -O2 -pipe -fstack-protector-strong -fno-strict-aliasing -DNDEBUG -std=c++17 -fno-exceptions -funwind-tables -MD -MT lib/Demangle/CMakeFiles/LLVMDemangle.dir/ItaniumDemangle.cpp.o -MF lib/Demangle/CMakeFiles/LLVMDemangle.dir/ItaniumDemangle.cpp.o.d -o lib/Demangle/CMakeFiles/LLVMDemangle.dir/ItaniumDemangle.cpp.o -c /wrkdirs/usr/ports/devel/llvm23/work-lite/llvm-project-23.1.0-rc2.src/llvm/lib/Demangle/ItaniumDemangle.cpp
[ 0% 14/4883] : && /usr/local/bin/cmake -E rm -f lib/libLLVMDemangle.a && /usr/bin/llvm-ar qc lib/libLLVMDemangle.a lib/Demangle/CMakeFiles/LLVMDemangle.dir/Demangle.cpp.o lib/Demangle/CMakeFiles/LLVMDemangle.dir/ItaniumDemangle.cpp.o lib/Demangle/CMakeFiles/LLVMDemangle.dir/MicrosoftDemangle.cpp.o lib/Demangle/CMakeFiles/LLVMDemangle.dir/MicrosoftDemangleNodes.cpp.o lib/Demangle/CMakeFiles/LLVMDemangle.dir/RustDemangle.cpp.o lib/Demangle/CMakeFiles/LLVMDemangle.dir/DLangDemangle.cpp.o && /usr/bin/llvm-ranlib lib/libLLVMDemangle.a && :
[ 0% 15/4883] /usr/bin/cc -DBLAKE3_NO_AVX2 -DBLAKE3_NO_AVX512 -DBLAKE3_NO_SSE2 -DBLAKE3_NO_SSE41 -DLLVM_EXPORTS -D_FILE_OFFSET_BITS=64 -D_LARGEFILE_SOURCE -D__STDC_CONSTANT_MACROS -D__STDC_FORMAT_MACROS -D__STDC_LIMIT_MACROS -I/wrkdirs/usr/ports/devel/llvm23/work-lite/.build/lib/Support/BLAKE3 -I/wrkdirs/usr/ports/devel/llvm23/work-lite/llvm-project-23.1.0-rc2.src/llvm/lib/Support/BLAKE3 -I/wrkdirs/usr/ports/devel/llvm23/work-lite/.build/include -I/wrkdirs/usr/ports/devel/llvm23/work-lite/llvm-project-23.1.0-rc2.src/llvm/include -O2 -pipe -fstack-protector-strong -fno-strict-aliasing -fPIC -fno-semantic-interposition -Werror=date-time -Werror=unguarded-availability-new -Wall -Wextra -Wno-unused-parameter -Wwrite-strings -Wcast-qual -Wmissing-field-initializers -pedantic -Wno-long-long -Wc++98-compat-extra-semi -Wimplicit-fallthrough -Wcovered-switch-default -Wstring-conversion -Wmisleading-indentation -Wctad-maybe-unsupported -fdiagnostics-color -ffunction-sections -fdata-
sections -O2 -pipe -fstack-protector-strong -fno-strict-aliasing -DNDEBUG -MD -MT lib/Support/BLAKE3/CMakeFiles/LLVMSupportBlake3.dir/blake3_dispatch.c.o -MF lib/Support/BLAKE3/CMakeFiles/LLVMSupportBlake3.dir/blake3_dispatch.c.o.d -o lib/Support/BLAKE3/CMakeFiles/LLVMSupportBlake3.dir/blake3_dispatch.c.o -c /wrkdirs/usr/ports/devel/llvm23/work-lite/llvm-project-23.1.0-rc2.src/llvm/lib/Support/BLAKE3/blake3_dispatch.c
[ 0% 16/4883] /usr/bin/cc -DBLAKE3_NO_AVX2 -DBLAKE3_NO_AVX512 -DBLAKE3_NO_SSE2 -DBLAKE3_NO_SSE41 -DLLVM_EXPORTS -D_FILE_OFFSET_BITS=64 -D_LARGEFILE_SOURCE -D__STDC_CONSTANT_MACROS -D__STDC_FORMAT_MACROS -D__STDC_LIMIT_MACROS -I/wrkdirs/usr/ports/devel/llvm23/work-lite/.build/lib/Support/BLAKE3 -I/wrkdirs/usr/ports/devel/llvm23/work-lite/llvm-project-23.1.0-rc2.src/llvm/lib/Support/BLAKE3 -I/wrkdirs/usr/ports/devel/llvm23/work-lite/.build/include -I/wrkdirs/usr/ports/devel/llvm23/work-lite/llvm-project-23.1.0-rc2.src/llvm/include -O2 -pipe -fstack-protector-strong -fno-strict-aliasing -fPIC -fno-semantic-interposition -Werror=date-time -Werror=unguarded-availability-new -Wall -Wextra -Wno-unused-parameter -Wwrite-strings -Wcast-qual -Wmissing-field-initializers -pedantic -Wno-long-long -Wc++98-compat-extra-semi -Wimplicit-fallthrough -Wcovered-switch-default -Wstring-conversion -Wmisleading-indentation -Wctad-maybe-unsupported -fdiagnostics-color -ffunction-sections -fdata-
sections -O2 -pipe -fstack-protector-strong -fno-strict-aliasing -DNDEBUG -MD -MT lib/Support/BLAKE3/CMakeFiles/LLVMSupportBlake3.dir/blake3.c.o -MF lib/Support/BLAKE3/CMakeFiles/LLVMSupportBlake3.dir/blake3.c.o.d -o lib/Support/BLAKE3/CMakeFiles/LLVMSupportBlake3.dir/blake3.c.o -c /wrkdirs/usr/ports/devel/llvm23/work-lite/llvm-project-23.1.0-rc2.src/llvm/lib/Support/BLAKE3/blake3.c
[ 0% 17/4883] /usr/bin/c++ -DLLVM_EXPORTS -D_FILE_OFFSET_BITS=64 -D_LARGEFILE_SOURCE -D__STDC_CONSTANT_MACROS -D__STDC_FORMAT_MACROS -D__STDC_LIMIT_MACROS -I/wrkdirs/usr/ports/devel/llvm23/work-lite/.build/lib/Support -I/wrkdirs/usr/ports/devel/llvm23/work-lite/llvm-project-23.1.0-rc2.src/llvm/lib/Support -I/wrkdirs/usr/ports/devel/llvm23/work-lite/.build/include -I/wrkdirs/usr/ports/devel/llvm23/work-lite/llvm-project-23.1.0-rc2.src/llvm/include -I/wrkdirs/usr/ports/devel/llvm23/work-lite/llvm-project-23.1.0-rc2.src/llvm/../third-party/siphash/include -I/wrkdirs/usr/ports/devel/llvm23/work-lite/llvm-project-23.1.0-rc2.src/llvm/../libc -isystem /usr/local/include -O2 -pipe -fstack-protector-strong -fno-strict-aliasing -fPIC -fno-semantic-interposition -fvisibility-inlines-hidden -Werror=date-time -Werror=unguarded-availability-new -Wall -Wextra -Wno-unused-parameter -Wwrite-strings -Wcast-qual -Wmissing-field-initializers -pedantic -Wno-long-long -Wc++98-compat-extra-semi -
Wimplicit-fallthrough -Wcovered-switch-default -Wno-noexcept-type -Wnon-virtual-dtor -Wdelete-non-virtual-dtor -Wsuggest-override -Wstring-conversion -Wno-pass-failed -Wmisleading-indentation -Wctad-maybe-unsupported -fdiagnostics-color -ffunction-sections -fdata-sections -Xclang -fno-pch-timestamp -O2 -pipe -fstack-protector-strong -fno-strict-aliasing -DNDEBUG -std=c++17 -fno-exceptions -funwind-tables -Wno-c99-extensions -Winvalid-pch -fpch-instantiate-templates -Xclang -emit-pch -Xclang -include -Xclang /wrkdirs/usr/ports/devel/llvm23/work-lite/.build/lib/Support/CMakeFiles/LLVMSupport.dir/cmake_pch.hxx -x c++-header -MD -MT lib/Support/CMakeFiles/LLVMSupport.dir/cmake_pch.hxx.pch -MF lib/Support/CMakeFiles/LLVMSupport.dir/cmake_pch.hxx.pch.d -o lib/Support/CMakeFiles/LLVMSupport.dir/cmake_pch.hxx.pch -c /wrkdirs/usr/ports/devel/llvm23/work-lite/.build/lib/Support/CMakeFiles/LLVMSupport.dir/cmake_pch.hxx.cxx
FAILED: [code=1] lib/Support/CMakeFiles/LLVMSupport.dir/cmake_pch.hxx.pch
/usr/bin/c++ -DLLVM_EXPORTS -D_FILE_OFFSET_BITS=64 -D_LARGEFILE_SOURCE -D__STDC_CONSTANT_MACROS -D__STDC_FORMAT_MACROS -D__STDC_LIMIT_MACROS -I/wrkdirs/usr/ports/devel/llvm23/work-lite/.build/lib/Support -I/wrkdirs/usr/ports/devel/llvm23/work-lite/llvm-project-23.1.0-rc2.src/llvm/lib/Support -I/wrkdirs/usr/ports/devel/llvm23/work-lite/.build/include -I/wrkdirs/usr/ports/devel/llvm23/work-lite/llvm-project-23.1.0-rc2.src/llvm/include -I/wrkdirs/usr/ports/devel/llvm23/work-lite/llvm-project-23.1.0-rc2.src/llvm/../third-party/siphash/include -I/wrkdirs/usr/ports/devel/llvm23/work-lite/llvm-project-23.1.0-rc2.src/llvm/../libc -isystem /usr/local/include -O2 -pipe -fstack-protector-strong -fno-strict-aliasing -fPIC -fno-semantic-interposition -fvisibility-inlines-hidden -Werror=date-time -Werror=unguarded-availability-new -Wall -Wextra -Wno-unused-parameter -Wwrite-strings -Wcast-qual -Wmissing-field-initializers -pedantic -Wno-long-long -Wc++98-compat-extra-semi -Wimplicit-fallt
hrough -Wcovered-switch-default -Wno-noexcept-type -Wnon-virtual-dtor -Wdelete-non-virtual-dtor -Wsuggest-override -Wstring-conversion -Wno-pass-failed -Wmisleading-indentation -Wctad-maybe-unsupported -fdiagnostics-color -ffunction-sections -fdata-sections -Xclang -fno-pch-timestamp -O2 -pipe -fstack-protector-strong -fno-strict-aliasing -DNDEBUG -std=c++17 -fno-exceptions -funwind-tables -Wno-c99-extensions -Winvalid-pch -fpch-instantiate-templates -Xclang -emit-pch -Xclang -include -Xclang /wrkdirs/usr/ports/devel/llvm23/work-lite/.build/lib/Support/CMakeFiles/LLVMSupport.dir/cmake_pch.hxx -x c++-header -MD -MT lib/Support/CMakeFiles/LLVMSupport.dir/cmake_pch.hxx.pch -MF lib/Support/CMakeFiles/LLVMSupport.dir/cmake_pch.hxx.pch.d -o lib/Support/CMakeFiles/LLVMSupport.dir/cmake_pch.hxx.pch -c /wrkdirs/usr/ports/devel/llvm23/work-lite/.build/lib/Support/CMakeFiles/LLVMSupport.dir/cmake_pch.hxx.cxx
In file included from <built-in>:1:
In file included from /wrkdirs/usr/ports/devel/llvm23/work-lite/.build/lib/Support/CMakeFiles/LLVMSupport.dir/cmake_pch.hxx:5:
In file included from /wrkdirs/usr/ports/devel/llvm23/work-lite/llvm-project-23.1.0-rc2.src/llvm/include/llvm/Support/pch.h:30:
In file included from /wrkdirs/usr/ports/devel/llvm23/work-lite/llvm-project-23.1.0-rc2.src/llvm/include/llvm/Support/CommandLine.h:31:
In file included from /wrkdirs/usr/ports/devel/llvm23/work-lite/llvm-project-23.1.0-rc2.src/llvm/include/llvm/Support/StringSaver.h:15:
/wrkdirs/usr/ports/devel/llvm23/work-lite/llvm-project-23.1.0-rc2.src/llvm/include/llvm/Support/Allocator.h:84:17: error: static assertion failed due to requirement '8U <= alignof(__max_align_t)': MinAlign must not exceed the alignment of fresh slabs
84 | static_assert(MinAlign <= alignof(std::max_align_t),
| ^~~~~~~~~~~~~~~~~~~~~~~~~~~~~~~~~~~~~
/wrkdirs/usr/ports/devel/llvm23/work-lite/llvm-project-23.1.0-rc2.src/llvm/include/llvm/Support/StringSaver.h:50:56: note: in instantiation of template class 'llvm::BumpPtrAllocatorImpl<>' requested here
50 | UniqueStringSaver(BumpPtrAllocator &Alloc) : Strings(Alloc) {}
| ^
/wrkdirs/usr/ports/devel/llvm23/work-lite/llvm-project-23.1.0-rc2.src/llvm/include/llvm/Support/Allocator.h:84:26: note: expression evaluates to '8 <= 4'
84 | static_assert(MinAlign <= alignof(std::max_align_t),
| ~~~~~~~~~^~~~~~~~~~~~~~~~~~~~~~~~~~~~
In file included from <built-in>:1:
In file included from /wrkdirs/usr/ports/devel/llvm23/work-lite/.build/lib/Support/CMakeFiles/LLVMSupport.dir/cmake_pch.hxx:5:
In file included from /wrkdirs/usr/ports/devel/llvm23/work-lite/llvm-project-23.1.0-rc2.src/llvm/include/llvm/Support/pch.h:37:
In file included from /wrkdirs/usr/ports/devel/llvm23/work-lite/llvm-project-23.1.0-rc2.src/llvm/include/llvm/Support/YAMLTraits.h:26:
/wrkdirs/usr/ports/devel/llvm23/work-lite/llvm-project-23.1.0-rc2.src/llvm/include/llvm/Support/YAMLParser.h:145:18: error: member 'Allocate' found in multiple base classes of different types
145 | return Alloc.Allocate(Size, Alignment);
| ^
/wrkdirs/usr/ports/devel/llvm23/work-lite/llvm-project-23.1.0-rc2.src/llvm/include/llvm/Support/AllocatorBase.h:45:9: note: member found by ambiguous name lookup
45 | void *Allocate(size_t Size, size_t Alignment) {
| ^
/wrkdirs/usr/ports/devel/llvm23/work-lite/llvm-project-23.1.0-rc2.src/llvm/include/llvm/Support/AllocatorBase.h:92:40: note: member found by ambiguous name lookup
92 | LLVM_ATTRIBUTE_RETURNS_NONNULL void *Allocate(size_t Size, size_t Alignment) {
| ^
In file included from <built-in>:1:
In file included from /wrkdirs/usr/ports/devel/llvm23/work-lite/.build/lib/Support/CMakeFiles/LLVMSupport.dir/cmake_pch.hxx:5:
In file included from /wrkdirs/usr/ports/devel/llvm23/work-lite/llvm-project-23.1.0-rc2.src/llvm/include/llvm/Support/pch.h:37:
In file included from /wrkdirs/usr/ports/devel/llvm23/work-lite/llvm-project-23.1.0-rc2.src/llvm/include/llvm/Support/YAMLTraits.h:26:
/wrkdirs/usr/ports/devel/llvm23/work-lite/llvm-project-23.1.0-rc2.src/llvm/include/llvm/Support/YAMLParser.h:150:11: error: member 'Deallocate' found in multiple base classes of different types
150 | Alloc.Deallocate(Ptr, Size, 0);
| ^
/wrkdirs/usr/ports/devel/llvm23/work-lite/llvm-project-23.1.0-rc2.src/llvm/include/llvm/Support/AllocatorBase.h:59:8: note: member found by ambiguous name lookup
59 | void Deallocate(const void *Ptr, size_t Size, size_t Alignment) {
| ^
/wrkdirs/usr/ports/devel/llvm23/work-lite/llvm-project-23.1.0-rc2.src/llvm/include/llvm/Support/AllocatorBase.h:99:8: note: member found by ambiguous name lookup
99 | void Deallocate(const void *Ptr, size_t Size, size_t Alignment) {
| ^
In file included from <built-in>:1:
In file included from /wrkdirs/usr/ports/devel/llvm23/work-lite/.build/lib/Support/CMakeFiles/LLVMSupport.dir/cmake_pch.hxx:5:
In file included from /wrkdirs/usr/ports/devel/llvm23/work-lite/llvm-project-23.1.0-rc2.src/llvm/include/llvm/Support/pch.h:37:
/wrkdirs/usr/ports/devel/llvm23/work-lite/llvm-project-23.1.0-rc2.src/llvm/include/llvm/Support/YAMLTraits.h:1276:27: error: member 'Allocate' found in multiple base classes of different types
1276 | BufPtr = allocator->Allocate<TNorm>();
| ^
/wrkdirs/usr/ports/devel/llvm23/work-lite/llvm-project-23.1.0-rc2.src/llvm/include/llvm/Support/AllocatorBase.h:45:9: note: member found by ambiguous name lookup
45 | void *Allocate(size_t Size, size_t Alignment) {
| ^
/wrkdirs/usr/ports/devel/llvm23/work-lite/llvm-project-23.1.0-rc2.src/llvm/include/llvm/Support/AllocatorBase.h:92:40: note: member found by ambiguous name lookup
92 | LLVM_ATTRIBUTE_RETURNS_NONNULL void *Allocate(size_t Size, size_t Alignment) {
| ^
4 errors generated.
[ 0% 17/4883] /usr/bin/cc -DBLAKE3_NO_AVX2 -DBLAKE3_NO_AVX512 -DBLAKE3_NO_SSE2 -DBLAKE3_NO_SSE41 -DLLVM_EXPORTS -D_FILE_OFFSET_BITS=64 -D_LARGEFILE_SOURCE -D__STDC_CONSTANT_MACROS -D__STDC_FORMAT_MACROS -D__STDC_LIMIT_MACROS -I/wrkdirs/usr/ports/devel/llvm23/work-lite/.build/lib/Support/BLAKE3 -I/wrkdirs/usr/ports/devel/llvm23/work-lite/llvm-project-23.1.0-rc2.src/llvm/lib/Support/BLAKE3 -I/wrkdirs/usr/ports/devel/llvm23/work-lite/.build/include -I/wrkdirs/usr/ports/devel/llvm23/work-lite/llvm-project-23.1.0-rc2.src/llvm/include -O2 -pipe -fstack-protector-strong -fno-strict-aliasing -fPIC -fno-semantic-interposition -Werror=date-time -Werror=unguarded-availability-new -Wall -Wextra -Wno-unused-parameter -Wwrite-strings -Wcast-qual -Wmissing-field-initializers -pedantic -Wno-long-long -Wc++98-compat-extra-semi -Wimplicit-fallthrough -Wcovered-switch-default -Wstring-conversion -Wmisleading-indentation -Wctad-maybe-unsupported -fdiagnostics-color -ffunction-sections -fdata-
sections -O2 -pipe -fstack-protector-strong -fno-strict-aliasing -DNDEBUG -MD -MT lib/Support/BLAKE3/CMakeFiles/LLVMSupportBlake3.dir/blake3_neon.c.o -MF lib/Support/BLAKE3/CMakeFiles/LLVMSupportBlake3.dir/blake3_neon.c.o.d -o lib/Support/BLAKE3/CMakeFiles/LLVMSupportBlake3.dir/blake3_neon.c.o -c /wrkdirs/usr/ports/devel/llvm23/work-lite/llvm-project-23.1.0-rc2.src/llvm/lib/Support/BLAKE3/blake3_neon.c
[ 0% 17/4883] /usr/bin/cc -DBLAKE3_NO_AVX2 -DBLAKE3_NO_AVX512 -DBLAKE3_NO_SSE2 -DBLAKE3_NO_SSE41 -DLLVM_EXPORTS -D_FILE_OFFSET_BITS=64 -D_LARGEFILE_SOURCE -D__STDC_CONSTANT_MACROS -D__STDC_FORMAT_MACROS -D__STDC_LIMIT_MACROS -I/wrkdirs/usr/ports/devel/llvm23/work-lite/.build/lib/Support/BLAKE3 -I/wrkdirs/usr/ports/devel/llvm23/work-lite/llvm-project-23.1.0-rc2.src/llvm/lib/Support/BLAKE3 -I/wrkdirs/usr/ports/devel/llvm23/work-lite/.build/include -I/wrkdirs/usr/ports/devel/llvm23/work-lite/llvm-project-23.1.0-rc2.src/llvm/include -O2 -pipe -fstack-protector-strong -fno-strict-aliasing -fPIC -fno-semantic-interposition -Werror=date-time -Werror=unguarded-availability-new -Wall -Wextra -Wno-unused-parameter -Wwrite-strings -Wcast-qual -Wmissing-field-initializers -pedantic -Wno-long-long -Wc++98-compat-extra-semi -Wimplicit-fallthrough -Wcovered-switch-default -Wstring-conversion -Wmisleading-indentation -Wctad-maybe-unsupported -fdiagnostics-color -ffunction-sections -fdata-
sections -O2 -pipe -fstack-protector-strong -fno-strict-aliasing -DNDEBUG -MD -MT lib/Support/BLAKE3/CMakeFiles/LLVMSupportBlake3.dir/blake3_portable.c.o -MF lib/Support/BLAKE3/CMakeFiles/LLVMSupportBlake3.dir/blake3_portable.c.o.d -o lib/Support/BLAKE3/CMakeFiles/LLVMSupportBlake3.dir/blake3_portable.c.o -c /wrkdirs/usr/ports/devel/llvm23/work-lite/llvm-project-23.1.0-rc2.src/llvm/lib/Support/BLAKE3/blake3_portable.c
ninja: build stopped: subcommand failed.
===> Compilation failed unexpectedly.
Try to set MAKE_JOBS_UNSAFE=yes and rebuild before reporting the failure to
the maintainer.
*** Error code 1
Stop.
make: stopped making "build" in /usr/ports/devel/llvm23