[package - 144i386-default][devel/llvm-devel] Failed for llvm-devel-23.0.d20260714 in build
- Go to: [ bottom of page ] [ top of archives ] [ this month ]
Date: Sun, 02 Aug 2026 08:20:21 UTC
You are receiving this mail as a port that you maintain
is failing to build on the FreeBSD package build server.
Please investigate the failure and submit a PR to fix
build.
Maintainer: brooks@FreeBSD.org
Log URL: https://pkg-status.freebsd.org/beefy18/data/144i386-default/394fa87ea81a/logs/llvm-devel-23.0.d20260714.log
Build URL: https://pkg-status.freebsd.org/beefy18/build.html?mastername=144i386-default&build=394fa87ea81a
Log:
=>> Building devel/llvm-devel
build started at Sun Aug 2 08:17:36 UTC 2026
port directory: /usr/ports/devel/llvm-devel
package name: llvm-devel-23.0.d20260714
building for: FreeBSD 144i386-default-job-08 14.4-RELEASE-p8 FreeBSD 14.4-RELEASE-p8 i386
maintained by: brooks@FreeBSD.org
Makefile datestamp: -rw-r--r-- 1 root wheel 20364 Jul 28 01:01 /usr/ports/devel/llvm-devel/Makefile
Ports top last git commit: 394fa87ea81a931c66354ee8ab6f1387643b7ba3
Ports top unclean checkout: no
Port dir last git commit: a891139454983b7a30eb289a32417c4b8b448bbd
Port dir unclean checkout: no
Poudriere version: poudriere-git-3.4.8
Host OSVERSION: 1600019
Jail OSVERSION: 1404000
Job Id: 08
---Begin Environment---
SHELL=/bin/sh
BLOCKSIZE=K
MAIL=/var/mail/root
MM_CHARSET=UTF-8
LANG=C.UTF-8
OSVERSION=1404000
STATUS=1
HOME=/root
PATH=/sbin:/bin:/usr/sbin:/usr/bin:/usr/local/sbin:/usr/local/bin:/root/bin
MAKE_OBJDIR_CHECK_WRITABLE=0
UNAME_m=i386
UNAME_p=i386
UNAME_r=14.4-RELEASE-p8
LOCALBASE=/usr/local
UNAME_v=FreeBSD 14.4-RELEASE-p8
USER=root
POUDRIERE_NAME=poudriere-git
LIBEXECPREFIX=/usr/local/libexec/poudriere
POUDRIERE_VERSION=3.4.8
MASTERMNT=/usr/local/poudriere/data/.m/144i386-default/ref
LC_COLLATE=C
POUDRIERE_BUILD_TYPE=bulk
PACKAGE_BUILDING=yes
SAVED_TERM=
OUTPUT_REDIRECTED_STDERR=4
OUTPUT_REDIRECTED=1
PWD=/usr/local/poudriere/data/.m/144i386-default/08/.p
OUTPUT_REDIRECTED_STDOUT=3
P_PORTS_FEATURES=FLAVORS SUBPACKAGES SELECTED_OPTIONS
MASTERNAME=144i386-default
SCRIPTPREFIX=/usr/local/share/poudriere
SCRIPTNAME=bulk.sh
OLDPWD=/usr/local/poudriere/data/.m/144i386-default/ref/.p/pool
POUDRIERE_PKGNAME=poudriere-git-3.4.8
SCRIPTPATH=/usr/local/share/poudriere/bulk.sh
POUDRIEREPATH=/usr/local/bin/poudriere
---End Environment---
---Begin Poudriere Port Flags/Env---
PORT_FLAGS=
PKGENV=
FLAVOR=default
MAKE_ARGS= FLAVOR=default
---End Poudriere Port Flags/Env---
---Begin OPTIONS List---
===> The following configuration options are available for llvm-devel-23.0.d20260714:
CLANG=on: Build clang
COMPILER_RT=on: Sanitizer libraries
DOCS=on: Build and/or install documentation
EXTRAS=on: Extra clang tools
LIT=on: Install lit and FileCheck test tools
LLD=on: Install lld, the LLVM linker
LLDB=on: Install lldb, the LLVM debugger
MLIR=on: Multi-Level Intermediate Representation
POLLY=on: Polyhedral loop and data-locality optimizer
STATIC_LIBS=on: Install static libraries (does not effect sanitizers)
===> Use 'make config' to modify these settings
---End OPTIONS List---
--MAINTAINER--
brooks@FreeBSD.org
--End MAINTAINER--
--CONFIGURE_ARGS--
--End CONFIGURE_ARGS--
--CONFIGURE_ENV--
PYTHON="/usr/local/bin/python3.12" ac_cv_path_PERL=/usr/local/bin/perl ac_cv_path_PERL_PATH=/usr/local/bin/perl PERL_USE_UNSAFE_INC=1 XDG_DATA_HOME=/wrkdirs/usr/ports/devel/llvm-devel/work-default XDG_CONFIG_HOME=/wrkdirs/usr/ports/devel/llvm-devel/work-default XDG_CACHE_HOME=/wrkdirs/usr/ports/devel/llvm-devel/work-default/.cache HOME=/wrkdirs/usr/ports/devel/llvm-devel/work-default TMPDIR="/tmp" PATH=/wrkdirs/usr/ports/devel/llvm-devel/work-default/.bin:/sbin:/bin:/usr/sbin:/usr/bin:/usr/local/sbin:/usr/local/bin:/root/bin PKG_CONFIG_LIBDIR=/wrkdirs/usr/ports/devel/llvm-devel/work-default/.pkgconfig:/usr/local/libdata/pkgconfig:/usr/local/share/pkgconfig:/usr/libdata/pkgconfig SHELL=/bin/sh CONFIG_SHELL=/bin/sh CMAKE_PREFIX_PATH="/usr/local"
--End CONFIGURE_ENV--
--MAKE_ENV--
NINJA_STATUS="[%p %s/%t] " PERL_USE_UNSAFE_INC=1 LUA_MODLIBDIR=/usr/local/lib/lua/5.4 LUA_MODSHAREDIR=/usr/local/share/lua/5.4 LUA_MODDOCSDIR=/usr/local/share/doc/lua54 LUA_INCDIR=/usr/local/include/lua54 LUA_LIBDIR=/usr/local/lib LUA_VER=5.4 LUA_VER_STR=54 XDG_DATA_HOME=/wrkdirs/usr/ports/devel/llvm-devel/work-default XDG_CONFIG_HOME=/wrkdirs/usr/ports/devel/llvm-devel/work-default XDG_CACHE_HOME=/wrkdirs/usr/ports/devel/llvm-devel/work-default/.cache HOME=/wrkdirs/usr/ports/devel/llvm-devel/work-default TMPDIR="/tmp" PATH=/wrkdirs/usr/ports/devel/llvm-devel/work-default/.bin:/sbin:/bin:/usr/sbin:/usr/bin:/usr/local/sbin:/usr/local/bin:/root/bin PKG_CONFIG_LIBDIR=/wrkdirs/usr/ports/devel/llvm-devel/work-default/.pkgconfig:/usr/local/libdata/pkgconfig:/usr/local/share/pkgconfig:/usr/libdata/pkgconfig MK_DEBUG_FILES=no MK_KERNEL_SYMBOLS=no SHELL=/bin/sh NO_LINT=YES DESTDIR=/wrkdirs/usr/ports/devel/llvm-devel/work-default/stage PREFIX=/usr/local LOCALBASE=/usr/local
CC="cc" CFLAGS="-O2 -pipe -fstack-protector-strong -isystem /usr/local/include -fno-strict-aliasing " CPP="cpp" CPPFLAGS="-isystem /usr/local/include" LDFLAGS=" " LIBS="libclangApplyReplacements libclangChangeNamespace libclangDaemon libclangDoc libclangIncludeCleaner libclangIncludeFixer libclangMove libclangPseudo libclangQuery libclangRename libclangReorderFields libclangTidy libclangTidyGoogleModule libclangTidyLLVMModule libclangTidyMiscModule libclangTidyReadabilityModule libclangTidyUtils libfindAllSymbols libmodernizeCore -L/usr/local/lib" CXX="c++" CXXFLAGS="-O2 -pipe -fstack-protector-strong -isystem /usr/local/include -fno-strict-aliasing -isystem /usr/local/include " BSD_INSTALL_PROGRAM="install -s -m 555" BSD_INSTALL_LIB="install -s -m 0644" BSD_INSTALL_SCRIPT="install -m 555" BSD_INSTALL_DATA="install -m 0644" BSD_INSTALL_MAN="install -m 444"
--End MAKE_ENV--
--PLIST_SUB--
CONFIGURE_TARGET=i386-portbld-freebsd14.4 LLVM_MAJOR_MINOR=23.0 LLVM_MAJOR=23 LLVM_RELEASE=23.0.0 PORTDOCS="" CLANG="" NO_CLANG="@comment " COMPILER_RT="" NO_COMPILER_RT="@comment " DOCS="" NO_DOCS="@comment " EXTRAS="" NO_EXTRAS="@comment " FLANG="@comment " NO_FLANG="" LIT="" NO_LIT="@comment " LIT_MOD_NAME=lit_devel LLD="" NO_LLD="@comment " LLDB="" NO_LLDB="@comment " PYTHON_ABIVER= MLIR="" NO_MLIR="@comment " OPENMP="@comment " NO_OPENMP="" POLLY="" NO_POLLY="@comment " STATIC_LIBS="" NO_STATIC_LIBS="@comment " CMAKE_BUILD_TYPE="release" PYTHON_INCLUDEDIR=include/python3.12 PYTHON_LIBDIR=lib/python3.12 PYTHON_PLATFORM=freebsd14 PYTHON_SITELIBDIR=lib/python3.12/site-packages PYTHON_SUFFIX=312 PYTHON_BASESUFFIX=312 PYTHON_TAG=.cpython-312 PYTHON_SOABI=.cpython-312 PYTHON_VER=3.12 PYTHON_BASEVER=3.12 PYTHON_VERSION=python3.12 PYTHON2="@comment " PYTHON3="" GTK2_VERSION="2.10.0" GTK3_VERSION="3.0.0" GTK4_VERSION="4.0.0" LUA_MODLIBDIR=lib/lua/5.4 LUA_MODSHARE
DIR=share/lua/5.4 LUA_MODDOCSDIR=share/doc/lua54 LUA_INCDIR=include/lua54 LUA_VER=5.4 LUA_VER_STR=54 FLANG="@comment " GOLD="@comment " OPENMP="@comment " OSREL=14.4 PREFIX=%D LOCALBASE=/usr/local RESETPREFIX=/usr/local LIB32DIR=lib PERL_VERSION=5.42.2 PERL_VER=5.42 PERL5_MAN1=lib/perl5/site_perl/man/man1 PERL5_MAN3=lib/perl5/site_perl/man/man3 SITE_PERL=lib/perl5/site_perl SITE_ARCH=lib/perl5/site_perl/mach/5.42 DOCSDIR="share/doc/llvm-devel" EXAMPLESDIR="share/examples/llvm" DATADIR="share/llvm-devel" WWWDIR="www/llvm" ETCDIR="etc/llvm"
--End PLIST_SUB--
--SUB_LIST--
LLVM_PREFIX="/usr/local/llvm-devel" LLVM_SUFFIX="-devel" CLANG="" NO_CLANG="@comment " XCC=clang-devel XCXX=clang++-devel XCPP=clang-cpp-devel XLD=ld.lld-devel X_COMPILER_TYPE=clang COMPILER_RT="" NO_COMPILER_RT="@comment " DOCS="" NO_DOCS="@comment " EXTRAS="" NO_EXTRAS="@comment " FLANG="@comment " NO_FLANG="" LIT="" NO_LIT="@comment " LLD="" NO_LLD="@comment " LLDB="" NO_LLDB="@comment " MLIR="" NO_MLIR="@comment " OPENMP="@comment " NO_OPENMP="" POLLY="" NO_POLLY="@comment " STATIC_LIBS="" NO_STATIC_LIBS="@comment " PYTHON_INCLUDEDIR=/usr/local/include/python3.12 PYTHON_LIBDIR=/usr/local/lib/python3.12 PYTHON_PLATFORM=freebsd14 PYTHON_SITELIBDIR=/usr/local/lib/python3.12/site-packages PYTHON_SUFFIX=312 PYTHON_BASESUFFIX=312 PYTHON_TAG=.cpython-312 PYTHON_SOABI=.cpython-312 PYTHON_VER=3.12 PYTHON_BASEVER=3.12 PYTHON_VERSION=python3.12 PYTHON2="@comment " PYTHON3="" PREFIX=/usr/local LOCALBASE=/usr/local DATADIR=/usr/local/share/llvm-devel DOCSDIR=/usr/local
/share/doc/llvm-devel EXAMPLESDIR=/usr/local/share/examples/llvm WWWDIR=/usr/local/www/llvm ETCDIR=/usr/local/etc/llvm
--End SUB_LIST--
---Begin make.conf---
USE_PACKAGE_DEPENDS=yes
BATCH=yes
WRKDIRPREFIX=/wrkdirs
PORTSDIR=/usr/ports
PACKAGES=/packages
DISTDIR=/distfiles
PACKAGE_BUILDING=yes
PACKAGE_BUILDING_FLAVORS=yes
MACHINE=i386
MACHINE_ARCH=i386
ARCH=${MACHINE_ARCH}
#### ####
# XXX: We really need this but cannot use it while 'make checksum' does not
# try the next mirror on checksum failure. It currently retries the same
# failed mirror and then fails rather then trying another. It *does*
# try the next if the size is mismatched though.
#MASTER_SITE_FREEBSD=yes
# Build ALLOW_MAKE_JOBS_PACKAGES with 3 jobs
MAKE_JOBS_NUMBER=3
#### Misc Poudriere ####
.include "/etc/make.conf.ports_env"
GID=0
UID=0
---End make.conf---
--Resource limits--
cpu time (seconds, -t) unlimited
file size (512-blocks, -f) unlimited
data seg size (kbytes, -d) 524288
stack size (kbytes, -s) 65536
core file size (512-blocks, -c) unlimited
max memory size (kbytes, -m) unlimited
locked memory (kbytes, -l) unlimited
max user processes (-u) 89999
open files (-n) 8192
virtual mem size (kbytes, -v) unlimited
swap limit (kbytes, -w) unlimited
socket buffer size (bytes, -b) unlimited
pseudo-terminals (-p) unlimited
kqueues (-k) unlimited
umtx shared locks (-o) unlimited
pipebuf (-y) unlimited
--End resource limits--
=======================<phase: check-sanity >============================
===== env: NO_DEPENDS=yes USER=root UID=0 GID=0
===> License BSD3CLAUSE LLVM LLVM2 MIT PD REGEX accepted by the user
===========================================================================
=======================<phase: pkg-depends >============================
===== env: USE_PACKAGE_DEPENDS_ONLY=1 USER=root UID=0 GID=0
===> llvm-devel-23.0.d20260714 depends on file: /usr/local/sbin/pkg - not found
===> Installing existing package /packages/All/pkg-2.8.1_1.pkg
[144i386-default-job-08] Installing pkg-2.8.1_1...
[144i386-default-job-08] Extracting pkg-2.8.1_1: .......... done
===> llvm-devel-23.0.d20260714 depends on file: /usr/local/sbin/pkg - found
===> Returning to build of llvm-devel-23.0.d20260714
===========================================================================
=======================<phase: fetch-depends >============================
===== env: USE_PACKAGE_DEPENDS_ONLY=1 USER=root UID=0 GID=0
===========================================================================
=======================<phase: fetch >============================
===== env: NO_DEPENDS=yes USER=root UID=0 GID=0
===> License BSD3CLAUSE LLVM LLVM2 MIT PD REGEX accepted by the user
===> Fetching all distfiles required by llvm-devel-23.0.d20260714 for building
===========================================================================
=======================<phase: checksum >============================
===== env: NO_DEPENDS=yes USER=root UID=0 GID=0
===> License BSD3CLAUSE LLVM LLVM2 MIT PD REGEX accepted by the user
===> Fetching all distfiles required by llvm-devel-23.0.d20260714 for building
=> SHA256 Checksum OK for llvm-llvm-project-23.0.d20260714-fb423ba07c3ff51fda3caa41d8bbb78d50f61906_GH0.tar.gz.
===========================================================================
=======================<phase: extract-depends>============================
===== env: USE_PACKAGE_DEPENDS_ONLY=1 USER=root UID=0 GID=0
===========================================================================
=======================<phase: extract >============================
===== env: NO_DEPENDS=yes USER=root UID=0 GID=0
===> License BSD3CLAUSE LLVM LLVM2 MIT PD REGEX accepted by the user
===> Fetching all distfiles required by llvm-devel-23.0.d20260714 for building
===> Extracting for llvm-devel-23.0.d20260714
=> SHA256 Checksum OK for llvm-llvm-project-23.0.d20260714-fb423ba07c3ff51fda3caa41d8bbb78d50f61906_GH0.tar.gz.
===========================================================================
=======================<phase: patch-depends >============================
===== env: USE_PACKAGE_DEPENDS_ONLY=1 USER=root UID=0 GID=0
===========================================================================
=======================<phase: patch >============================
===== env: NO_DEPENDS=yes USER=root UID=0 GID=0
===> Patching for llvm-devel-23.0.d20260714
===> Applying FreeBSD patches for llvm-devel-23.0.d20260714 from /usr/ports/devel/llvm-devel/files
/usr/bin/sed -i.bak -e 's|import lit|import lit_devel|' -e 's|from lit|from lit_devel|' -e 's|lit\.|lit_devel.|g' /wrkdirs/usr/ports/devel/llvm-devel/work-default/llvm-project-fb423ba07c3ff51fda3caa41d8bbb78d50f61906/llvm/utils/lit/lit.py /wrkdirs/usr/ports/devel/llvm-devel/work-default/llvm-project-fb423ba07c3ff51fda3caa41d8bbb78d50f61906/llvm/utils/lit/lit/*.py /wrkdirs/usr/ports/devel/llvm-devel/work-default/llvm-project-fb423ba07c3ff51fda3caa41d8bbb78d50f61906/llvm/utils/lit/lit/builtin_commands/*.py /wrkdirs/usr/ports/devel/llvm-devel/work-default/llvm-project-fb423ba07c3ff51fda3caa41d8bbb78d50f61906/llvm/utils/lit/lit/formats/*.py /wrkdirs/usr/ports/devel/llvm-devel/work-default/llvm-project-fb423ba07c3ff51fda3caa41d8bbb78d50f61906/llvm/utils/lit/lit/llvm/*.py
/usr/bin/sed -i.bak -e 's|%%LLVM_PREFIX%%|/usr/local/llvm-devel|' /wrkdirs/usr/ports/devel/llvm-devel/work-default/llvm-project-fb423ba07c3ff51fda3caa41d8bbb78d50f61906/clang/lib/Driver/ToolChains/CommonArgs.cpp
/usr/bin/sed -i.bak -e 's|%%LLVM_SUFFIX%%|-devel|' /wrkdirs/usr/ports/devel/llvm-devel/work-default/llvm-project-fb423ba07c3ff51fda3caa41d8bbb78d50f61906/clang/tools/clang-format/clang-format.py /wrkdirs/usr/ports/devel/llvm-devel/work-default/llvm-project-fb423ba07c3ff51fda3caa41d8bbb78d50f61906/clang/tools/clang-format/clang-format-sublime.py /wrkdirs/usr/ports/devel/llvm-devel/work-default/llvm-project-fb423ba07c3ff51fda3caa41d8bbb78d50f61906/clang/tools/clang-format/git-clang-format
/usr/bin/sed -i.bak -e "s|'indexsidebar.html'|['indexsidebar.html']|" /wrkdirs/usr/ports/devel/llvm-devel/work-default/llvm-project-fb423ba07c3ff51fda3caa41d8bbb78d50f61906/lld/docs/conf.py
===========================================================================
=======================<phase: build-depends >============================
===== env: USE_PACKAGE_DEPENDS_ONLY=1 USER=root UID=0 GID=0
===> llvm-devel-23.0.d20260714 depends on package: py312-myst-parser>0 - not found
===> Installing existing package /packages/All/py312-myst-parser-5.1.0_1.pkg
[144i386-default-job-08] Installing py312-myst-parser-5.1.0_1...
[144i386-default-job-08] `-- Installing py312-Jinja2-3.1.6...
<snip>
-- Looking for __NR_process_vm_readv
-- Looking for __NR_process_vm_readv - not found
-- Looking for compression_encode_buffer in compression
-- Looking for compression_encode_buffer in compression - not found
-- Could NOT find Git (missing: GIT_EXECUTABLE)
-- Symbols (liblldb): exporting all symbols from the lldb and lldb_private namespaces
CMake Warning at /wrkdirs/usr/ports/devel/llvm-devel/work-default/llvm-project-fb423ba07c3ff51fda3caa41d8bbb78d50f61906/lldb/source/API/CMakeLists.txt:171 (message):
Private LLDB symbols frequently change and no API stability is guaranteed.
Only the SB API is guaranteed to be stable.
-- Found make: /usr/bin/make
CMake Warning at /wrkdirs/usr/ports/devel/llvm-devel/work-default/llvm-project-fb423ba07c3ff51fda3caa41d8bbb78d50f61906/lldb/test/API/CMakeLists.txt:61 (message):
'make' tool /usr/bin/make may not be GNU make compatible. Some tests may
fail to build. Provide a GNU compatible 'make' tool by setting
LLDB_TEST_MAKE.
-- Found dirname: /usr/bin/dirname
-- Performing Test CXX_SUPPORTS_DOCUMENTATION
-- Performing Test CXX_SUPPORTS_DOCUMENTATION - Success
-- Performing Test CXX_SUPPORTS_NO_DOCUMENTATION_DEPRECATED_SYNC
-- Performing Test CXX_SUPPORTS_NO_DOCUMENTATION_DEPRECATED_SYNC - Success
-- Not building llvm-mt because libxml2 is not available
-- Sphinx enabled.
-- ISL version: isl-0.27-89-gdc16f8e3
-- Performing Test HAS_ATTRIBUTE_WARN_UNUSED_RESULT
-- Performing Test HAS_ATTRIBUTE_WARN_UNUSED_RESULT - Success
-- Performing Test HAVE___ATTRIBUTE__
-- Performing Test HAVE___ATTRIBUTE__ - Success
-- Performing Test HAVE_DECL_FFS
-- Performing Test HAVE_DECL_FFS - Success
-- Performing Test HAVE_DECL___BUILTIN_FFS
-- Performing Test HAVE_DECL___BUILTIN_FFS - Success
-- Performing Test HAVE_DECL__BITSCANFORWARD
-- Performing Test HAVE_DECL__BITSCANFORWARD - Failed
-- Performing Test HAVE_DECL_STRCASECMP
-- Performing Test HAVE_DECL_STRCASECMP - Success
-- Performing Test HAVE_DECL__STRICMP
-- Performing Test HAVE_DECL__STRICMP - Failed
-- Performing Test HAVE_DECL_STRNCASECMP
-- Performing Test HAVE_DECL_STRNCASECMP - Success
-- Performing Test HAVE_DECL__STRNICMP
-- Performing Test HAVE_DECL__STRNICMP - Failed
-- Performing Test HAVE_DECL_SNPRINTF
-- Performing Test HAVE_DECL_SNPRINTF - Success
-- Performing Test HAVE_DECL__SNPRINTF
-- Performing Test HAVE_DECL__SNPRINTF - Failed
-- Performing Test HAVE_UINT8T
-- Performing Test HAVE_UINT8T - Failed
-- Performing Test HAVE_INTTYPES_H
-- Performing Test HAVE_INTTYPES_H - Success
-- Performing Test HAVE_SYS_INTTYPES_H
-- Performing Test HAVE_SYS_INTTYPES_H - Success
-- Registering Polly as a pass plugin (static build: ON)
-- Registering ExampleIRTransforms as a pass plugin (static build: OFF)
-- Registering Bye as a pass plugin (static build: OFF)
-- Sphinx enabled.
-- Could NOT find Git (missing: GIT_EXECUTABLE)
-- Google Benchmark version: v1.9.5, normalized to 1.9.5
-- Looking for shm_open in rt
-- Looking for shm_open in rt - found
-- Performing Test HAVE_CXX_FLAG_WALL
-- Performing Test HAVE_CXX_FLAG_WALL - Success
-- Performing Test HAVE_CXX_FLAG_WEXTRA
-- Performing Test HAVE_CXX_FLAG_WEXTRA - Success
-- Performing Test HAVE_CXX_FLAG_WSHADOW
-- Performing Test HAVE_CXX_FLAG_WSHADOW - Success
-- Performing Test HAVE_CXX_FLAG_WFLOAT_EQUAL
-- Performing Test HAVE_CXX_FLAG_WFLOAT_EQUAL - Success
-- Performing Test HAVE_CXX_FLAG_WOLD_STYLE_CAST
-- Performing Test HAVE_CXX_FLAG_WOLD_STYLE_CAST - Success
-- Performing Test HAVE_CXX_FLAG_WCONVERSION
-- Performing Test HAVE_CXX_FLAG_WCONVERSION - Success
-- Performing Test HAVE_CXX_FLAG_WFORMAT_2
-- Performing Test HAVE_CXX_FLAG_WFORMAT_2 - Success
-- Performing Test HAVE_CXX_FLAG_WSUGGEST_OVERRIDE
-- Performing Test HAVE_CXX_FLAG_WSUGGEST_OVERRIDE - Success
-- Performing Test HAVE_CXX_FLAG_PEDANTIC
-- Performing Test HAVE_CXX_FLAG_PEDANTIC - Success
-- Performing Test HAVE_CXX_FLAG_PEDANTIC_ERRORS
-- Performing Test HAVE_CXX_FLAG_PEDANTIC_ERRORS - Success
-- Performing Test HAVE_CXX_FLAG_WSHORTEN_64_TO_32
-- Performing Test HAVE_CXX_FLAG_WSHORTEN_64_TO_32 - Success
-- Performing Test HAVE_CXX_FLAG_FSTRICT_ALIASING
-- Performing Test HAVE_CXX_FLAG_FSTRICT_ALIASING - Success
-- Performing Test HAVE_CXX_FLAG_WNO_DEPRECATED_DECLARATIONS
-- Performing Test HAVE_CXX_FLAG_WNO_DEPRECATED_DECLARATIONS - Success
-- Performing Test HAVE_CXX_FLAG_FNO_EXCEPTIONS
-- Performing Test HAVE_CXX_FLAG_FNO_EXCEPTIONS - Success
-- Performing Test HAVE_CXX_FLAG_WSTRICT_ALIASING
-- Performing Test HAVE_CXX_FLAG_WSTRICT_ALIASING - Success
-- Performing Test HAVE_CXX_FLAG_WTHREAD_SAFETY
-- Performing Test HAVE_CXX_FLAG_WTHREAD_SAFETY - Success
-- Enabling additional flags: -DINCLUDE_DIRECTORIES=/wrkdirs/usr/ports/devel/llvm-devel/work-default/llvm-project-fb423ba07c3ff51fda3caa41d8bbb78d50f61906/third-party/benchmark/include
-- Performing Test THREAD_SAFETY_ATTRIBUTES -- success
-- Performing Test HAVE_CXX_FLAG_COVERAGE
-- Performing Test HAVE_CXX_FLAG_COVERAGE - Success
CMake Warning at /wrkdirs/usr/ports/devel/llvm-devel/work-default/llvm-project-fb423ba07c3ff51fda3caa41d8bbb78d50f61906/third-party/benchmark/CMakeLists.txt:329 (message):
Using std::regex with exceptions disabled is not fully supported
-- Performing Test STEADY_CLOCK -- success
-- Performing Test PTHREAD_AFFINITY -- failed
-- Configuring done (58.8s)
-- Generating done (36.9s)
CMake Warning:
Manually-specified variables were not used by the project:
BOOST_PYTHON_SUFFIX
CMAKE_COLOR_MAKEFILE
FETCHCONTENT_FULLY_DISCONNECTED
Python_ADDITIONAL_VERSIONS
Python_EXECUTABLE
-- Build files have been written to: /wrkdirs/usr/ports/devel/llvm-devel/work-default/.build
===========================================================================
=======================<phase: build >============================
===== env: NO_DEPENDS=yes USER=root UID=0 GID=0
===> Building for llvm-devel-23.0.d20260714
[ 0% 3/10905] /usr/bin/c++ -DLLVM_EXPORTS -D_DEBUG -D_FILE_OFFSET_BITS=64 -D_GLIBCXX_ASSERTIONS -D_LARGEFILE_SOURCE -D_LIBCPP_HARDENING_MODE=_LIBCPP_HARDENING_MODE_EXTENSIVE -D__STDC_CONSTANT_MACROS -D__STDC_FORMAT_MACROS -D__STDC_LIMIT_MACROS -I/wrkdirs/usr/ports/devel/llvm-devel/work-default/.build/lib/Demangle -I/wrkdirs/usr/ports/devel/llvm-devel/work-default/llvm-project-fb423ba07c3ff51fda3caa41d8bbb78d50f61906/llvm/lib/Demangle -I/wrkdirs/usr/ports/devel/llvm-devel/work-default/.build/include -I/wrkdirs/usr/ports/devel/llvm-devel/work-default/llvm-project-fb423ba07c3ff51fda3caa41d8bbb78d50f61906/llvm/include -O2 -pipe -fstack-protector-strong -isystem /usr/local/include -fno-strict-aliasing -isystem /usr/local/include -fPIC -fno-semantic-interposition -fvisibility-inlines-hidden -Werror=date-time -Werror=unguarded-availability-new -Wall -Wextra -Wno-unused-parameter -Wwrite-strings -Wcast-qual -Wmissing-field-initializers -pedantic -Wno-long-long -Wc++98-compat-extra
-semi -Wimplicit-fallthrough -Wcovered-switch-default -Wno-noexcept-type -Wnon-virtual-dtor -Wdelete-non-virtual-dtor -Wsuggest-override -Wstring-conversion -Wno-pass-failed -Wmisleading-indentation -Wctad-maybe-unsupported -fdiagnostics-color -ffunction-sections -fdata-sections -Xclang -fno-pch-timestamp -O2 -pipe -fstack-protector-strong -isystem /usr/local/include -fno-strict-aliasing -isystem /usr/local/include -DNDEBUG -std=c++17 -UNDEBUG -fno-exceptions -funwind-tables -MD -MT lib/Demangle/CMakeFiles/LLVMDemangle.dir/Demangle.cpp.o -MF lib/Demangle/CMakeFiles/LLVMDemangle.dir/Demangle.cpp.o.d -o lib/Demangle/CMakeFiles/LLVMDemangle.dir/Demangle.cpp.o -c /wrkdirs/usr/ports/devel/llvm-devel/work-default/llvm-project-fb423ba07c3ff51fda3caa41d8bbb78d50f61906/llvm/lib/Demangle/Demangle.cpp
[ 0% 4/10905] /usr/bin/c++ -DLLVM_EXPORTS -D_DEBUG -D_FILE_OFFSET_BITS=64 -D_GLIBCXX_ASSERTIONS -D_LARGEFILE_SOURCE -D_LIBCPP_HARDENING_MODE=_LIBCPP_HARDENING_MODE_EXTENSIVE -D__STDC_CONSTANT_MACROS -D__STDC_FORMAT_MACROS -D__STDC_LIMIT_MACROS -I/wrkdirs/usr/ports/devel/llvm-devel/work-default/.build/lib/Demangle -I/wrkdirs/usr/ports/devel/llvm-devel/work-default/llvm-project-fb423ba07c3ff51fda3caa41d8bbb78d50f61906/llvm/lib/Demangle -I/wrkdirs/usr/ports/devel/llvm-devel/work-default/.build/include -I/wrkdirs/usr/ports/devel/llvm-devel/work-default/llvm-project-fb423ba07c3ff51fda3caa41d8bbb78d50f61906/llvm/include -O2 -pipe -fstack-protector-strong -isystem /usr/local/include -fno-strict-aliasing -isystem /usr/local/include -fPIC -fno-semantic-interposition -fvisibility-inlines-hidden -Werror=date-time -Werror=unguarded-availability-new -Wall -Wextra -Wno-unused-parameter -Wwrite-strings -Wcast-qual -Wmissing-field-initializers -pedantic -Wno-long-long -Wc++98-compat-extra
-semi -Wimplicit-fallthrough -Wcovered-switch-default -Wno-noexcept-type -Wnon-virtual-dtor -Wdelete-non-virtual-dtor -Wsuggest-override -Wstring-conversion -Wno-pass-failed -Wmisleading-indentation -Wctad-maybe-unsupported -fdiagnostics-color -ffunction-sections -fdata-sections -Xclang -fno-pch-timestamp -O2 -pipe -fstack-protector-strong -isystem /usr/local/include -fno-strict-aliasing -isystem /usr/local/include -DNDEBUG -std=c++17 -UNDEBUG -fno-exceptions -funwind-tables -MD -MT lib/Demangle/CMakeFiles/LLVMDemangle.dir/MicrosoftDemangle.cpp.o -MF lib/Demangle/CMakeFiles/LLVMDemangle.dir/MicrosoftDemangle.cpp.o.d -o lib/Demangle/CMakeFiles/LLVMDemangle.dir/MicrosoftDemangle.cpp.o -c /wrkdirs/usr/ports/devel/llvm-devel/work-default/llvm-project-fb423ba07c3ff51fda3caa41d8bbb78d50f61906/llvm/lib/Demangle/MicrosoftDemangle.cpp
[ 0% 5/10905] /usr/bin/c++ -DLLVM_EXPORTS -D_DEBUG -D_FILE_OFFSET_BITS=64 -D_GLIBCXX_ASSERTIONS -D_LARGEFILE_SOURCE -D_LIBCPP_HARDENING_MODE=_LIBCPP_HARDENING_MODE_EXTENSIVE -D__STDC_CONSTANT_MACROS -D__STDC_FORMAT_MACROS -D__STDC_LIMIT_MACROS -I/wrkdirs/usr/ports/devel/llvm-devel/work-default/.build/lib/Demangle -I/wrkdirs/usr/ports/devel/llvm-devel/work-default/llvm-project-fb423ba07c3ff51fda3caa41d8bbb78d50f61906/llvm/lib/Demangle -I/wrkdirs/usr/ports/devel/llvm-devel/work-default/.build/include -I/wrkdirs/usr/ports/devel/llvm-devel/work-default/llvm-project-fb423ba07c3ff51fda3caa41d8bbb78d50f61906/llvm/include -O2 -pipe -fstack-protector-strong -isystem /usr/local/include -fno-strict-aliasing -isystem /usr/local/include -fPIC -fno-semantic-interposition -fvisibility-inlines-hidden -Werror=date-time -Werror=unguarded-availability-new -Wall -Wextra -Wno-unused-parameter -Wwrite-strings -Wcast-qual -Wmissing-field-initializers -pedantic -Wno-long-long -Wc++98-compat-extra
-semi -Wimplicit-fallthrough -Wcovered-switch-default -Wno-noexcept-type -Wnon-virtual-dtor -Wdelete-non-virtual-dtor -Wsuggest-override -Wstring-conversion -Wno-pass-failed -Wmisleading-indentation -Wctad-maybe-unsupported -fdiagnostics-color -ffunction-sections -fdata-sections -Xclang -fno-pch-timestamp -O2 -pipe -fstack-protector-strong -isystem /usr/local/include -fno-strict-aliasing -isystem /usr/local/include -DNDEBUG -std=c++17 -UNDEBUG -fno-exceptions -funwind-tables -MD -MT lib/Demangle/CMakeFiles/LLVMDemangle.dir/MicrosoftDemangleNodes.cpp.o -MF lib/Demangle/CMakeFiles/LLVMDemangle.dir/MicrosoftDemangleNodes.cpp.o.d -o lib/Demangle/CMakeFiles/LLVMDemangle.dir/MicrosoftDemangleNodes.cpp.o -c /wrkdirs/usr/ports/devel/llvm-devel/work-default/llvm-project-fb423ba07c3ff51fda3caa41d8bbb78d50f61906/llvm/lib/Demangle/MicrosoftDemangleNodes.cpp
[ 0% 6/10905] /usr/bin/c++ -DLLVM_EXPORTS -D_DEBUG -D_FILE_OFFSET_BITS=64 -D_GLIBCXX_ASSERTIONS -D_LARGEFILE_SOURCE -D_LIBCPP_HARDENING_MODE=_LIBCPP_HARDENING_MODE_EXTENSIVE -D__STDC_CONSTANT_MACROS -D__STDC_FORMAT_MACROS -D__STDC_LIMIT_MACROS -I/wrkdirs/usr/ports/devel/llvm-devel/work-default/.build/lib/Demangle -I/wrkdirs/usr/ports/devel/llvm-devel/work-default/llvm-project-fb423ba07c3ff51fda3caa41d8bbb78d50f61906/llvm/lib/Demangle -I/wrkdirs/usr/ports/devel/llvm-devel/work-default/.build/include -I/wrkdirs/usr/ports/devel/llvm-devel/work-default/llvm-project-fb423ba07c3ff51fda3caa41d8bbb78d50f61906/llvm/include -O2 -pipe -fstack-protector-strong -isystem /usr/local/include -fno-strict-aliasing -isystem /usr/local/include -fPIC -fno-semantic-interposition -fvisibility-inlines-hidden -Werror=date-time -Werror=unguarded-availability-new -Wall -Wextra -Wno-unused-parameter -Wwrite-strings -Wcast-qual -Wmissing-field-initializers -pedantic -Wno-long-long -Wc++98-compat-extra
-semi -Wimplicit-fallthrough -Wcovered-switch-default -Wno-noexcept-type -Wnon-virtual-dtor -Wdelete-non-virtual-dtor -Wsuggest-override -Wstring-conversion -Wno-pass-failed -Wmisleading-indentation -Wctad-maybe-unsupported -fdiagnostics-color -ffunction-sections -fdata-sections -Xclang -fno-pch-timestamp -O2 -pipe -fstack-protector-strong -isystem /usr/local/include -fno-strict-aliasing -isystem /usr/local/include -DNDEBUG -std=c++17 -UNDEBUG -fno-exceptions -funwind-tables -MD -MT lib/Demangle/CMakeFiles/LLVMDemangle.dir/DLangDemangle.cpp.o -MF lib/Demangle/CMakeFiles/LLVMDemangle.dir/DLangDemangle.cpp.o.d -o lib/Demangle/CMakeFiles/LLVMDemangle.dir/DLangDemangle.cpp.o -c /wrkdirs/usr/ports/devel/llvm-devel/work-default/llvm-project-fb423ba07c3ff51fda3caa41d8bbb78d50f61906/llvm/lib/Demangle/DLangDemangle.cpp
[ 0% 7/10905] /usr/bin/c++ -DLLVM_EXPORTS -D_DEBUG -D_FILE_OFFSET_BITS=64 -D_GLIBCXX_ASSERTIONS -D_LARGEFILE_SOURCE -D_LIBCPP_HARDENING_MODE=_LIBCPP_HARDENING_MODE_EXTENSIVE -D__STDC_CONSTANT_MACROS -D__STDC_FORMAT_MACROS -D__STDC_LIMIT_MACROS -I/wrkdirs/usr/ports/devel/llvm-devel/work-default/.build/lib/Demangle -I/wrkdirs/usr/ports/devel/llvm-devel/work-default/llvm-project-fb423ba07c3ff51fda3caa41d8bbb78d50f61906/llvm/lib/Demangle -I/wrkdirs/usr/ports/devel/llvm-devel/work-default/.build/include -I/wrkdirs/usr/ports/devel/llvm-devel/work-default/llvm-project-fb423ba07c3ff51fda3caa41d8bbb78d50f61906/llvm/include -O2 -pipe -fstack-protector-strong -isystem /usr/local/include -fno-strict-aliasing -isystem /usr/local/include -fPIC -fno-semantic-interposition -fvisibility-inlines-hidden -Werror=date-time -Werror=unguarded-availability-new -Wall -Wextra -Wno-unused-parameter -Wwrite-strings -Wcast-qual -Wmissing-field-initializers -pedantic -Wno-long-long -Wc++98-compat-extra
-semi -Wimplicit-fallthrough -Wcovered-switch-default -Wno-noexcept-type -Wnon-virtual-dtor -Wdelete-non-virtual-dtor -Wsuggest-override -Wstring-conversion -Wno-pass-failed -Wmisleading-indentation -Wctad-maybe-unsupported -fdiagnostics-color -ffunction-sections -fdata-sections -Xclang -fno-pch-timestamp -O2 -pipe -fstack-protector-strong -isystem /usr/local/include -fno-strict-aliasing -isystem /usr/local/include -DNDEBUG -std=c++17 -UNDEBUG -fno-exceptions -funwind-tables -MD -MT lib/Demangle/CMakeFiles/LLVMDemangle.dir/RustDemangle.cpp.o -MF lib/Demangle/CMakeFiles/LLVMDemangle.dir/RustDemangle.cpp.o.d -o lib/Demangle/CMakeFiles/LLVMDemangle.dir/RustDemangle.cpp.o -c /wrkdirs/usr/ports/devel/llvm-devel/work-default/llvm-project-fb423ba07c3ff51fda3caa41d8bbb78d50f61906/llvm/lib/Demangle/RustDemangle.cpp
[ 0% 8/10905] /usr/bin/cc -DLLVM_EXPORTS -D_DEBUG -D_FILE_OFFSET_BITS=64 -D_GLIBCXX_ASSERTIONS -D_LARGEFILE_SOURCE -D_LIBCPP_HARDENING_MODE=_LIBCPP_HARDENING_MODE_EXTENSIVE -D__STDC_CONSTANT_MACROS -D__STDC_FORMAT_MACROS -D__STDC_LIMIT_MACROS -I/wrkdirs/usr/ports/devel/llvm-devel/work-default/.build/lib/Support -I/wrkdirs/usr/ports/devel/llvm-devel/work-default/llvm-project-fb423ba07c3ff51fda3caa41d8bbb78d50f61906/llvm/lib/Support -I/wrkdirs/usr/ports/devel/llvm-devel/work-default/.build/include -I/wrkdirs/usr/ports/devel/llvm-devel/work-default/llvm-project-fb423ba07c3ff51fda3caa41d8bbb78d50f61906/llvm/include -I/wrkdirs/usr/ports/devel/llvm-devel/work-default/llvm-project-fb423ba07c3ff51fda3caa41d8bbb78d50f61906/llvm/../third-party/siphash/include -I/wrkdirs/usr/ports/devel/llvm-devel/work-default/llvm-project-fb423ba07c3ff51fda3caa41d8bbb78d50f61906/llvm/../libc -O2 -pipe -fstack-protector-strong -isystem /usr/local/include -fno-strict-aliasing -fPIC -fno-semantic-inter
position -Werror=date-time -Werror=unguarded-availability-new -Wall -Wextra -Wno-unused-parameter -Wwrite-strings -Wcast-qual -Wmissing-field-initializers -pedantic -Wno-long-long -Wc++98-compat-extra-semi -Wimplicit-fallthrough -Wcovered-switch-default -Wstring-conversion -Wmisleading-indentation -Wctad-maybe-unsupported -fdiagnostics-color -ffunction-sections -fdata-sections -O2 -pipe -fstack-protector-strong -isystem /usr/local/include -fno-strict-aliasing -DNDEBUG -UNDEBUG -Wno-c99-extensions -MD -MT lib/Support/CMakeFiles/LLVMSupport.dir/regcomp.c.o -MF lib/Support/CMakeFiles/LLVMSupport.dir/regcomp.c.o.d -o lib/Support/CMakeFiles/LLVMSupport.dir/regcomp.c.o -c /wrkdirs/usr/ports/devel/llvm-devel/work-default/llvm-project-fb423ba07c3ff51fda3caa41d8bbb78d50f61906/llvm/lib/Support/regcomp.c
[ 0% 9/10905] /usr/bin/cc -DLLVM_EXPORTS -D_DEBUG -D_FILE_OFFSET_BITS=64 -D_GLIBCXX_ASSERTIONS -D_LARGEFILE_SOURCE -D_LIBCPP_HARDENING_MODE=_LIBCPP_HARDENING_MODE_EXTENSIVE -D__STDC_CONSTANT_MACROS -D__STDC_FORMAT_MACROS -D__STDC_LIMIT_MACROS -I/wrkdirs/usr/ports/devel/llvm-devel/work-default/.build/lib/Support -I/wrkdirs/usr/ports/devel/llvm-devel/work-default/llvm-project-fb423ba07c3ff51fda3caa41d8bbb78d50f61906/llvm/lib/Support -I/wrkdirs/usr/ports/devel/llvm-devel/work-default/.build/include -I/wrkdirs/usr/ports/devel/llvm-devel/work-default/llvm-project-fb423ba07c3ff51fda3caa41d8bbb78d50f61906/llvm/include -I/wrkdirs/usr/ports/devel/llvm-devel/work-default/llvm-project-fb423ba07c3ff51fda3caa41d8bbb78d50f61906/llvm/../third-party/siphash/include -I/wrkdirs/usr/ports/devel/llvm-devel/work-default/llvm-project-fb423ba07c3ff51fda3caa41d8bbb78d50f61906/llvm/../libc -O2 -pipe -fstack-protector-strong -isystem /usr/local/include -fno-strict-aliasing -fPIC -fno-semantic-inter
position -Werror=date-time -Werror=unguarded-availability-new -Wall -Wextra -Wno-unused-parameter -Wwrite-strings -Wcast-qual -Wmissing-field-initializers -pedantic -Wno-long-long -Wc++98-compat-extra-semi -Wimplicit-fallthrough -Wcovered-switch-default -Wstring-conversion -Wmisleading-indentation -Wctad-maybe-unsupported -fdiagnostics-color -ffunction-sections -fdata-sections -O2 -pipe -fstack-protector-strong -isystem /usr/local/include -fno-strict-aliasing -DNDEBUG -UNDEBUG -Wno-c99-extensions -MD -MT lib/Support/CMakeFiles/LLVMSupport.dir/regerror.c.o -MF lib/Support/CMakeFiles/LLVMSupport.dir/regerror.c.o.d -o lib/Support/CMakeFiles/LLVMSupport.dir/regerror.c.o -c /wrkdirs/usr/ports/devel/llvm-devel/work-default/llvm-project-fb423ba07c3ff51fda3caa41d8bbb78d50f61906/llvm/lib/Support/regerror.c
[ 0% 10/10905] /usr/bin/cc -DLLVM_EXPORTS -D_DEBUG -D_FILE_OFFSET_BITS=64 -D_GLIBCXX_ASSERTIONS -D_LARGEFILE_SOURCE -D_LIBCPP_HARDENING_MODE=_LIBCPP_HARDENING_MODE_EXTENSIVE -D__STDC_CONSTANT_MACROS -D__STDC_FORMAT_MACROS -D__STDC_LIMIT_MACROS -I/wrkdirs/usr/ports/devel/llvm-devel/work-default/.build/lib/Support -I/wrkdirs/usr/ports/devel/llvm-devel/work-default/llvm-project-fb423ba07c3ff51fda3caa41d8bbb78d50f61906/llvm/lib/Support -I/wrkdirs/usr/ports/devel/llvm-devel/work-default/.build/include -I/wrkdirs/usr/ports/devel/llvm-devel/work-default/llvm-project-fb423ba07c3ff51fda3caa41d8bbb78d50f61906/llvm/include -I/wrkdirs/usr/ports/devel/llvm-devel/work-default/llvm-project-fb423ba07c3ff51fda3caa41d8bbb78d50f61906/llvm/../third-party/siphash/include -I/wrkdirs/usr/ports/devel/llvm-devel/work-default/llvm-project-fb423ba07c3ff51fda3caa41d8bbb78d50f61906/llvm/../libc -O2 -pipe -fstack-protector-strong -isystem /usr/local/include -fno-strict-aliasing -fPIC -fno-semantic-inte
rposition -Werror=date-time -Werror=unguarded-availability-new -Wall -Wextra -Wno-unused-parameter -Wwrite-strings -Wcast-qual -Wmissing-field-initializers -pedantic -Wno-long-long -Wc++98-compat-extra-semi -Wimplicit-fallthrough -Wcovered-switch-default -Wstring-conversion -Wmisleading-indentation -Wctad-maybe-unsupported -fdiagnostics-color -ffunction-sections -fdata-sections -O2 -pipe -fstack-protector-strong -isystem /usr/local/include -fno-strict-aliasing -DNDEBUG -UNDEBUG -Wno-c99-extensions -MD -MT lib/Support/CMakeFiles/LLVMSupport.dir/regexec.c.o -MF lib/Support/CMakeFiles/LLVMSupport.dir/regexec.c.o.d -o lib/Support/CMakeFiles/LLVMSupport.dir/regexec.c.o -c /wrkdirs/usr/ports/devel/llvm-devel/work-default/llvm-project-fb423ba07c3ff51fda3caa41d8bbb78d50f61906/llvm/lib/Support/regexec.c
[ 0% 11/10905] /usr/bin/cc -DLLVM_EXPORTS -D_DEBUG -D_FILE_OFFSET_BITS=64 -D_GLIBCXX_ASSERTIONS -D_LARGEFILE_SOURCE -D_LIBCPP_HARDENING_MODE=_LIBCPP_HARDENING_MODE_EXTENSIVE -D__STDC_CONSTANT_MACROS -D__STDC_FORMAT_MACROS -D__STDC_LIMIT_MACROS -I/wrkdirs/usr/ports/devel/llvm-devel/work-default/.build/lib/Support -I/wrkdirs/usr/ports/devel/llvm-devel/work-default/llvm-project-fb423ba07c3ff51fda3caa41d8bbb78d50f61906/llvm/lib/Support -I/wrkdirs/usr/ports/devel/llvm-devel/work-default/.build/include -I/wrkdirs/usr/ports/devel/llvm-devel/work-default/llvm-project-fb423ba07c3ff51fda3caa41d8bbb78d50f61906/llvm/include -I/wrkdirs/usr/ports/devel/llvm-devel/work-default/llvm-project-fb423ba07c3ff51fda3caa41d8bbb78d50f61906/llvm/../third-party/siphash/include -I/wrkdirs/usr/ports/devel/llvm-devel/work-default/llvm-project-fb423ba07c3ff51fda3caa41d8bbb78d50f61906/llvm/../libc -O2 -pipe -fstack-protector-strong -isystem /usr/local/include -fno-strict-aliasing -fPIC -fno-semantic-inte
rposition -Werror=date-time -Werror=unguarded-availability-new -Wall -Wextra -Wno-unused-parameter -Wwrite-strings -Wcast-qual -Wmissing-field-initializers -pedantic -Wno-long-long -Wc++98-compat-extra-semi -Wimplicit-fallthrough -Wcovered-switch-default -Wstring-conversion -Wmisleading-indentation -Wctad-maybe-unsupported -fdiagnostics-color -ffunction-sections -fdata-sections -O2 -pipe -fstack-protector-strong -isystem /usr/local/include -fno-strict-aliasing -DNDEBUG -UNDEBUG -Wno-c99-extensions -MD -MT lib/Support/CMakeFiles/LLVMSupport.dir/regfree.c.o -MF lib/Support/CMakeFiles/LLVMSupport.dir/regfree.c.o.d -o lib/Support/CMakeFiles/LLVMSupport.dir/regfree.c.o -c /wrkdirs/usr/ports/devel/llvm-devel/work-default/llvm-project-fb423ba07c3ff51fda3caa41d8bbb78d50f61906/llvm/lib/Support/regfree.c
[ 0% 12/10905] /usr/bin/cc -DLLVM_EXPORTS -D_DEBUG -D_FILE_OFFSET_BITS=64 -D_GLIBCXX_ASSERTIONS -D_LARGEFILE_SOURCE -D_LIBCPP_HARDENING_MODE=_LIBCPP_HARDENING_MODE_EXTENSIVE -D__STDC_CONSTANT_MACROS -D__STDC_FORMAT_MACROS -D__STDC_LIMIT_MACROS -I/wrkdirs/usr/ports/devel/llvm-devel/work-default/.build/lib/Support -I/wrkdirs/usr/ports/devel/llvm-devel/work-default/llvm-project-fb423ba07c3ff51fda3caa41d8bbb78d50f61906/llvm/lib/Support -I/wrkdirs/usr/ports/devel/llvm-devel/work-default/.build/include -I/wrkdirs/usr/ports/devel/llvm-devel/work-default/llvm-project-fb423ba07c3ff51fda3caa41d8bbb78d50f61906/llvm/include -I/wrkdirs/usr/ports/devel/llvm-devel/work-default/llvm-project-fb423ba07c3ff51fda3caa41d8bbb78d50f61906/llvm/../third-party/siphash/include -I/wrkdirs/usr/ports/devel/llvm-devel/work-default/llvm-project-fb423ba07c3ff51fda3caa41d8bbb78d50f61906/llvm/../libc -O2 -pipe -fstack-protector-strong -isystem /usr/local/include -fno-strict-aliasing -fPIC -fno-semantic-inte
rposition -Werror=date-time -Werror=unguarded-availability-new -Wall -Wextra -Wno-unused-parameter -Wwrite-strings -Wcast-qual -Wmissing-field-initializers -pedantic -Wno-long-long -Wc++98-compat-extra-semi -Wimplicit-fallthrough -Wcovered-switch-default -Wstring-conversion -Wmisleading-indentation -Wctad-maybe-unsupported -fdiagnostics-color -ffunction-sections -fdata-sections -O2 -pipe -fstack-protector-strong -isystem /usr/local/include -fno-strict-aliasing -DNDEBUG -UNDEBUG -Wno-c99-extensions -MD -MT lib/Support/CMakeFiles/LLVMSupport.dir/regstrlcpy.c.o -MF lib/Support/CMakeFiles/LLVMSupport.dir/regstrlcpy.c.o.d -o lib/Support/CMakeFiles/LLVMSupport.dir/regstrlcpy.c.o -c /wrkdirs/usr/ports/devel/llvm-devel/work-default/llvm-project-fb423ba07c3ff51fda3caa41d8bbb78d50f61906/llvm/lib/Support/regstrlcpy.c
[ 0% 13/10905] /usr/bin/c++ -DLLVM_EXPORTS -D_DEBUG -D_FILE_OFFSET_BITS=64 -D_GLIBCXX_ASSERTIONS -D_LARGEFILE_SOURCE -D_LIBCPP_HARDENING_MODE=_LIBCPP_HARDENING_MODE_EXTENSIVE -D__STDC_CONSTANT_MACROS -D__STDC_FORMAT_MACROS -D__STDC_LIMIT_MACROS -I/wrkdirs/usr/ports/devel/llvm-devel/work-default/.build/lib/Demangle -I/wrkdirs/usr/ports/devel/llvm-devel/work-default/llvm-project-fb423ba07c3ff51fda3caa41d8bbb78d50f61906/llvm/lib/Demangle -I/wrkdirs/usr/ports/devel/llvm-devel/work-default/.build/include -I/wrkdirs/usr/ports/devel/llvm-devel/work-default/llvm-project-fb423ba07c3ff51fda3caa41d8bbb78d50f61906/llvm/include -O2 -pipe -fstack-protector-strong -isystem /usr/local/include -fno-strict-aliasing -isystem /usr/local/include -fPIC -fno-semantic-interposition -fvisibility-inlines-hidden -Werror=date-time -Werror=unguarded-availability-new -Wall -Wextra -Wno-unused-parameter -Wwrite-strings -Wcast-qual -Wmissing-field-initializers -pedantic -Wno-long-long -Wc++98-compat-extr
a-semi -Wimplicit-fallthrough -Wcovered-switch-default -Wno-noexcept-type -Wnon-virtual-dtor -Wdelete-non-virtual-dtor -Wsuggest-override -Wstring-conversion -Wno-pass-failed -Wmisleading-indentation -Wctad-maybe-unsupported -fdiagnostics-color -ffunction-sections -fdata-sections -Xclang -fno-pch-timestamp -O2 -pipe -fstack-protector-strong -isystem /usr/local/include -fno-strict-aliasing -isystem /usr/local/include -DNDEBUG -std=c++17 -UNDEBUG -fno-exceptions -funwind-tables -MD -MT lib/Demangle/CMakeFiles/LLVMDemangle.dir/ItaniumDemangle.cpp.o -MF lib/Demangle/CMakeFiles/LLVMDemangle.dir/ItaniumDemangle.cpp.o.d -o lib/Demangle/CMakeFiles/LLVMDemangle.dir/ItaniumDemangle.cpp.o -c /wrkdirs/usr/ports/devel/llvm-devel/work-default/llvm-project-fb423ba07c3ff51fda3caa41d8bbb78d50f61906/llvm/lib/Demangle/ItaniumDemangle.cpp
[ 0% 14/10905] : && /usr/local/bin/cmake -E rm -f lib/libLLVMDemangle.a && /usr/bin/llvm-ar qc lib/libLLVMDemangle.a lib/Demangle/CMakeFiles/LLVMDemangle.dir/Demangle.cpp.o lib/Demangle/CMakeFiles/LLVMDemangle.dir/ItaniumDemangle.cpp.o lib/Demangle/CMakeFiles/LLVMDemangle.dir/MicrosoftDemangle.cpp.o lib/Demangle/CMakeFiles/LLVMDemangle.dir/MicrosoftDemangleNodes.cpp.o lib/Demangle/CMakeFiles/LLVMDemangle.dir/RustDemangle.cpp.o lib/Demangle/CMakeFiles/LLVMDemangle.dir/DLangDemangle.cpp.o && /usr/bin/llvm-ranlib lib/libLLVMDemangle.a && :
[ 0% 15/10905] /usr/bin/cc -DBLAKE3_NO_AVX2 -DBLAKE3_NO_AVX512 -DBLAKE3_NO_SSE2 -DBLAKE3_NO_SSE41 -DLLVM_EXPORTS -D_DEBUG -D_FILE_OFFSET_BITS=64 -D_GLIBCXX_ASSERTIONS -D_LARGEFILE_SOURCE -D_LIBCPP_HARDENING_MODE=_LIBCPP_HARDENING_MODE_EXTENSIVE -D__STDC_CONSTANT_MACROS -D__STDC_FORMAT_MACROS -D__STDC_LIMIT_MACROS -I/wrkdirs/usr/ports/devel/llvm-devel/work-default/.build/lib/Support/BLAKE3 -I/wrkdirs/usr/ports/devel/llvm-devel/work-default/llvm-project-fb423ba07c3ff51fda3caa41d8bbb78d50f61906/llvm/lib/Support/BLAKE3 -I/wrkdirs/usr/ports/devel/llvm-devel/work-default/.build/include -I/wrkdirs/usr/ports/devel/llvm-devel/work-default/llvm-project-fb423ba07c3ff51fda3caa41d8bbb78d50f61906/llvm/include -O2 -pipe -fstack-protector-strong -isystem /usr/local/include -fno-strict-aliasing -fPIC -fno-semantic-interposition -Werror=date-time -Werror=unguarded-availability-new -Wall -Wextra -Wno-unused-parameter -Wwrite-strings -Wcast-qual -Wmissing-field-initializers -pedantic -Wno-lon
g-long -Wc++98-compat-extra-semi -Wimplicit-fallthrough -Wcovered-switch-default -Wstring-conversion -Wmisleading-indentation -Wctad-maybe-unsupported -fdiagnostics-color -ffunction-sections -fdata-sections -O2 -pipe -fstack-protector-strong -isystem /usr/local/include -fno-strict-aliasing -DNDEBUG -UNDEBUG -MD -MT lib/Support/BLAKE3/CMakeFiles/LLVMSupportBlake3.dir/blake3.c.o -MF lib/Support/BLAKE3/CMakeFiles/LLVMSupportBlake3.dir/blake3.c.o.d -o lib/Support/BLAKE3/CMakeFiles/LLVMSupportBlake3.dir/blake3.c.o -c /wrkdirs/usr/ports/devel/llvm-devel/work-default/llvm-project-fb423ba07c3ff51fda3caa41d8bbb78d50f61906/llvm/lib/Support/BLAKE3/blake3.c
[ 0% 16/10905] /usr/bin/c++ -DLLVM_EXPORTS -D_DEBUG -D_FILE_OFFSET_BITS=64 -D_GLIBCXX_ASSERTIONS -D_LARGEFILE_SOURCE -D_LIBCPP_HARDENING_MODE=_LIBCPP_HARDENING_MODE_EXTENSIVE -D__STDC_CONSTANT_MACROS -D__STDC_FORMAT_MACROS -D__STDC_LIMIT_MACROS -I/wrkdirs/usr/ports/devel/llvm-devel/work-default/.build/lib/Support -I/wrkdirs/usr/ports/devel/llvm-devel/work-default/llvm-project-fb423ba07c3ff51fda3caa41d8bbb78d50f61906/llvm/lib/Support -I/wrkdirs/usr/ports/devel/llvm-devel/work-default/.build/include -I/wrkdirs/usr/ports/devel/llvm-devel/work-default/llvm-project-fb423ba07c3ff51fda3caa41d8bbb78d50f61906/llvm/include -I/wrkdirs/usr/ports/devel/llvm-devel/work-default/llvm-project-fb423ba07c3ff51fda3caa41d8bbb78d50f61906/llvm/../third-party/siphash/include -I/wrkdirs/usr/ports/devel/llvm-devel/work-default/llvm-project-fb423ba07c3ff51fda3caa41d8bbb78d50f61906/llvm/../libc -O2 -pipe -fstack-protector-strong -isystem /usr/local/include -fno-strict-aliasing -isystem /usr/local/inc
lude -fPIC -fno-semantic-interposition -fvisibility-inlines-hidden -Werror=date-time -Werror=unguarded-availability-new -Wall -Wextra -Wno-unused-parameter -Wwrite-strings -Wcast-qual -Wmissing-field-initializers -pedantic -Wno-long-long -Wc++98-compat-extra-semi -Wimplicit-fallthrough -Wcovered-switch-default -Wno-noexcept-type -Wnon-virtual-dtor -Wdelete-non-virtual-dtor -Wsuggest-override -Wstring-conversion -Wno-pass-failed -Wmisleading-indentation -Wctad-maybe-unsupported -fdiagnostics-color -ffunction-sections -fdata-sections -Xclang -fno-pch-timestamp -O2 -pipe -fstack-protector-strong -isystem /usr/local/include -fno-strict-aliasing -isystem /usr/local/include -DNDEBUG -std=c++17 -UNDEBUG -fno-exceptions -funwind-tables -Wno-c99-extensions -Winvalid-pch -fpch-instantiate-templates -Xclang -emit-pch -Xclang -include -Xclang /wrkdirs/usr/ports/devel/llvm-devel/work-default/.build/lib/Support/CMakeFiles/LLVMSupport.dir/cmake_pch.hxx -x c++-header -MD -MT lib/Support/
CMakeFiles/LLVMSupport.dir/cmake_pch.hxx.pch -MF lib/Support/CMakeFiles/LLVMSupport.dir/cmake_pch.hxx.pch.d -o lib/Support/CMakeFiles/LLVMSupport.dir/cmake_pch.hxx.pch -c /wrkdirs/usr/ports/devel/llvm-devel/work-default/.build/lib/Support/CMakeFiles/LLVMSupport.dir/cmake_pch.hxx.cxx
FAILED: [code=1] lib/Support/CMakeFiles/LLVMSupport.dir/cmake_pch.hxx.pch
/usr/bin/c++ -DLLVM_EXPORTS -D_DEBUG -D_FILE_OFFSET_BITS=64 -D_GLIBCXX_ASSERTIONS -D_LARGEFILE_SOURCE -D_LIBCPP_HARDENING_MODE=_LIBCPP_HARDENING_MODE_EXTENSIVE -D__STDC_CONSTANT_MACROS -D__STDC_FORMAT_MACROS -D__STDC_LIMIT_MACROS -I/wrkdirs/usr/ports/devel/llvm-devel/work-default/.build/lib/Support -I/wrkdirs/usr/ports/devel/llvm-devel/work-default/llvm-project-fb423ba07c3ff51fda3caa41d8bbb78d50f61906/llvm/lib/Support -I/wrkdirs/usr/ports/devel/llvm-devel/work-default/.build/include -I/wrkdirs/usr/ports/devel/llvm-devel/work-default/llvm-project-fb423ba07c3ff51fda3caa41d8bbb78d50f61906/llvm/include -I/wrkdirs/usr/ports/devel/llvm-devel/work-default/llvm-project-fb423ba07c3ff51fda3caa41d8bbb78d50f61906/llvm/../third-party/siphash/include -I/wrkdirs/usr/ports/devel/llvm-devel/work-default/llvm-project-fb423ba07c3ff51fda3caa41d8bbb78d50f61906/llvm/../libc -O2 -pipe -fstack-protector-strong -isystem /usr/local/include -fno-strict-aliasing -isystem /usr/local/include -fPIC -fno-
semantic-interposition -fvisibility-inlines-hidden -Werror=date-time -Werror=unguarded-availability-new -Wall -Wextra -Wno-unused-parameter -Wwrite-strings -Wcast-qual -Wmissing-field-initializers -pedantic -Wno-long-long -Wc++98-compat-extra-semi -Wimplicit-fallthrough -Wcovered-switch-default -Wno-noexcept-type -Wnon-virtual-dtor -Wdelete-non-virtual-dtor -Wsuggest-override -Wstring-conversion -Wno-pass-failed -Wmisleading-indentation -Wctad-maybe-unsupported -fdiagnostics-color -ffunction-sections -fdata-sections -Xclang -fno-pch-timestamp -O2 -pipe -fstack-protector-strong -isystem /usr/local/include -fno-strict-aliasing -isystem /usr/local/include -DNDEBUG -std=c++17 -UNDEBUG -fno-exceptions -funwind-tables -Wno-c99-extensions -Winvalid-pch -fpch-instantiate-templates -Xclang -emit-pch -Xclang -include -Xclang /wrkdirs/usr/ports/devel/llvm-devel/work-default/.build/lib/Support/CMakeFiles/LLVMSupport.dir/cmake_pch.hxx -x c++-header -MD -MT lib/Support/CMakeFiles/LLVMS
upport.dir/cmake_pch.hxx.pch -MF lib/Support/CMakeFiles/LLVMSupport.dir/cmake_pch.hxx.pch.d -o lib/Support/CMakeFiles/LLVMSupport.dir/cmake_pch.hxx.pch -c /wrkdirs/usr/ports/devel/llvm-devel/work-default/.build/lib/Support/CMakeFiles/LLVMSupport.dir/cmake_pch.hxx.cxx
In file included from <built-in>:1:
In file included from /wrkdirs/usr/ports/devel/llvm-devel/work-default/.build/lib/Support/CMakeFiles/LLVMSupport.dir/cmake_pch.hxx:5:
In file included from /wrkdirs/usr/ports/devel/llvm-devel/work-default/llvm-project-fb423ba07c3ff51fda3caa41d8bbb78d50f61906/llvm/include/llvm/Support/pch.h:30:
In file included from /wrkdirs/usr/ports/devel/llvm-devel/work-default/llvm-project-fb423ba07c3ff51fda3caa41d8bbb78d50f61906/llvm/include/llvm/Support/CommandLine.h:31:
In file included from /wrkdirs/usr/ports/devel/llvm-devel/work-default/llvm-project-fb423ba07c3ff51fda3caa41d8bbb78d50f61906/llvm/include/llvm/Support/StringSaver.h:15:
/wrkdirs/usr/ports/devel/llvm-devel/work-default/llvm-project-fb423ba07c3ff51fda3caa41d8bbb78d50f61906/llvm/include/llvm/Support/Allocator.h:84:17: error: static assertion failed due to requirement '8U <= alignof(__max_align_t)': MinAlign must not exceed the alignment of fresh slabs
84 | static_assert(MinAlign <= alignof(std::max_align_t),
| ^~~~~~~~~~~~~~~~~~~~~~~~~~~~~~~~~~~~~
/wrkdirs/usr/ports/devel/llvm-devel/work-default/llvm-project-fb423ba07c3ff51fda3caa41d8bbb78d50f61906/llvm/include/llvm/Support/StringSaver.h:50:56: note: in instantiation of template class 'llvm::BumpPtrAllocatorImpl<>' requested here
50 | UniqueStringSaver(BumpPtrAllocator &Alloc) : Strings(Alloc) {}
| ^
/wrkdirs/usr/ports/devel/llvm-devel/work-default/llvm-project-fb423ba07c3ff51fda3caa41d8bbb78d50f61906/llvm/include/llvm/Support/Allocator.h:84:26: note: expression evaluates to '8 <= 4'
84 | static_assert(MinAlign <= alignof(std::max_align_t),
| ~~~~~~~~~^~~~~~~~~~~~~~~~~~~~~~~~~~~~
In file included from <built-in>:1:
In file included from /wrkdirs/usr/ports/devel/llvm-devel/work-default/.build/lib/Support/CMakeFiles/LLVMSupport.dir/cmake_pch.hxx:5:
In file included from /wrkdirs/usr/ports/devel/llvm-devel/work-default/llvm-project-fb423ba07c3ff51fda3caa41d8bbb78d50f61906/llvm/include/llvm/Support/pch.h:37:
In file included from /wrkdirs/usr/ports/devel/llvm-devel/work-default/llvm-project-fb423ba07c3ff51fda3caa41d8bbb78d50f61906/llvm/include/llvm/Support/YAMLTraits.h:26:
/wrkdirs/usr/ports/devel/llvm-devel/work-default/llvm-project-fb423ba07c3ff51fda3caa41d8bbb78d50f61906/llvm/include/llvm/Support/YAMLParser.h:145:18: error: member 'Allocate' found in multiple base classes of different types
145 | return Alloc.Allocate(Size, Alignment);
| ^
/wrkdirs/usr/ports/devel/llvm-devel/work-default/llvm-project-fb423ba07c3ff51fda3caa41d8bbb78d50f61906/llvm/include/llvm/Support/AllocatorBase.h:45:9: note: member found by ambiguous name lookup
45 | void *Allocate(size_t Size, size_t Alignment) {
| ^
/wrkdirs/usr/ports/devel/llvm-devel/work-default/llvm-project-fb423ba07c3ff51fda3caa41d8bbb78d50f61906/llvm/include/llvm/Support/AllocatorBase.h:92:40: note: member found by ambiguous name lookup
92 | LLVM_ATTRIBUTE_RETURNS_NONNULL void *Allocate(size_t Size, size_t Alignment) {
| ^
In file included from <built-in>:1:
In file included from /wrkdirs/usr/ports/devel/llvm-devel/work-default/.build/lib/Support/CMakeFiles/LLVMSupport.dir/cmake_pch.hxx:5:
In file included from /wrkdirs/usr/ports/devel/llvm-devel/work-default/llvm-project-fb423ba07c3ff51fda3caa41d8bbb78d50f61906/llvm/include/llvm/Support/pch.h:37:
In file included from /wrkdirs/usr/ports/devel/llvm-devel/work-default/llvm-project-fb423ba07c3ff51fda3caa41d8bbb78d50f61906/llvm/include/llvm/Support/YAMLTraits.h:26:
/wrkdirs/usr/ports/devel/llvm-devel/work-default/llvm-project-fb423ba07c3ff51fda3caa41d8bbb78d50f61906/llvm/include/llvm/Support/YAMLParser.h:150:11: error: member 'Deallocate' found in multiple base classes of different types
150 | Alloc.Deallocate(Ptr, Size, 0);
| ^
/wrkdirs/usr/ports/devel/llvm-devel/work-default/llvm-project-fb423ba07c3ff51fda3caa41d8bbb78d50f61906/llvm/include/llvm/Support/AllocatorBase.h:59:8: note: member found by ambiguous name lookup
59 | void Deallocate(const void *Ptr, size_t Size, size_t Alignment) {
| ^
/wrkdirs/usr/ports/devel/llvm-devel/work-default/llvm-project-fb423ba07c3ff51fda3caa41d8bbb78d50f61906/llvm/include/llvm/Support/AllocatorBase.h:99:8: note: member found by ambiguous name lookup
99 | void Deallocate(const void *Ptr, size_t Size, size_t Alignment) {
| ^
In file included from <built-in>:1:
In file included from /wrkdirs/usr/ports/devel/llvm-devel/work-default/.build/lib/Support/CMakeFiles/LLVMSupport.dir/cmake_pch.hxx:5:
In file included from /wrkdirs/usr/ports/devel/llvm-devel/work-default/llvm-project-fb423ba07c3ff51fda3caa41d8bbb78d50f61906/llvm/include/llvm/Support/pch.h:37:
/wrkdirs/usr/ports/devel/llvm-devel/work-default/llvm-project-fb423ba07c3ff51fda3caa41d8bbb78d50f61906/llvm/include/llvm/Support/YAMLTraits.h:1276:27: error: member 'Allocate' found in multiple base classes of different types
1276 | BufPtr = allocator->Allocate<TNorm>();
| ^
/wrkdirs/usr/ports/devel/llvm-devel/work-default/llvm-project-fb423ba07c3ff51fda3caa41d8bbb78d50f61906/llvm/include/llvm/Support/AllocatorBase.h:45:9: note: member found by ambiguous name lookup
45 | void *Allocate(size_t Size, size_t Alignment) {
| ^
/wrkdirs/usr/ports/devel/llvm-devel/work-default/llvm-project-fb423ba07c3ff51fda3caa41d8bbb78d50f61906/llvm/include/llvm/Support/AllocatorBase.h:92:40: note: member found by ambiguous name lookup
92 | LLVM_ATTRIBUTE_RETURNS_NONNULL void *Allocate(size_t Size, size_t Alignment) {
| ^
4 errors generated.
[ 0% 16/10905] /usr/bin/cc -DBLAKE3_NO_AVX2 -DBLAKE3_NO_AVX512 -DBLAKE3_NO_SSE2 -DBLAKE3_NO_SSE41 -DLLVM_EXPORTS -D_DEBUG -D_FILE_OFFSET_BITS=64 -D_GLIBCXX_ASSERTIONS -D_LARGEFILE_SOURCE -D_LIBCPP_HARDENING_MODE=_LIBCPP_HARDENING_MODE_EXTENSIVE -D__STDC_CONSTANT_MACROS -D__STDC_FORMAT_MACROS -D__STDC_LIMIT_MACROS -I/wrkdirs/usr/ports/devel/llvm-devel/work-default/.build/lib/Support/BLAKE3 -I/wrkdirs/usr/ports/devel/llvm-devel/work-default/llvm-project-fb423ba07c3ff51fda3caa41d8bbb78d50f61906/llvm/lib/Support/BLAKE3 -I/wrkdirs/usr/ports/devel/llvm-devel/work-default/.build/include -I/wrkdirs/usr/ports/devel/llvm-devel/work-default/llvm-project-fb423ba07c3ff51fda3caa41d8bbb78d50f61906/llvm/include -O2 -pipe -fstack-protector-strong -isystem /usr/local/include -fno-strict-aliasing -fPIC -fno-semantic-interposition -Werror=date-time -Werror=unguarded-availability-new -Wall -Wextra -Wno-unused-parameter -Wwrite-strings -Wcast-qual -Wmissing-field-initializers -pedantic -Wno-lon
g-long -Wc++98-compat-extra-semi -Wimplicit-fallthrough -Wcovered-switch-default -Wstring-conversion -Wmisleading-indentation -Wctad-maybe-unsupported -fdiagnostics-color -ffunction-sections -fdata-sections -O2 -pipe -fstack-protector-strong -isystem /usr/local/include -fno-strict-aliasing -DNDEBUG -UNDEBUG -MD -MT lib/Support/BLAKE3/CMakeFiles/LLVMSupportBlake3.dir/blake3_dispatch.c.o -MF lib/Support/BLAKE3/CMakeFiles/LLVMSupportBlake3.dir/blake3_dispatch.c.o.d -o lib/Support/BLAKE3/CMakeFiles/LLVMSupportBlake3.dir/blake3_dispatch.c.o -c /wrkdirs/usr/ports/devel/llvm-devel/work-default/llvm-project-fb423ba07c3ff51fda3caa41d8bbb78d50f61906/llvm/lib/Support/BLAKE3/blake3_dispatch.c
[ 0% 16/10905] /usr/bin/cc -DBLAKE3_NO_AVX2 -DBLAKE3_NO_AVX512 -DBLAKE3_NO_SSE2 -DBLAKE3_NO_SSE41 -DLLVM_EXPORTS -D_DEBUG -D_FILE_OFFSET_BITS=64 -D_GLIBCXX_ASSERTIONS -D_LARGEFILE_SOURCE -D_LIBCPP_HARDENING_MODE=_LIBCPP_HARDENING_MODE_EXTENSIVE -D__STDC_CONSTANT_MACROS -D__STDC_FORMAT_MACROS -D__STDC_LIMIT_MACROS -I/wrkdirs/usr/ports/devel/llvm-devel/work-default/.build/lib/Support/BLAKE3 -I/wrkdirs/usr/ports/devel/llvm-devel/work-default/llvm-project-fb423ba07c3ff51fda3caa41d8bbb78d50f61906/llvm/lib/Support/BLAKE3 -I/wrkdirs/usr/ports/devel/llvm-devel/work-default/.build/include -I/wrkdirs/usr/ports/devel/llvm-devel/work-default/llvm-project-fb423ba07c3ff51fda3caa41d8bbb78d50f61906/llvm/include -O2 -pipe -fstack-protector-strong -isystem /usr/local/include -fno-strict-aliasing -fPIC -fno-semantic-interposition -Werror=date-time -Werror=unguarded-availability-new -Wall -Wextra -Wno-unused-parameter -Wwrite-strings -Wcast-qual -Wmissing-field-initializers -pedantic -Wno-lon
g-long -Wc++98-compat-extra-semi -Wimplicit-fallthrough -Wcovered-switch-default -Wstring-conversion -Wmisleading-indentation -Wctad-maybe-unsupported -fdiagnostics-color -ffunction-sections -fdata-sections -O2 -pipe -fstack-protector-strong -isystem /usr/local/include -fno-strict-aliasing -DNDEBUG -UNDEBUG -MD -MT lib/Support/BLAKE3/CMakeFiles/LLVMSupportBlake3.dir/blake3_portable.c.o -MF lib/Support/BLAKE3/CMakeFiles/LLVMSupportBlake3.dir/blake3_portable.c.o.d -o lib/Support/BLAKE3/CMakeFiles/LLVMSupportBlake3.dir/blake3_portable.c.o -c /wrkdirs/usr/ports/devel/llvm-devel/work-default/llvm-project-fb423ba07c3ff51fda3caa41d8bbb78d50f61906/llvm/lib/Support/BLAKE3/blake3_portable.c
ninja: build stopped: subcommand failed.
===> Compilation failed unexpectedly.
Try to set MAKE_JOBS_UNSAFE=yes and rebuild before reporting the failure to
the maintainer.
*** Error code 1
Stop.
make: stopped making "build" in /usr/ports/devel/llvm-devel