Re:[package - 143i386-quarterly][net/findomain] Failed for findomain-9.0.4_19 in build
Date: Thu, 09 Apr 2026 02:36:58 UTC
Hi,
We would like to learn more about your company and hope to have the opportunity to cooperate. Could you please let us know about your company and product price? We are looking forward to a prompt response.
Best regards
QIANFAN INTL TEAM
At 2026-04-09 10:22:18, pkg-fallout@FreeBSD.org wrote:
>You are receiving this mail as a port that you maintain
>is failing to build on the FreeBSD package build server.
>Please investigate the failure and submit a PR to fix
>build.
>
>Maintainer: lcook@FreeBSD.org
>Log URL: https://pkg-status.freebsd.org/beefy19/data/143i386-quarterly/eb713af1e8a2/logs/findomain-9.0.4_19.log
>Build URL: https://pkg-status.freebsd.org/beefy19/build.html?mastername=143i386-quarterly&build=eb713af1e8a2
>Log:
>
>=>> Building net/findomain
>build started at Thu Apr 9 02:17:14 UTC 2026
>port directory: /usr/ports/net/findomain
>package name: findomain-9.0.4_19
>building for: FreeBSD 143i386-quarterly-job-03 14.3-RELEASE-p10 FreeBSD 14.3-RELEASE-p10 i386
>maintained by: lcook@FreeBSD.org
>Makefile datestamp: -rw-r--r-- 1 root wheel 9183 Apr 4 01:01 /usr/ports/net/findomain/Makefile
>Ports top last git commit: eb713af1e8a2382d8d4072d08921586e3b97b912
>Ports top unclean checkout: no
>Port dir last git commit: 78db3aeaafd6e8351d3fa52693f922e0020da12f
>Port dir unclean checkout: no
>Poudriere version: poudriere-git-3.4.6-4-g83739588
>Host OSVERSION: 1600014
>Jail OSVERSION: 1403000
>Job Id: 03
>
>---Begin Environment---
>SHELL=/bin/sh
>BLOCKSIZE=K
>MAIL=/var/mail/root
>MM_CHARSET=UTF-8
>LANG=C.UTF-8
>OSVERSION=1403000
>STATUS=1
>HOME=/root
>PATH=/sbin:/bin:/usr/sbin:/usr/bin:/usr/local/sbin:/usr/local/bin:/root/bin
>MAKE_OBJDIR_CHECK_WRITABLE=0
>UNAME_m=i386
>UNAME_p=i386
>UNAME_r=14.3-RELEASE-p10
>LOCALBASE=/usr/local
>UNAME_v=FreeBSD 14.3-RELEASE-p10
>USER=root
>POUDRIERE_NAME=poudriere-git
>LIBEXECPREFIX=/usr/local/libexec/poudriere
>POUDRIERE_VERSION=3.4.6-4-g83739588
>MASTERMNT=/usr/local/poudriere/data/.m/143i386-quarterly/ref
>LC_COLLATE=C
>POUDRIERE_BUILD_TYPE=bulk
>PACKAGE_BUILDING=yes
>SAVED_TERM=
>OUTPUT_REDIRECTED_STDERR=4
>OUTPUT_REDIRECTED=1
>PWD=/usr/local/poudriere/data/.m/143i386-quarterly/03/.p
>OUTPUT_REDIRECTED_STDOUT=3
>P_PORTS_FEATURES=FLAVORS SUBPACKAGES SELECTED_OPTIONS
>MASTERNAME=143i386-quarterly
>SCRIPTPREFIX=/usr/local/share/poudriere
>SCRIPTNAME=bulk.sh
>OLDPWD=/usr/local/poudriere/data/.m/143i386-quarterly/ref/.p/pool
>POUDRIERE_PKGNAME=poudriere-git-3.4.6-4-g83739588
>SCRIPTPATH=/usr/local/share/poudriere/bulk.sh
>POUDRIEREPATH=/usr/local/bin/poudriere
>---End Environment---
>
>---Begin Poudriere Port Flags/Env---
>PORT_FLAGS=
>PKGENV=
>FLAVOR=
>MAKE_ARGS=
>---End Poudriere Port Flags/Env---
>
>---Begin OPTIONS List---
>===> The following configuration options are available for findomain-9.0.4_19:
> DOCS=on: Build and/or install documentation
> PGSQL=off: Enable subdomain monitoring support
> SCREENSHOT=off: Enable website screenshot support (uses headless chrome)
>===> Use 'make config' to modify these settings
>---End OPTIONS List---
>
>--MAINTAINER--
>lcook@FreeBSD.org
>--End MAINTAINER--
>
>--CONFIGURE_ARGS--
>
>--End CONFIGURE_ARGS--
>
>--CONFIGURE_ENV--
>PKG_CONFIG=pkgconf MAKE=/usr/local/bin/gmake ac_cv_path_PERL=/usr/local/bin/perl ac_cv_path_PERL_PATH=/usr/local/bin/perl PERL_USE_UNSAFE_INC=1 XDG_DATA_HOME=/wrkdirs/usr/ports/net/findomain/work XDG_CONFIG_HOME=/wrkdirs/usr/ports/net/findomain/work XDG_CACHE_HOME=/wrkdirs/usr/ports/net/findomain/work/.cache HOME=/wrkdirs/usr/ports/net/findomain/work TMPDIR="/wrkdirs/usr/ports/net/findomain/work" PATH=/wrkdirs/usr/ports/net/findomain/work/.bin:/sbin:/bin:/usr/sbin:/usr/bin:/usr/local/sbin:/usr/local/bin:/root/bin PKG_CONFIG_LIBDIR=/wrkdirs/usr/ports/net/findomain/work/.pkgconfig:/usr/local/libdata/pkgconfig:/usr/local/share/pkgconfig:/usr/libdata/pkgconfig SHELL=/bin/sh CONFIG_SHELL=/bin/sh
>--End CONFIGURE_ENV--
>
>--MAKE_ENV--
>PERL_USE_UNSAFE_INC=1 OPENSSLBASE=/usr OPENSSLDIR=/etc/ssl OPENSSLINC=/usr/include OPENSSLLIB=/usr/lib XDG_DATA_HOME=/wrkdirs/usr/ports/net/findomain/work XDG_CONFIG_HOME=/wrkdirs/usr/ports/net/findomain/work XDG_CACHE_HOME=/wrkdirs/usr/ports/net/findomain/work/.cache HOME=/wrkdirs/usr/ports/net/findomain/work TMPDIR="/wrkdirs/usr/ports/net/findomain/work" PATH=/wrkdirs/usr/ports/net/findomain/work/.bin:/sbin:/bin:/usr/sbin:/usr/bin:/usr/local/sbin:/usr/local/bin:/root/bin PKG_CONFIG_LIBDIR=/wrkdirs/usr/ports/net/findomain/work/.pkgconfig:/usr/local/libdata/pkgconfig:/usr/local/share/pkgconfig:/usr/libdata/pkgconfig MK_DEBUG_FILES=no MK_KERNEL_SYMBOLS=no SHELL=/bin/sh NO_LINT=YES PREFIX=/usr/local LOCALBASE=/usr/local CC="cc" CFLAGS="-O2 -pipe -fstack-protector-strong -fno-strict-aliasing " CPP="cpp" CPPFLAGS="" LDFLAGS=" " LIBS="" CXX="c++" CXXFLAGS="-O2 -pipe -fstack-protector-strong -fno-strict-aliasing " BSD_INSTALL_PROGRAM="install -s -m 555" BSD_INSTALL_LI
>B="install -s -m 0644" BSD_INSTALL_SCRIPT="install -m 555" BSD_INSTALL_DATA="install -m 0644" BSD_INSTALL_MAN="install -m 444"
>--End MAKE_ENV--
>
>--PLIST_SUB--
>PORTDOCS="" OSREL=14.3 PREFIX=%D LOCALBASE=/usr/local RESETPREFIX=/usr/local LIB32DIR=lib PERL_VERSION=5.42.2 PERL_VER=5.42 PERL5_MAN1=lib/perl5/site_perl/man/man1 PERL5_MAN3=lib/perl5/site_perl/man/man3 SITE_PERL=lib/perl5/site_perl SITE_ARCH=lib/perl5/site_perl/mach/5.42 DOCSDIR="share/doc/findomain" EXAMPLESDIR="share/examples/findomain" DATADIR="share/findomain" WWWDIR="www/findomain" ETCDIR="etc/findomain"
>--End PLIST_SUB--
>
>--SUB_LIST--
> PREFIX=/usr/local LOCALBASE=/usr/local DATADIR=/usr/local/share/findomain DOCSDIR=/usr/local/share/doc/findomain EXAMPLESDIR=/usr/local/share/examples/findomain WWWDIR=/usr/local/www/findomain ETCDIR=/usr/local/etc/findomain
>--End SUB_LIST--
>
>---Begin make.conf---
>USE_PACKAGE_DEPENDS=yes
>BATCH=yes
>WRKDIRPREFIX=/wrkdirs
>PORTSDIR=/usr/ports
>PACKAGES=/packages
>DISTDIR=/distfiles
>PACKAGE_BUILDING=yes
>PACKAGE_BUILDING_FLAVORS=yes
>MACHINE=i386
>MACHINE_ARCH=i386
>ARCH=${MACHINE_ARCH}
>#### ####
># XXX: We really need this but cannot use it while 'make checksum' does not
># try the next mirror on checksum failure. It currently retries the same
># failed mirror and then fails rather then trying another. It *does*
># try the next if the size is mismatched though.
>#MASTER_SITE_FREEBSD=yes
># Build ALLOW_MAKE_JOBS_PACKAGES with 3 jobs
>MAKE_JOBS_NUMBER=3
>#### Misc Poudriere ####
>.include "/etc/make.conf.ports_env"
>GID=0
>UID=0
>---End make.conf---
>--Resource limits--
>cpu time (seconds, -t) unlimited
>file size (512-blocks, -f) unlimited
>data seg size (kbytes, -d) 524288
>stack size (kbytes, -s) 65536
>core file size (512-blocks, -c) unlimited
>max memory size (kbytes, -m) unlimited
>locked memory (kbytes, -l) unlimited
>max user processes (-u) 89999
>open files (-n) 8192
>virtual mem size (kbytes, -v) unlimited
>swap limit (kbytes, -w) unlimited
>socket buffer size (bytes, -b) unlimited
>pseudo-terminals (-p) unlimited
>kqueues (-k) unlimited
>umtx shared locks (-o) unlimited
>pipebuf (-y) unlimited
>--End resource limits--
>=======================<phase: check-sanity >============================
>===== env: NO_DEPENDS=yes USER=root UID=0 GID=0
>===> License GPLv3 accepted by the user
>===========================================================================
>=======================<phase: pkg-depends >============================
>===== env: USE_PACKAGE_DEPENDS_ONLY=1 USER=root UID=0 GID=0
>===> findomain-9.0.4_19 depends on file: /usr/local/sbin/pkg - not found
>===> Installing existing package /packages/All/pkg-2.6.2_1.pkg
>[143i386-quarterly-job-03] Installing pkg-2.6.2_1...
>[143i386-quarterly-job-03] Extracting pkg-2.6.2_1: .......... done
>===> findomain-9.0.4_19 depends on file: /usr/local/sbin/pkg - found
>===> Returning to build of findomain-9.0.4_19
>===========================================================================
>=======================<phase: fetch-depends >============================
>===== env: USE_PACKAGE_DEPENDS_ONLY=1 USER=root UID=0 GID=0
>===========================================================================
>=======================<phase: fetch >============================
>===== env: NO_DEPENDS=yes USER=root UID=0 GID=0
>===> License GPLv3 accepted by the user
>=> rust/crates/redox_syscall-0.4.1.crate doesn't seem to exist in /portdistfiles.
>=> Attempting to fetch https://crates.io/api/v1/crates/redox_syscall/0.4.1/download?dummy=/rust/crates/redox_syscall-0.4.1.crate
>rust/crates/redox_syscall-0.4.1.crate 24 kB 20 MBps 00s
>===> Fetching all distfiles required by findomain-9.0.4_19 for building
>===========================================================================
>=======================<phase: checksum >============================
>===== env: FETCH_REGET=0 NO_DEPENDS=yes USER=root UID=0 GID=0
>===> License GPLv3 accepted by the user
>===> Fetching all distfiles required by findomain-9.0.4_19 for building
>=> SHA256 Checksum OK for rust/crates/addr-0.15.6.crate.
>=> SHA256 Checksum OK for rust/crates/addr2line-0.21.0.crate.
>=> SHA256 Checksum OK for rust/crates/adler-1.0.2.crate.
>=> SHA256 Checksum OK for rust/crates/aho-corasick-1.1.2.crate.
>=> SHA256 Checksum OK for rust/crates/ansi_term-0.12.1.crate.
>=> SHA256 Checksum OK for rust/crates/anyhow-1.0.75.crate.
>=> SHA256 Checksum OK for rust/crates/arrayvec-0.5.2.crate.
>=> SHA256 Checksum OK for rust/crates/async-compression-0.4.5.crate.
>=> SHA256 Checksum OK for rust/crates/async-recursion-1.0.5.crate.
>=> SHA256 Checksum OK for rust/crates/async-trait-0.1.74.crate.
>=> SHA256 Checksum OK for rust/crates/atty-0.2.14.crate.
>=> SHA256 Checksum OK for rust/crates/auto_generate_cdp-0.3.4.crate.
>=> SHA256 Checksum OK for rust/crates/autocfg-0.1.8.crate.
>=> SHA256 Checksum OK for rust/crates/autocfg-1.1.0.crate.
>=> SHA256 Checksum OK for rust/crates/backtrace-0.3.69.crate.
>=> SHA256 Checksum OK for rust/crates/base64-0.9.3.crate.
>=> SHA256 Checksum OK for rust/crates/base64-0.10.1.crate.
>=> SHA256 Checksum OK for rust/crates/base64-0.21.5.crate.
>=> SHA256 Checksum OK for rust/crates/bitflags-1.3.2.crate.
>=> SHA256 Checksum OK for rust/crates/bitflags-2.4.1.crate.
>=> SHA256 Checksum OK for rust/crates/block-buffer-0.10.4.crate.
>=> SHA256 Checksum OK for rust/crates/bumpalo-3.14.0.crate.
>=> SHA256 Checksum OK for rust/crates/byteorder-1.5.0.crate.
>=> SHA256 Checksum OK for rust/crates/bytes-1.5.0.crate.
>=> SHA256 Checksum OK for rust/crates/cc-1.0.83.crate.
>=> SHA256 Checksum OK for rust/crates/cfg-if-1.0.0.crate.
>=> SHA256 Checksum OK for rust/crates/clap-2.34.0.crate.
>=> SHA256 Checksum OK for rust/crates/cloudabi-0.0.3.crate.
>=> SHA256 Checksum OK for rust/crates/config-0.11.0.crate.
>=> SHA256 Checksum OK for rust/crates/convert_case-0.4.0.crate.
>=> SHA256 Checksum OK for rust/crates/core-foundation-0.9.4.crate.
>=> SHA256 Checksum OK for rust/crates/core-foundation-sys-0.8.6.crate.
>=> SHA256 Checksum OK for rust/crates/cpufeatures-0.2.11.crate.
>=> SHA256 Checksum OK for rust/crates/crc32fast-1.3.2.crate.
><snip>
> = help: or consider adding `println!("cargo::rustc-check-cfg=cfg(trace_tokenizer)");` to the top of the `build.rs`
> = note: see <https://doc.rust-lang.org/nightly/rustc/check-cfg/cargo-specifics.html> for more information about checking conditional configuration
>
>warning: `html5ever` (lib) generated 2 warnings
> Running `CARGO=/usr/local/bin/cargo CARGO_CRATE_NAME=hyper_rustls CARGO_MANIFEST_DIR=/wrkdirs/usr/ports/net/findomain/work/Findomain-9.0.4/cargo-crates/hyper-rustls-0.24.2 CARGO_MANIFEST_PATH=/wrkdirs/usr/ports/net/findomain/work/Findomain-9.0.4/cargo-crates/hyper-rustls-0.24.2/Cargo.toml CARGO_PKG_AUTHORS='' CARGO_PKG_DESCRIPTION='Rustls+hyper integration for pure rust HTTPS' CARGO_PKG_HOMEPAGE='https://github.com/rustls/hyper-rustls' CARGO_PKG_LICENSE='Apache-2.0 OR ISC OR MIT' CARGO_PKG_LICENSE_FILE='' CARGO_PKG_NAME=hyper-rustls CARGO_PKG_README=README.md CARGO_PKG_REPOSITORY='https://github.com/rustls/hyper-rustls' CARGO_PKG_RUST_VERSION=1.63 CARGO_PKG_VERSION=0.24.2 CARGO_PKG_VERSION_MAJOR=0 CARGO_PKG_VERSION_MINOR=24 CARGO_PKG_VERSION_PATCH=2 CARGO_PKG_VERSION_PRE='' LD_LIBRARY_PATH=/wrkdirs/usr/ports/net/findomain/work/target/release/deps /usr/local/bin/rustc --crate-name hyper_rustls --edition=2021 /wrkdirs/usr/ports/net/findomain/work/Findomain-9.0.4/cargo-cra
>tes/hyper-rustls-0.24.2/src/lib.rs --error-format=json --json=diagnostic-rendered-ansi,artifacts,future-incompat --crate-type lib --emit=dep-info,metadata,link -C opt-level=s -C panic=abort -C linker-plugin-lto -C codegen-units=1 --check-cfg 'cfg(docsrs,test)' --check-cfg 'cfg(feature, values("acceptor", "default", "http1", "http2", "log", "logging", "native-tokio", "rustls-native-certs", "tls12", "tokio-runtime", "webpki-roots", "webpki-tokio"))' -C metadata=f1ada2533e8f2992 -C extra-filename=-b280e61a079ee5ac --out-dir /wrkdirs/usr/ports/net/findomain/work/target/release/deps -C strip=debuginfo -L dependency=/wrkdirs/usr/ports/net/findomain/work/target/release/deps --extern futures_util=/wrkdirs/usr/ports/net/findomain/work/target/release/deps/libfutures_util-f2a78234276f41cc.rmeta --extern http=/wrkdirs/usr/ports/net/findomain/work/target/release/deps/libhttp-dc89f0309bad967b.rmeta --extern hyper=/wrkdirs/usr/ports/net/findomain/work/target/release/deps/libhyper-ec809ac12
>07b9547.rmeta --extern rustls=/wrkdirs/usr/ports/net/findomain/work/target/release/deps/librustls-1995d00cba6b14b3.rmeta --extern tokio=/wrkdirs/usr/ports/net/findomain/work/target/release/deps/libtokio-3357b35c624442d9.rmeta --extern tokio_rustls=/wrkdirs/usr/ports/net/findomain/work/target/release/deps/libtokio_rustls-ed7f493ef471ab0c.rmeta --cap-lints warn -C linker=cc -L native=/wrkdirs/usr/ports/net/findomain/work/target/release/build/ring-64b166702494e97c/out`
>warning: `hyper-rustls` (lib) generated 4 warnings (4 duplicates)
> Compiling derive_builder_core v0.8.1
> Running `CARGO=/usr/local/bin/cargo CARGO_CRATE_NAME=derive_builder_core CARGO_MANIFEST_DIR=/wrkdirs/usr/ports/net/findomain/work/Findomain-9.0.4/cargo-crates/derive_builder_core-0.8.1 CARGO_MANIFEST_PATH=/wrkdirs/usr/ports/net/findomain/work/Findomain-9.0.4/cargo-crates/derive_builder_core-0.8.1/Cargo.toml CARGO_PKG_AUTHORS='Colin Kiegel <kiegel@gmx.de>:Pascal Hertleif <killercup@gmail.com>:Jan-Erik Rediger <janerik@fnordig.de>:Ted Driggs <ted.driggs@outlook.com>' CARGO_PKG_DESCRIPTION='Internal helper library for the derive_builder crate.' CARGO_PKG_HOMEPAGE='' CARGO_PKG_LICENSE=MIT/Apache-2.0 CARGO_PKG_LICENSE_FILE='' CARGO_PKG_NAME=derive_builder_core CARGO_PKG_README=README.md CARGO_PKG_REPOSITORY='https://github.com/colin-kiegel/rust-derive-builder' CARGO_PKG_RUST_VERSION='' CARGO_PKG_VERSION=0.8.1 CARGO_PKG_VERSION_MAJOR=0 CARGO_PKG_VERSION_MINOR=8 CARGO_PKG_VERSION_PATCH=1 CARGO_PKG_VERSION_PRE='' LD_LIBRARY_PATH=/wrkdirs/usr/ports/net/findomain/work/target/rele
>ase/deps /usr/local/bin/rustc --crate-name derive_builder_core --edition=2015 /wrkdirs/usr/ports/net/findomain/work/Findomain-9.0.4/cargo-crates/derive_builder_core-0.8.1/src/lib.rs --error-format=json --json=diagnostic-rendered-ansi,artifacts,future-incompat --crate-type lib --emit=dep-info,metadata,link -C embed-bitcode=no -C debug-assertions=off --check-cfg 'cfg(docsrs,test)' --check-cfg 'cfg(feature, values("log", "logging"))' -C metadata=f4c84dc77f9cd27e -C extra-filename=-df655728f54e728b --out-dir /wrkdirs/usr/ports/net/findomain/work/target/release/deps -C strip=debuginfo -L dependency=/wrkdirs/usr/ports/net/findomain/work/target/release/deps --extern darling=/wrkdirs/usr/ports/net/findomain/work/target/release/deps/libdarling-8d815ab39a529a01.rmeta --extern proc_macro2=/wrkdirs/usr/ports/net/findomain/work/target/release/deps/libproc_macro2-4c7b95e9774d7ef5.rmeta --extern quote=/wrkdirs/usr/ports/net/findomain/work/target/release/deps/libquote-feca369cc92ba83f.rmeta
> --extern syn=/wrkdirs/usr/ports/net/findomain/work/target/release/deps/libsyn-0152543e49ba3df0.rmeta --cap-lints warn -C linker=cc`
>warning: hiding a lifetime that's elided elsewhere is confusing
> --> /wrkdirs/usr/ports/net/findomain/work/Findomain-9.0.4/cargo-crates/derive_builder_core-0.8.1/src/deprecation_notes.rs:70:26
> |
>70 | pub const fn as_item(&self) -> DeprecationNotesAsItem {
> | ^^^^^ ^^^^^^^^^^^^^^^^^^^^^^ the same lifetime is hidden here
> | |
> | the lifetime is elided here
> |
> = help: the same lifetime is referred to in inconsistent ways, making the signature confusing
>note: the lint level is defined here
> --> /wrkdirs/usr/ports/net/findomain/work/Findomain-9.0.4/cargo-crates/derive_builder_core-0.8.1/src/lib.rs:25:9
> |
>25 | #![deny(warnings, missing_docs)]
> | ^^^^^^^^
> = note: `#[warn(mismatched_lifetime_syntaxes)]` implied by `#[warn(warnings)]`
>help: use `'_` for type paths
> |
>70 | pub const fn as_item(&self) -> DeprecationNotesAsItem<'_> {
> | ++++
>
>warning: `derive_builder_core` (lib) generated 1 warning
> Compiling parking_lot v0.11.2
> Running `CARGO=/usr/local/bin/cargo CARGO_CRATE_NAME=parking_lot CARGO_MANIFEST_DIR=/wrkdirs/usr/ports/net/findomain/work/Findomain-9.0.4/cargo-crates/parking_lot-0.11.2 CARGO_MANIFEST_PATH=/wrkdirs/usr/ports/net/findomain/work/Findomain-9.0.4/cargo-crates/parking_lot-0.11.2/Cargo.toml CARGO_PKG_AUTHORS='Amanieu d'\''Antras <amanieu@gmail.com>' CARGO_PKG_DESCRIPTION='More compact and efficient implementations of the standard synchronization primitives.' CARGO_PKG_HOMEPAGE='' CARGO_PKG_LICENSE=Apache-2.0/MIT CARGO_PKG_LICENSE_FILE='' CARGO_PKG_NAME=parking_lot CARGO_PKG_README=README.md CARGO_PKG_REPOSITORY='https://github.com/Amanieu/parking_lot' CARGO_PKG_RUST_VERSION='' CARGO_PKG_VERSION=0.11.2 CARGO_PKG_VERSION_MAJOR=0 CARGO_PKG_VERSION_MINOR=11 CARGO_PKG_VERSION_PATCH=2 CARGO_PKG_VERSION_PRE='' LD_LIBRARY_PATH=/wrkdirs/usr/ports/net/findomain/work/target/release/deps /usr/local/bin/rustc --crate-name parking_lot --edition=2018 /wrkdirs/usr/ports/net/findomain/work/F
>indomain-9.0.4/cargo-crates/parking_lot-0.11.2/src/lib.rs --error-format=json --json=diagnostic-rendered-ansi,artifacts,future-incompat --crate-type lib --emit=dep-info,metadata,link -C opt-level=s -C panic=abort -C linker-plugin-lto -C codegen-units=1 --cfg 'feature="default"' --check-cfg 'cfg(docsrs,test)' --check-cfg 'cfg(feature, values("arc_lock", "deadlock_detection", "default", "nightly", "owning_ref", "send_guard", "serde", "stdweb", "wasm-bindgen"))' -C metadata=94355dbdee9b58b8 -C extra-filename=-1a17214c6f796218 --out-dir /wrkdirs/usr/ports/net/findomain/work/target/release/deps -C strip=debuginfo -L dependency=/wrkdirs/usr/ports/net/findomain/work/target/release/deps --extern instant=/wrkdirs/usr/ports/net/findomain/work/target/release/deps/libinstant-ed9e1e999e9a6c15.rmeta --extern lock_api=/wrkdirs/usr/ports/net/findomain/work/target/release/deps/liblock_api-f759701af8fd1ee7.rmeta --extern parking_lot_core=/wrkdirs/usr/ports/net/findomain/work/target/release/de
>ps/libparking_lot_core-2faad2c8bf6281bb.rmeta --cap-lints warn -C linker=cc`
>warning: `trust-dns-proto` (lib) generated 1 warning
> Running `CARGO=/usr/local/bin/cargo CARGO_CRATE_NAME=hyper_tls CARGO_MANIFEST_DIR=/wrkdirs/usr/ports/net/findomain/work/Findomain-9.0.4/cargo-crates/hyper-tls-0.5.0 CARGO_MANIFEST_PATH=/wrkdirs/usr/ports/net/findomain/work/Findomain-9.0.4/cargo-crates/hyper-tls-0.5.0/Cargo.toml CARGO_PKG_AUTHORS='Sean McArthur <sean@seanmonstar.com>' CARGO_PKG_DESCRIPTION='Default TLS implementation for use with hyper' CARGO_PKG_HOMEPAGE='https://hyper.rs' CARGO_PKG_LICENSE=MIT/Apache-2.0 CARGO_PKG_LICENSE_FILE='' CARGO_PKG_NAME=hyper-tls CARGO_PKG_README=README.md CARGO_PKG_REPOSITORY='https://github.com/hyperium/hyper-tls' CARGO_PKG_RUST_VERSION='' CARGO_PKG_VERSION=0.5.0 CARGO_PKG_VERSION_MAJOR=0 CARGO_PKG_VERSION_MINOR=5 CARGO_PKG_VERSION_PATCH=0 CARGO_PKG_VERSION_PRE='' LD_LIBRARY_PATH=/wrkdirs/usr/ports/net/findomain/work/target/release/deps /usr/local/bin/rustc --crate-name hyper_tls --edition=2018 /wrkdirs/usr/ports/net/findomain/work/Findomain-9.0.4/cargo-crates/hyper-tls-0.5.0
>/src/lib.rs --error-format=json --json=diagnostic-rendered-ansi,artifacts,future-incompat --crate-type lib --emit=dep-info,metadata,link -C opt-level=s -C panic=abort -C linker-plugin-lto -C codegen-units=1 --check-cfg 'cfg(docsrs,test)' --check-cfg 'cfg(feature, values("vendored"))' -C metadata=ca7579496ff4ac87 -C extra-filename=-18870a6d29eac707 --out-dir /wrkdirs/usr/ports/net/findomain/work/target/release/deps -C strip=debuginfo -L dependency=/wrkdirs/usr/ports/net/findomain/work/target/release/deps --extern bytes=/wrkdirs/usr/ports/net/findomain/work/target/release/deps/libbytes-6100c5b42a0e6919.rmeta --extern hyper=/wrkdirs/usr/ports/net/findomain/work/target/release/deps/libhyper-ec809ac1207b9547.rmeta --extern native_tls=/wrkdirs/usr/ports/net/findomain/work/target/release/deps/libnative_tls-c6139e740544bd69.rmeta --extern tokio=/wrkdirs/usr/ports/net/findomain/work/target/release/deps/libtokio-3357b35c624442d9.rmeta --extern tokio_native_tls=/wrkdirs/usr/ports/net/f
>indomain/work/target/release/deps/libtokio_native_tls-8cb438e626b81723.rmeta --cap-lints warn -C linker=cc -L native=/wrkdirs/usr/ports/net/findomain/work/target/release/build/openssl-sys-afdb3ed150f476c3/out/openssl-build/install/lib`
> Compiling failure v0.1.8
> Running `CARGO=/usr/local/bin/cargo CARGO_CRATE_NAME=failure CARGO_MANIFEST_DIR=/wrkdirs/usr/ports/net/findomain/work/Findomain-9.0.4/cargo-crates/failure-0.1.8 CARGO_MANIFEST_PATH=/wrkdirs/usr/ports/net/findomain/work/Findomain-9.0.4/cargo-crates/failure-0.1.8/Cargo.toml CARGO_PKG_AUTHORS='Without Boats <boats@mozilla.com>' CARGO_PKG_DESCRIPTION='Experimental error handling abstraction.' CARGO_PKG_HOMEPAGE='https://rust-lang-nursery.github.io/failure/' CARGO_PKG_LICENSE='MIT OR Apache-2.0' CARGO_PKG_LICENSE_FILE='' CARGO_PKG_NAME=failure CARGO_PKG_README=README.md CARGO_PKG_REPOSITORY='https://github.com/rust-lang-nursery/failure' CARGO_PKG_RUST_VERSION='' CARGO_PKG_VERSION=0.1.8 CARGO_PKG_VERSION_MAJOR=0 CARGO_PKG_VERSION_MINOR=1 CARGO_PKG_VERSION_PATCH=8 CARGO_PKG_VERSION_PRE='' LD_LIBRARY_PATH=/wrkdirs/usr/ports/net/findomain/work/target/release/deps /usr/local/bin/rustc --crate-name failure --edition=2015 /wrkdirs/usr/ports/net/findomain/work/Findomain-9.0.4/cargo-
>crates/failure-0.1.8/src/lib.rs --error-format=json --json=diagnostic-rendered-ansi,artifacts,future-incompat --crate-type lib --emit=dep-info,metadata,link -C opt-level=s -C panic=abort -C linker-plugin-lto -C codegen-units=1 --cfg 'feature="backtrace"' --cfg 'feature="std"' --check-cfg 'cfg(docsrs,test)' --check-cfg 'cfg(feature, values("backtrace", "default", "derive", "failure_derive", "std"))' -C metadata=91ec7d2f69daaa90 -C extra-filename=-9c89e9e5d3bf2c13 --out-dir /wrkdirs/usr/ports/net/findomain/work/target/release/deps -C strip=debuginfo -L dependency=/wrkdirs/usr/ports/net/findomain/work/target/release/deps --extern backtrace=/wrkdirs/usr/ports/net/findomain/work/target/release/deps/libbacktrace-1fcbe0d6138241c4.rmeta --cap-lints warn -C linker=cc`
>warning: unexpected `cfg` condition value: `small-error`
> --> /wrkdirs/usr/ports/net/findomain/work/Findomain-9.0.4/cargo-crates/failure-0.1.8/src/lib.rs:26:13
> |
>26 | #![cfg_attr(feature = "small-error", feature(extern_types, allocator_api))]
> | ^^^^^^^^^^^^^^^^^^^^^^^
> |
> = note: expected values for `feature` are: `backtrace`, `default`, `derive`, `failure_derive`, and `std`
> = help: consider adding `small-error` as a feature in `Cargo.toml`
> = note: see <https://doc.rust-lang.org/nightly/rustc/check-cfg/cargo-specifics.html> for more information about checking conditional configuration
>note: the lint level is defined here
> --> /wrkdirs/usr/ports/net/findomain/work/Findomain-9.0.4/cargo-crates/failure-0.1.8/src/lib.rs:25:9
> |
>25 | #![deny(warnings)]
> | ^^^^^^^^
> = note: `#[warn(unexpected_cfgs)]` implied by `#[warn(warnings)]`
>
>warning: unexpected `cfg` condition value: `small-error`
> --> /wrkdirs/usr/ports/net/findomain/work/Findomain-9.0.4/cargo-crates/failure-0.1.8/src/error/mod.rs:11:12
> |
>11 | #[cfg_attr(feature = "small-error", path = "./error_impl_small.rs")]
> | ^^^^^^^^^^^^^^^^^^^^^^^
> |
> = note: expected values for `feature` are: `backtrace`, `default`, `derive`, `failure_derive`, and `std`
> = help: consider adding `small-error` as a feature in `Cargo.toml`
> = note: see <https://doc.rust-lang.org/nightly/rustc/check-cfg/cargo-specifics.html> for more information about checking conditional configuration
>
>warning: hiding a lifetime that's elided elsewhere is confusing
> --> /wrkdirs/usr/ports/net/findomain/work/Findomain-9.0.4/cargo-crates/failure-0.1.8/src/lib.rs:177:15
> |
>177 | fn causes(&self) -> Causes
> | ^^^^^ ^^^^^^ the same lifetime is hidden here
> | |
> | the lifetime is elided here
> |
> = help: the same lifetime is referred to in inconsistent ways, making the signature confusing
> = note: `#[warn(mismatched_lifetime_syntaxes)]` implied by `#[warn(warnings)]`
>help: use `'_` for type paths
> |
>177 | fn causes(&self) -> Causes<'_>
> | ++++
>
>warning: hiding a lifetime that's elided elsewhere is confusing
> --> /wrkdirs/usr/ports/net/findomain/work/Findomain-9.0.4/cargo-crates/failure-0.1.8/src/lib.rs:242:24
> |
>242 | pub fn iter_causes(&self) -> Causes {
> | ^^^^^ ^^^^^^ the same lifetime is hidden here
> | |
> | the lifetime is elided here
> |
> = help: the same lifetime is referred to in inconsistent ways, making the signature confusing
>help: use `'_` for type paths
> |
>242 | pub fn iter_causes(&self) -> Causes<'_> {
> | ++++
>
>warning: hiding a lifetime that's elided elsewhere is confusing
> --> /wrkdirs/usr/ports/net/findomain/work/Findomain-9.0.4/cargo-crates/failure-0.1.8/src/lib.rs:252:23
> |
>252 | pub fn iter_chain(&self) -> Causes {
> | ^^^^^ ^^^^^^ the same lifetime is hidden here
> | |
> | the lifetime is elided here
> |
> = help: the same lifetime is referred to in inconsistent ways, making the signature confusing
>help: use `'_` for type paths
> |
>252 | pub fn iter_chain(&self) -> Causes<'_> {
> | ++++
>
>warning: hiding a lifetime that's elided elsewhere is confusing
> --> /wrkdirs/usr/ports/net/findomain/work/Findomain-9.0.4/cargo-crates/failure-0.1.8/src/lib.rs:267:19
> |
>267 | pub fn causes(&self) -> Causes {
> | ^^^^^ ^^^^^^ the same lifetime is hidden here
> | |
> | the lifetime is elided here
> |
> = help: the same lifetime is referred to in inconsistent ways, making the signature confusing
>help: use `'_` for type paths
> |
>267 | pub fn causes(&self) -> Causes<'_> {
> | ++++
>
>warning: hiding a lifetime that's elided elsewhere is confusing
> --> /wrkdirs/usr/ports/net/findomain/work/Findomain-9.0.4/cargo-crates/failure-0.1.8/src/error/mod.rs:144:24
> |
>144 | pub fn iter_causes(&self) -> Causes {
> | ^^^^^ ^^^^^^ the same lifetime is hidden here
> | |
> | the lifetime is elided here
> |
> = help: the same lifetime is referred to in inconsistent ways, making the signature confusing
>help: use `'_` for type paths
> |
>144 | pub fn iter_causes(&self) -> Causes<'_> {
> | ++++
>
>warning: hiding a lifetime that's elided elsewhere is confusing
> --> /wrkdirs/usr/ports/net/findomain/work/Findomain-9.0.4/cargo-crates/failure-0.1.8/src/error/mod.rs:154:23
> |
>154 | pub fn iter_chain(&self) -> Causes {
> | ^^^^^ ^^^^^^ the same lifetime is hidden here
> | |
> | the lifetime is elided here
> |
> = help: the same lifetime is referred to in inconsistent ways, making the signature confusing
>help: use `'_` for type paths
> |
>154 | pub fn iter_chain(&self) -> Causes<'_> {
> | ++++
>
>warning: hiding a lifetime that's elided elsewhere is confusing
> --> /wrkdirs/usr/ports/net/findomain/work/Findomain-9.0.4/cargo-crates/failure-0.1.8/src/error/mod.rs:182:19
> |
>182 | pub fn causes(&self) -> Causes {
> | ^^^^^ ^^^^^^ the same lifetime is hidden here
> | |
> | the lifetime is elided here
> |
> = help: the same lifetime is referred to in inconsistent ways, making the signature confusing
>help: use `'_` for type paths
> |
>182 | pub fn causes(&self) -> Causes<'_> {
> | ++++
>
> Compiling headless_chrome v0.9.0 (/wrkdirs/usr/ports/net/findomain/work/rust-headless-chrome-61ce783806e5d75a03f731330edae6156bb0a2e0)
> Running `CARGO=/usr/local/bin/cargo CARGO_CRATE_NAME=build_script_build CARGO_MANIFEST_DIR=/wrkdirs/usr/ports/net/findomain/work/rust-headless-chrome-61ce783806e5d75a03f731330edae6156bb0a2e0 CARGO_MANIFEST_PATH=/wrkdirs/usr/ports/net/findomain/work/rust-headless-chrome-61ce783806e5d75a03f731330edae6156bb0a2e0/Cargo.toml CARGO_PKG_AUTHORS='Alistair Roche <alistair@sunburnt.country>' CARGO_PKG_DESCRIPTION='Control Chrome programatically' CARGO_PKG_HOMEPAGE='https://github.com/atroche/rust-headless-chrome' CARGO_PKG_LICENSE=MIT CARGO_PKG_LICENSE_FILE='' CARGO_PKG_NAME=headless_chrome CARGO_PKG_README=README.md CARGO_PKG_REPOSITORY='https://github.com/atroche/rust-headless-chrome' CARGO_PKG_RUST_VERSION='' CARGO_PKG_VERSION=0.9.0 CARGO_PKG_VERSION_MAJOR=0 CARGO_PKG_VERSION_MINOR=9 CARGO_PKG_VERSION_PATCH=0 CARGO_PKG_VERSION_PRE='' LD_LIBRARY_PATH=/wrkdirs/usr/ports/net/findomain/work/target/release/deps /usr/local/bin/rustc --crate-name build_script_build --edition=2018 /wr
>kdirs/usr/ports/net/findomain/work/rust-headless-chrome-61ce783806e5d75a03f731330edae6156bb0a2e0/build.rs --error-format=json --json=diagnostic-rendered-ansi,artifacts,future-incompat --crate-type bin --emit=dep-info,link -C embed-bitcode=no -C debug-assertions=off --cfg 'feature="default"' --check-cfg 'cfg(docsrs,test)' --check-cfg 'cfg(feature, values("default", "directories", "fetch", "nightly", "ureq", "walkdir", "zip"))' -C metadata=9f1f391aff0222c4 -C extra-filename=-8ca4e550b3f3c322 --out-dir /wrkdirs/usr/ports/net/findomain/work/target/release/build/headless_chrome-8ca4e550b3f3c322 -C strip=debuginfo -L dependency=/wrkdirs/usr/ports/net/findomain/work/target/release/deps --extern auto_generate_cdp=/wrkdirs/usr/ports/net/findomain/work/target/release/deps/libauto_generate_cdp-8d3dfaa99fd37e55.rlib -C linker=cc -L native=/wrkdirs/usr/ports/net/findomain/work/target/release/build/ring-89c8a6f0fc0883e7/out -L native=/wrkdirs/usr/ports/net/findomain/work/target/release/bu
>ild/openssl-sys-66ab441af4bf68d8/out/openssl-build/install/lib`
>warning: `failure` (lib) generated 9 warnings
> Running `CARGO=/usr/local/bin/cargo CARGO_CRATE_NAME=rand_pcg CARGO_MANIFEST_DIR=/wrkdirs/usr/ports/net/findomain/work/Findomain-9.0.4/cargo-crates/rand_pcg-0.2.1 CARGO_MANIFEST_PATH=/wrkdirs/usr/ports/net/findomain/work/Findomain-9.0.4/cargo-crates/rand_pcg-0.2.1/Cargo.toml CARGO_PKG_AUTHORS='The Rand Project Developers' CARGO_PKG_DESCRIPTION='Selected PCG random number generators
>' CARGO_PKG_HOMEPAGE='https://crates.io/crates/rand_pcg' CARGO_PKG_LICENSE='MIT OR Apache-2.0' CARGO_PKG_LICENSE_FILE='' CARGO_PKG_NAME=rand_pcg CARGO_PKG_README=README.md CARGO_PKG_REPOSITORY='https://github.com/rust-random/rand' CARGO_PKG_RUST_VERSION='' CARGO_PKG_VERSION=0.2.1 CARGO_PKG_VERSION_MAJOR=0 CARGO_PKG_VERSION_MINOR=2 CARGO_PKG_VERSION_PATCH=1 CARGO_PKG_VERSION_PRE='' LD_LIBRARY_PATH=/wrkdirs/usr/ports/net/findomain/work/target/release/deps /usr/local/bin/rustc --crate-name rand_pcg --edition=2018 /wrkdirs/usr/ports/net/findomain/work/Findomain-9.0.4/cargo-crates/rand_pcg-0.2.1/src/lib.rs --error-format=json --json=diagnostic-rendered-ansi,artifacts,future-incompat --crate-type lib --emit=dep-info,metadata,link -C opt-level=s -C panic=abort -C linker-plugin-lto -C codegen-units=1 --check-cfg 'cfg(docsrs,test)' --check-cfg 'cfg(feature, values("serde", "serde1"))' -C metadata=d9b6ac172ca3f1f2 -C extra-filename=-6e7814cfc8feaf5f --out-dir /wrkdirs/usr/ports/net/fi
>ndomain/work/target/release/deps -C strip=debuginfo -L dependency=/wrkdirs/usr/ports/net/findomain/work/target/release/deps --extern rand_core=/wrkdirs/usr/ports/net/findomain/work/target/release/deps/librand_core-a7c48b8857c10a67.rmeta --cap-lints warn -C linker=cc`
> Running `CARGO=/usr/local/bin/cargo CARGO_CRATE_NAME=rand_chacha CARGO_MANIFEST_DIR=/wrkdirs/usr/ports/net/findomain/work/Findomain-9.0.4/cargo-crates/rand_chacha-0.2.2 CARGO_MANIFEST_PATH=/wrkdirs/usr/ports/net/findomain/work/Findomain-9.0.4/cargo-crates/rand_chacha-0.2.2/Cargo.toml CARGO_PKG_AUTHORS='The Rand Project Developers:The Rust Project Developers:The CryptoCorrosion Contributors' CARGO_PKG_DESCRIPTION='ChaCha random number generator
>' CARGO_PKG_HOMEPAGE='https://crates.io/crates/rand_chacha' CARGO_PKG_LICENSE='MIT OR Apache-2.0' CARGO_PKG_LICENSE_FILE='' CARGO_PKG_NAME=rand_chacha CARGO_PKG_README=README.md CARGO_PKG_REPOSITORY='https://github.com/rust-random/rand' CARGO_PKG_RUST_VERSION='' CARGO_PKG_VERSION=0.2.2 CARGO_PKG_VERSION_MAJOR=0 CARGO_PKG_VERSION_MINOR=2 CARGO_PKG_VERSION_PATCH=2 CARGO_PKG_VERSION_PRE='' LD_LIBRARY_PATH=/wrkdirs/usr/ports/net/findomain/work/target/release/deps /usr/local/bin/rustc --crate-name rand_chacha --edition=2018 /wrkdirs/usr/ports/net/findomain/work/Findomain-9.0.4/cargo-crates/rand_chacha-0.2.2/src/lib.rs --error-format=json --json=diagnostic-rendered-ansi,artifacts,future-incompat --crate-type lib --emit=dep-info,metadata,link -C opt-level=s -C panic=abort -C linker-plugin-lto -C codegen-units=1 --cfg 'feature="std"' --check-cfg 'cfg(docsrs,test)' --check-cfg 'cfg(feature, values("default", "simd", "std"))' -C metadata=90d39fbe34163b8d -C extra-filename=-ce38efb0fc6
>8ecf7 --out-dir /wrkdirs/usr/ports/net/findomain/work/target/release/deps -C strip=debuginfo -L dependency=/wrkdirs/usr/ports/net/findomain/work/target/release/deps --extern ppv_lite86=/wrkdirs/usr/ports/net/findomain/work/target/release/deps/libppv_lite86-498f4ad267c11818.rmeta --extern rand_core=/wrkdirs/usr/ports/net/findomain/work/target/release/deps/librand_core-a7c48b8857c10a67.rmeta --cap-lints warn -C linker=cc`
> Compiling getopts v0.2.21
> Running `CARGO=/usr/local/bin/cargo CARGO_CRATE_NAME=getopts CARGO_MANIFEST_DIR=/wrkdirs/usr/ports/net/findomain/work/Findomain-9.0.4/cargo-crates/getopts-0.2.21 CARGO_MANIFEST_PATH=/wrkdirs/usr/ports/net/findomain/work/Findomain-9.0.4/cargo-crates/getopts-0.2.21/Cargo.toml CARGO_PKG_AUTHORS='The Rust Project Developers' CARGO_PKG_DESCRIPTION='getopts-like option parsing.
>' CARGO_PKG_HOMEPAGE='https://github.com/rust-lang/getopts' CARGO_PKG_LICENSE=MIT/Apache-2.0 CARGO_PKG_LICENSE_FILE='' CARGO_PKG_NAME=getopts CARGO_PKG_README=README.md CARGO_PKG_REPOSITORY='https://github.com/rust-lang/getopts' CARGO_PKG_RUST_VERSION='' CARGO_PKG_VERSION=0.2.21 CARGO_PKG_VERSION_MAJOR=0 CARGO_PKG_VERSION_MINOR=2 CARGO_PKG_VERSION_PATCH=21 CARGO_PKG_VERSION_PRE='' LD_LIBRARY_PATH=/wrkdirs/usr/ports/net/findomain/work/target/release/deps /usr/local/bin/rustc --crate-name getopts --edition=2015 /wrkdirs/usr/ports/net/findomain/work/Findomain-9.0.4/cargo-crates/getopts-0.2.21/src/lib.rs --error-format=json --json=diagnostic-rendered-ansi,artifacts,future-incompat --crate-type lib --emit=dep-info,metadata,link -C opt-level=s -C panic=abort -C linker-plugin-lto -C codegen-units=1 --check-cfg 'cfg(docsrs,test)' --check-cfg 'cfg(feature, values("core", "rustc-dep-of-std", "std"))' -C metadata=a3535987e7429784 -C extra-filename=-358fa975aa0a04fb --out-dir /wrkdirs/u
>sr/ports/net/findomain/work/target/release/deps -C strip=debuginfo -L dependency=/wrkdirs/usr/ports/net/findomain/work/target/release/deps --extern unicode_width=/wrkdirs/usr/ports/net/findomain/work/target/release/deps/libunicode_width-fe95e5bab41a11c6.rmeta --cap-lints warn -C linker=cc`
>error: linking with `cc` failed: exit status: 1
> |
> = note: "cc" "-m32" "-Wl,-znotext" "/wrkdirs/usr/ports/net/findomain/work/target/release/build/headless_chrome-8ca4e550b3f3c322/rustcODxtC1/symbols.o" "<2 object files omitted>" "-Wl,--as-needed" "-Wl,-Bstatic" "/wrkdirs/usr/ports/net/findomain/work/target/release/deps/{libauto_generate_cdp-8d3dfaa99fd37e55,libreqwest-323301dae00d0135,librustls_pemfile-e40eead44b7e547f,libhyper_rustls-3f4297f1bcfd2f5b,libhyper_tls-b4da4c9b277e7fe9,libwebpki_roots-4c30a652e3639fee,libbase64-fc6f190314144b40,libtrust_dns_resolver-f140c6783ad78387,libresolv_conf-e0e81809427cfaee,libhostname-eac58dee4121b626,libmatch_cfg-a176973dfe4e82f9,libquick_error-5016a8eeeaf743e9,liblru_cache-4d36a739b2a0db62,liblinked_hash_map-708da7c7ef6e822c,libtrust_dns_proto-42bee47d23ba96c2,librand-54e521aa4d344d14,librand_chacha-02e228cf10cebf7a,libppv_lite86-13c13b885596590f,librand_core-4b0b5d28c597c355,libdata_encoding-ebb633acaab2714c,libipnet-9799da05d569410a,libidna-729073a22c82ffc8,libthiserror-2c4e855d242
>3b29b,libtokio_native_tls-932ed36bfc51147e,libtokio_rustls-467d0e5dde76e818,libserde_urlencoded-6a6b19c451924941,libmime-8bc50d755847af92,libencoding_rs-9dd4772dfadaaaa7,libasync_compression-9c04cdb6c4235aa2,libflate2-346a6154c08e41ce,libminiz_oxide-5b1d4d0bb33d760d,libadler-df6cb0e5257e35e7,libcrc32fast-8e78d726e79bb0aa,librustls-2de3b93f491bb528,libsct-02e8cea9e24ab19f,libwebpki-a38a751f855cc7dc,libring-a6c3e1e6a14b7d50,libgetrandom-04811b3f796c85a3,libspin-ea3dfcd16524ecdc,libuntrusted-fcd4f3cca0caf5b1,libnative_tls-224c0cc09a912cfd,libopenssl_probe-df88c47a155ca33b,libopenssl-a8f6b5e1fac2718d,libbitflags-59c926988cf6d841,libforeign_types-c78d3f7ad0c9c592,libforeign_types_shared-7ab7086a84129af2,libopenssl_sys-9d225a3773b7f240,libhyper-a506f86cd9dfb21c,libwant-08d1396e50359d3f,libtry_lock-960fa36f9ee21c57,libsocket2-5d3128b8918303a9,libhttparse-f69f313afe7b83c5,libh2-86ac39bb0e2f3424,libindexmap-ebbee6f266cc600d,libequivalent-a89bc675fcbbc597,libhashbrown-5a06bd632d367487
>,libtokio_util-1e6f3439c0658cc3,libtower_service-603db6bc47f0424b,libtracing-3354d657bc55f9b3,libtracing_core-8989821d29cf705c,libonce_cell-39852ff03a39872b,libtokio-81efb8c680e43b21,libsignal_hook_registry-e54f583b23dea9b1,libnum_cpus-31db033220287543,libsocket2-94b34921b5f93341,libmio-28d3c057c82072c3,libparking_lot-57feba68c9b6c38d,libparking_lot_core-c598418511a8e148,liblibc-e506f775afe8cb88,libcfg_if-77865f1997dae855,libsmallvec-e6fc15a2935246a0,liblock_api-f1d94a41dd48d018,libscopeguard-215f890203a9beef,libhttp_body-54b541c2cc76fd48,liblog-bcfc176e686797b3,libfutures_util-73d97567f291d867,libmemchr-dd1dafa2a4d933e0,libfutures_io-ee916dd283bdee92,libslab-214e71426a714090,libfutures_channel-e2a6b2725d7c28bc,libpin_project_lite-b153aba60bfd686d,libfutures_sink-01aa6727ea170d09,libfutures_task-ccff7a5a432873c9,libpin_utils-2597740b4aea8173,libfutures_core-2559d18f9d54bf4f,liburl-3fda4ce95489499a,libidna-97ea4e6acaa23f4e,libunicode_normalization-3d428e9050b0e3e0,libtinyvec-
>1ca7c2e86a4d5836,libtinyvec_macros-eb01b030f57fc605,libunicode_bidi-2efb0b1230c3e19a,libform_urlencoded-0633fa394261cb57,libpercent_encoding-d648a9d7bd7d1411,libhttp-856c5c41fc44544b,libbytes-9c0bfb1514c031a1,libfnv-662bc797f3ca8595,libconvert_case-0c0866d47c4f0cf4,libquote-feca369cc92ba83f,libserde_json-3bdffdd234d8a1f0,libryu-ba402c58945a79a2,libitoa-7e82ad9ecea997b3,libserde-fdc50b755318b31b,libproc_macro2-4c7b95e9774d7ef5,libunicode_ident-e93a46d0b231faca}.rlib" "<sysroot>/lib/rustlib/i686-unknown-freebsd/lib/{libproc_macro-*,librustc_literal_escaper-*,libstd-*,libpanic_unwind-*,libobject-*,libmemchr-*,libaddr2line-*,libgimli-*,libcfg_if-*,librustc_demangle-*,libstd_detect-*,libhashbrown-*,librustc_std_workspace_alloc-*,libminiz_oxide-*,libadler2-*,libunwind-*,liblibc-*,librustc_std_workspace_core-*,liballoc-*,libcore-*,libcompiler_builtins-*}.rlib" "-Wl,-Bdynamic" "-lrt" "-lutil" "-lexecinfo" "-lkvm" "-lmemstat" "-lkvm" "-lutil" "-lprocstat" "-lrt" "-ldevstat" "-lexecin
>fo" "-lpthread" "-lgcc_s" "-lc" "-lm" "-lrt" "-lpthread" "-lrt" "-lutil" "-lexecinfo" "-lkvm" "-lmemstat" "-lkvm" "-lutil" "-lprocstat" "-lrt" "-ldevstat" "-L" "/wrkdirs/usr/ports/net/findomain/work/target/release/build/headless_chrome-8ca4e550b3f3c322/rustcODxtC1/raw-dylibs" "-Wl,--eh-frame-hdr" "-Wl,-z,noexecstack" "-L" "/wrkdirs/usr/ports/net/findomain/work/target/release/build/ring-89c8a6f0fc0883e7/out" "-L" "/wrkdirs/usr/ports/net/findomain/work/target/release/build/openssl-sys-66ab441af4bf68d8/out/openssl-build/install/lib" "-o" "/wrkdirs/usr/ports/net/findomain/work/target/release/build/headless_chrome-8ca4e550b3f3c322/build_script_build-8ca4e550b3f3c322" "-Wl,--gc-sections" "-pie" "-Wl,-z,relro,-z,now" "-Wl,--strip-debug" "-nodefaultlibs"
> = note: some arguments are omitted. use `--verbose` to show all linker arguments
> = note: ld: error: undefined symbol: __atomic_is_lock_free
> >>> referenced by threads_pthread.c
> >>> libcrypto-lib-threads_pthread.o:(CRYPTO_atomic_or) in archive /wrkdirs/usr/ports/net/findomain/work/target/release/deps/libopenssl_sys-9d225a3773b7f240.rlib
> >>> referenced by threads_pthread.c
> >>> libcrypto-lib-threads_pthread.o:(CRYPTO_atomic_load) in archive /wrkdirs/usr/ports/net/findomain/work/target/release/deps/libopenssl_sys-9d225a3773b7f240.rlib
>
> ld: error: undefined symbol: __atomic_compare_exchange
> >>> referenced by threads_pthread.c
> >>> libcrypto-lib-threads_pthread.o:(CRYPTO_atomic_or) in archive /wrkdirs/usr/ports/net/findomain/work/target/release/deps/libopenssl_sys-9d225a3773b7f240.rlib
>
> ld: error: undefined symbol: __atomic_load
> >>> referenced by threads_pthread.c
> >>> libcrypto-lib-threads_pthread.o:(CRYPTO_atomic_load) in archive /wrkdirs/usr/ports/net/findomain/work/target/release/deps/libopenssl_sys-9d225a3773b7f240.rlib
> cc: error: linker command failed with exit code 1 (use -v to see invocation)
>
>
>error: could not compile `headless_chrome` (build script) due to 1 previous error
>
>Caused by:
> process didn't exit successfully: `CARGO=/usr/local/bin/cargo CARGO_CRATE_NAME=build_script_build CARGO_MANIFEST_DIR=/wrkdirs/usr/ports/net/findomain/work/rust-headless-chrome-61ce783806e5d75a03f731330edae6156bb0a2e0 CARGO_MANIFEST_PATH=/wrkdirs/usr/ports/net/findomain/work/rust-headless-chrome-61ce783806e5d75a03f731330edae6156bb0a2e0/Cargo.toml CARGO_PKG_AUTHORS='Alistair Roche <alistair@sunburnt.country>' CARGO_PKG_DESCRIPTION='Control Chrome programatically' CARGO_PKG_HOMEPAGE='https://github.com/atroche/rust-headless-chrome' CARGO_PKG_LICENSE=MIT CARGO_PKG_LICENSE_FILE='' CARGO_PKG_NAME=headless_chrome CARGO_PKG_README=README.md CARGO_PKG_REPOSITORY='https://github.com/atroche/rust-headless-chrome' CARGO_PKG_RUST_VERSION='' CARGO_PKG_VERSION=0.9.0 CARGO_PKG_VERSION_MAJOR=0 CARGO_PKG_VERSION_MINOR=9 CARGO_PKG_VERSION_PATCH=0 CARGO_PKG_VERSION_PRE='' LD_LIBRARY_PATH=/wrkdirs/usr/ports/net/findomain/work/target/release/deps /usr/local/bin/rustc --crate-name build_script_b
>uild --edition=2018 /wrkdirs/usr/ports/net/findomain/work/rust-headless-chrome-61ce783806e5d75a03f731330edae6156bb0a2e0/build.rs --error-format=json --json=diagnostic-rendered-ansi,artifacts,future-incompat --crate-type bin --emit=dep-info,link -C embed-bitcode=no -C debug-assertions=off --cfg 'feature="default"' --check-cfg 'cfg(docsrs,test)' --check-cfg 'cfg(feature, values("default", "directories", "fetch", "nightly", "ureq", "walkdir", "zip"))' -C metadata=9f1f391aff0222c4 -C extra-filename=-8ca4e550b3f3c322 --out-dir /wrkdirs/usr/ports/net/findomain/work/target/release/build/headless_chrome-8ca4e550b3f3c322 -C strip=debuginfo -L dependency=/wrkdirs/usr/ports/net/findomain/work/target/release/deps --extern auto_generate_cdp=/wrkdirs/usr/ports/net/findomain/work/target/release/deps/libauto_generate_cdp-8d3dfaa99fd37e55.rlib -C linker=cc -L native=/wrkdirs/usr/ports/net/findomain/work/target/release/build/ring-89c8a6f0fc0883e7/out -L native=/wrkdirs/usr/ports/net/findomain
>/work/target/release/build/openssl-sys-66ab441af4bf68d8/out/openssl-build/install/lib` (exit status: 1)
>warning: build failed, waiting for other jobs to finish...
>warning: `trust-dns-resolver` (lib) generated 29 warnings (29 duplicates)
>*** Error code 101
>
>Stop.
>make: stopped in /usr/ports/net/findomain