[package - 150arm64-quarterly][devel/newtonsoft-json] Failed for newtonsoft-json-9.0.1_4 in build

From: <pkg-fallout_at_FreeBSD.org>
Date: Sun, 05 Apr 2026 02:48:45 UTC
You are receiving this mail as a port that you maintain
is failing to build on the FreeBSD package build server.
Please investigate the failure and submit a PR to fix
build.

Maintainer:     ports@FreeBSD.org
Log URL:        https://pkg-status.freebsd.org/ampere4/data/150arm64-quarterly/78db3aeaafd6/logs/newtonsoft-json-9.0.1_4.log
Build URL:      https://pkg-status.freebsd.org/ampere4/build.html?mastername=150arm64-quarterly&build=78db3aeaafd6
Log:

=>> Building devel/newtonsoft-json
build started at Sun Apr  5 02:48:34 UTC 2026
port directory: /usr/ports/devel/newtonsoft-json
package name: newtonsoft-json-9.0.1_4
building for: FreeBSD 150arm64-quarterly-job-05 15.0-RELEASE-p5 FreeBSD 15.0-RELEASE-p5 arm64
maintained by: ports@FreeBSD.org
Makefile datestamp: -rw-r--r--  1 root wheel 1478 Apr  4 01:02 /usr/ports/devel/newtonsoft-json/Makefile
Ports top last git commit: 78db3aeaafd6e8351d3fa52693f922e0020da12f
Ports top unclean checkout: no
Port dir last git commit: 78db3aeaafd6e8351d3fa52693f922e0020da12f
Port dir unclean checkout: no
Poudriere version: poudriere-git-3.4.6-4-g83739588
Host OSVERSION: 1600014
Jail OSVERSION: 1500068
Job Id: 05

---Begin Environment---
SHELL=/bin/sh
OSVERSION=1500068
UNAME_v=FreeBSD 15.0-RELEASE-p5
UNAME_r=15.0-RELEASE-p5
BLOCKSIZE=K
MAIL=/var/mail/root
MM_CHARSET=UTF-8
LANG=C.UTF-8
STATUS=1
HOME=/root
PATH=/sbin:/bin:/usr/sbin:/usr/bin:/usr/local/sbin:/usr/local/bin:/root/bin
MAKE_OBJDIR_CHECK_WRITABLE=0
LOCALBASE=/usr/local
USER=root
POUDRIERE_NAME=poudriere-git
LIBEXECPREFIX=/usr/local/libexec/poudriere
POUDRIERE_VERSION=3.4.6-4-g83739588
MASTERMNT=/usr/local/poudriere/data/.m/150arm64-quarterly/ref
LC_COLLATE=C
POUDRIERE_BUILD_TYPE=bulk
PACKAGE_BUILDING=yes
SAVED_TERM=
OUTPUT_REDIRECTED_STDERR=4
OUTPUT_REDIRECTED=1
PWD=/usr/local/poudriere/data/.m/150arm64-quarterly/05/.p
OUTPUT_REDIRECTED_STDOUT=3
P_PORTS_FEATURES=FLAVORS SUBPACKAGES SELECTED_OPTIONS
MASTERNAME=150arm64-quarterly
SCRIPTPREFIX=/usr/local/share/poudriere
SCRIPTNAME=bulk.sh
OLDPWD=/usr/local/poudriere/data/.m/150arm64-quarterly/ref/.p/pool
POUDRIERE_PKGNAME=poudriere-git-3.4.6-4-g83739588
SCRIPTPATH=/usr/local/share/poudriere/bulk.sh
POUDRIEREPATH=/usr/local/bin/poudriere
---End Environment---

---Begin Poudriere Port Flags/Env---
PORT_FLAGS=
PKGENV=
FLAVOR=
MAKE_ARGS=
---End Poudriere Port Flags/Env---

---Begin OPTIONS List---
---End OPTIONS List---

--MAINTAINER--
ports@FreeBSD.org
--End MAINTAINER--

--CONFIGURE_ARGS--

--End CONFIGURE_ARGS--

--CONFIGURE_ENV--
MONO_SHARED_DIR="/wrkdirs/usr/ports/devel/newtonsoft-json/work" XDG_DATA_HOME=/wrkdirs/usr/ports/devel/newtonsoft-json/work  XDG_CONFIG_HOME=/wrkdirs/usr/ports/devel/newtonsoft-json/work  XDG_CACHE_HOME=/wrkdirs/usr/ports/devel/newtonsoft-json/work/.cache  HOME=/wrkdirs/usr/ports/devel/newtonsoft-json/work TMPDIR="/tmp" PATH=/wrkdirs/usr/ports/devel/newtonsoft-json/work/.bin:/sbin:/bin:/usr/sbin:/usr/bin:/usr/local/sbin:/usr/local/bin:/root/bin PKG_CONFIG_LIBDIR=/wrkdirs/usr/ports/devel/newtonsoft-json/work/.pkgconfig:/usr/local/libdata/pkgconfig:/usr/local/share/pkgconfig:/usr/libdata/pkgconfig SHELL=/bin/sh CONFIG_SHELL=/bin/sh
--End CONFIGURE_ENV--

--MAKE_ENV--
MONO_SHARED_DIR="/wrkdirs/usr/ports/devel/newtonsoft-json/work" TZ=UTC XDG_DATA_HOME=/wrkdirs/usr/ports/devel/newtonsoft-json/work  XDG_CONFIG_HOME=/wrkdirs/usr/ports/devel/newtonsoft-json/work  XDG_CACHE_HOME=/wrkdirs/usr/ports/devel/newtonsoft-json/work/.cache  HOME=/wrkdirs/usr/ports/devel/newtonsoft-json/work TMPDIR="/tmp" PATH=/wrkdirs/usr/ports/devel/newtonsoft-json/work/.bin:/sbin:/bin:/usr/sbin:/usr/bin:/usr/local/sbin:/usr/local/bin:/root/bin PKG_CONFIG_LIBDIR=/wrkdirs/usr/ports/devel/newtonsoft-json/work/.pkgconfig:/usr/local/libdata/pkgconfig:/usr/local/share/pkgconfig:/usr/libdata/pkgconfig MK_DEBUG_FILES=no MK_KERNEL_SYMBOLS=no SHELL=/bin/sh NO_LINT=YES PREFIX=/usr/local  LOCALBASE=/usr/local  CC="cc" CFLAGS="-O2 -pipe  -fstack-protector-strong -fno-strict-aliasing "  CPP="cpp" CPPFLAGS=""  LDFLAGS=" " LIBS=""  CXX="c++" CXXFLAGS="-O2 -pipe -fstack-protector-strong -fno-strict-aliasing   " BSD_INSTALL_PROGRAM="install  -s -m 555"  BSD_INSTALL_LIB="install  -s -m
 0644"  BSD_INSTALL_SCRIPT="install  -m 555"  BSD_INSTALL_DATA="install  -m 0644"  BSD_INSTALL_MAN="install  -m 444"
--End MAKE_ENV--

--PLIST_SUB--
OSREL=15.0 PREFIX=%D LOCALBASE=/usr/local  RESETPREFIX=/usr/local LIB32DIR=lib DOCSDIR="share/doc/newtonsoft-json"  EXAMPLESDIR="share/examples/newtonsoft-json"  DATADIR="share/newtonsoft-json"  WWWDIR="www/newtonsoft-json"  ETCDIR="etc/newtonsoft-json"
--End PLIST_SUB--

--SUB_LIST--
PREFIX=/usr/local LOCALBASE=/usr/local  DATADIR=/usr/local/share/newtonsoft-json DOCSDIR=/usr/local/share/doc/newtonsoft-json EXAMPLESDIR=/usr/local/share/examples/newtonsoft-json  WWWDIR=/usr/local/www/newtonsoft-json ETCDIR=/usr/local/etc/newtonsoft-json
--End SUB_LIST--

---Begin make.conf---
USE_PACKAGE_DEPENDS=yes
BATCH=yes
WRKDIRPREFIX=/wrkdirs
PORTSDIR=/usr/ports
PACKAGES=/packages
DISTDIR=/distfiles
PACKAGE_BUILDING=yes
PACKAGE_BUILDING_FLAVORS=yes
####  ####
# XXX: We really need this but cannot use it while 'make checksum' does not
# try the next mirror on checksum failure.  It currently retries the same
# failed mirror and then fails rather then trying another.  It *does*
# try the next if the size is mismatched though.
#MASTER_SITE_FREEBSD=yes
# Build ALLOW_MAKE_JOBS_PACKAGES with 3 jobs
MAKE_JOBS_NUMBER=3
#### Misc Poudriere ####
.include "/etc/make.conf.ports_env"
GID=0
UID=0
---End make.conf---
--Resource limits--
cpu time               (seconds, -t)  unlimited
file size           (512-blocks, -f)  unlimited
data seg size           (kbytes, -d)  1048576
stack size              (kbytes, -s)  1048576
core file size      (512-blocks, -c)  unlimited
max memory size         (kbytes, -m)  unlimited
locked memory           (kbytes, -l)  unlimited
max user processes              (-u)  89999
open files                      (-n)  8192
virtual mem size        (kbytes, -v)  unlimited
swap limit              (kbytes, -w)  unlimited
socket buffer size       (bytes, -b)  unlimited
pseudo-terminals                (-p)  unlimited
kqueues                         (-k)  unlimited
umtx shared locks               (-o)  unlimited
pipebuf                         (-y)  unlimited
--End resource limits--
=======================<phase: check-sanity   >============================
===== env: NO_DEPENDS=yes USER=root UID=0 GID=0
===>   NOTICE:

The newtonsoft-json port currently does not have a maintainer. As a result, it is
more likely to have unresolved issues, not be up-to-date, or even be removed in
the future. To volunteer to maintain this port, please create an issue at:

https://bugs.freebsd.org/bugzilla

More information about port maintainership is available at:

https://docs.freebsd.org/en/articles/contributing/#ports-contributing

===>  License MIT accepted by the user
===========================================================================
=======================<phase: pkg-depends    >============================
===== env: USE_PACKAGE_DEPENDS_ONLY=1 USER=root UID=0 GID=0
===>   newtonsoft-json-9.0.1_4 depends on file: /usr/local/sbin/pkg - not found
===>   Installing existing package /packages/All/pkg-2.6.2_1.pkg
[150arm64-quarterly-job-05] Installing pkg-2.6.2_1...
[150arm64-quarterly-job-05] Extracting pkg-2.6.2_1: .......... done
===>   newtonsoft-json-9.0.1_4 depends on file: /usr/local/sbin/pkg - found
===>   Returning to build of newtonsoft-json-9.0.1_4
===========================================================================
=======================<phase: fetch-depends  >============================
===== env: USE_PACKAGE_DEPENDS_ONLY=1 USER=root UID=0 GID=0
===========================================================================
=======================<phase: fetch          >============================
===== env: NO_DEPENDS=yes USER=root UID=0 GID=0
===>   NOTICE:

The newtonsoft-json port currently does not have a maintainer. As a result, it is
more likely to have unresolved issues, not be up-to-date, or even be removed in
the future. To volunteer to maintain this port, please create an issue at:

https://bugs.freebsd.org/bugzilla

More information about port maintainership is available at:

https://docs.freebsd.org/en/articles/contributing/#ports-contributing

===>  License MIT accepted by the user
===> Fetching all distfiles required by newtonsoft-json-9.0.1_4 for building
===========================================================================
=======================<phase: checksum       >============================
===== env: FETCH_REGET=0 NO_DEPENDS=yes USER=root UID=0 GID=0
===>   NOTICE:

The newtonsoft-json port currently does not have a maintainer. As a result, it is
more likely to have unresolved issues, not be up-to-date, or even be removed in
the future. To volunteer to maintain this port, please create an issue at:

https://bugs.freebsd.org/bugzilla

More information about port maintainership is available at:

https://docs.freebsd.org/en/articles/contributing/#ports-contributing

===>  License MIT accepted by the user
===> Fetching all distfiles required by newtonsoft-json-9.0.1_4 for building
=> SHA256 Checksum OK for JamesNK-Newtonsoft.Json-9.0.1_GH0.tar.gz.
===========================================================================
=======================<phase: extract-depends>============================
===== env: USE_PACKAGE_DEPENDS_ONLY=1 USER=root UID=0 GID=0
===========================================================================
=======================<phase: extract        >============================
===== env: NO_DEPENDS=yes USER=root UID=0 GID=0
===>   NOTICE:

The newtonsoft-json port currently does not have a maintainer. As a result, it is
more likely to have unresolved issues, not be up-to-date, or even be removed in
<snip>
* Build Mono and gtk+ (x11-toolkits/gtk20) without CPUTYPE and with the
  default FreeBSD CFLAGS ('-O2 -fno-strict-aliasing -pipe') as Mono has
  been known to expose compiler bugs.

* Try building and running Mono with the GENERIC kernel.
  - Mono requires SYSVSHM, SYSVMSG, and SYSVSEM which are part of the
    GENERIC kernel.
  - Removing kernel options or changing defaults to use experimental
    options can adversely affect Mono's ability to build and run.

* Remove leftover semaphores / increase semaphore limits.
  - Close apps which use Mono and run `ipcs -sbt`.  Remove the
    semaphores with MODE "--rw-------" and NSEMS "8" using ipcrm (1)
  - _OR_ simply reboot which is the safest method.
  - On multi-user systems the semaphore limits may need to be increased
    from the defaults. The following should comfortably support 30 users.

    # echo "kern.ipc.semmni=40" >> /boot/loader.conf
    # echo "kern.ipc.semmns=300" >> /boot/loader.conf

* If you are in a jailed environment, ensure System V IPC are enabled.
  You can rely on the security.jail.sysvipc_allowed  sysctl to check
  this status.  The following enables this feature on the host system:
    # echo "jail_sysvipc_allow=\"YES\"" >> /etc/rc.conf

* Some process information are accessed through /proc (e.g. when using
  NUnit) and procfs(5) has to be mounted for these features to work:
    # echo "proc            /proc   procfs  rw 0 0" >> /etc/fstab
--
===>   NOTICE:

The mono5.20 port currently does not have a maintainer. As a result, it is
more likely to have unresolved issues, not be up-to-date, or even be removed in
the future. To volunteer to maintain this port, please create an issue at:

https://bugs.freebsd.org/bugzilla

More information about port maintainership is available at:

https://docs.freebsd.org/en/articles/contributing/#ports-contributing
===>   newtonsoft-json-9.0.1_4 depends on executable: mono - found
===>   Returning to build of newtonsoft-json-9.0.1_4
===========================================================================
=======================<phase: lib-depends    >============================
===== env: USE_PACKAGE_DEPENDS_ONLY=1 USER=root UID=0 GID=0
===========================================================================
=======================<phase: configure      >============================
===== env: NO_DEPENDS=yes USER=root UID=0 GID=0
===>  Configuring for newtonsoft-json-9.0.1_4
===========================================================================
=======================<phase: build          >============================
===== env: NO_DEPENDS=yes USER=root UID=0 GID=0
===>  Building for newtonsoft-json-9.0.1_4
(cd /wrkdirs/usr/ports/devel/newtonsoft-json/work/Newtonsoft.Json-9.0.1/Src/Newtonsoft.Json && /usr/bin/env MONO_SHARED_DIR="/wrkdirs/usr/ports/devel/newtonsoft-json/work" TZ=UTC XDG_DATA_HOME=/wrkdirs/usr/ports/devel/newtonsoft-json/work  XDG_CONFIG_HOME=/wrkdirs/usr/ports/devel/newtonsoft-json/work  XDG_CACHE_HOME=/wrkdirs/usr/ports/devel/newtonsoft-json/work/.cache  HOME=/wrkdirs/usr/ports/devel/newtonsoft-json/work TMPDIR="/tmp" PATH=/wrkdirs/usr/ports/devel/newtonsoft-json/work/.bin:/sbin:/bin:/usr/sbin:/usr/bin:/usr/local/sbin:/usr/local/bin:/root/bin PKG_CONFIG_LIBDIR=/wrkdirs/usr/ports/devel/newtonsoft-json/work/.pkgconfig:/usr/local/libdata/pkgconfig:/usr/local/share/pkgconfig:/usr/libdata/pkgconfig MK_DEBUG_FILES=no MK_KERNEL_SYMBOLS=no SHELL=/bin/sh NO_LINT=YES PREFIX=/usr/local  LOCALBASE=/usr/local  CC="cc" CFLAGS="-O2 -pipe  -fstack-protector-strong -fno-strict-aliasing "  CPP="cpp" CPPFLAGS=""  LDFLAGS=" " LIBS=""  CXX="c++" CXXFLAGS="-O2 -pipe -fstack-protect
or-strong -fno-strict-aliasing   " BSD_INSTALL_PROGRAM="install  -s -m 555"  BSD_INSTALL_LIB="install  -s -m 0644"  BSD_INSTALL_SCRIPT="install  -m 555"  BSD_INSTALL_DATA="install  -m 0644"  BSD_INSTALL_MAN="install  -m 444" xbuild Newtonsoft.Json.csproj  /property:SignAssembly=true  /property:AssemblyOriginatorKeyFile=Dynamic.snk  /property:Configuration=Release  /property:DefineConstants='SIGNED NET45 TRACE')

>>>> xbuild tool is deprecated and will be removed in future updates, use msbuild instead <<<<

XBuild Engine Version 14.0
Mono, Version 5.20.1.34
Copyright (C) 2005-2013 Various Mono authors

Build started 04/05/2026 02:48:41.
__________________________________________________
Project "/wrkdirs/usr/ports/devel/newtonsoft-json/work/Newtonsoft.Json-9.0.1/Src/Newtonsoft.Json/Newtonsoft.Json.csproj" (default target(s)):
	Target PrepareForBuild:
		Configuration: Release Platform: AnyCPU
		Created directory "bin/Release/Net45/"
		Created directory "obj/Release/Net45/"
	Target CopyNonResxEmbeddedResources:
		Copying file from '/wrkdirs/usr/ports/devel/newtonsoft-json/work/Newtonsoft.Json-9.0.1/Src/Newtonsoft.Json/Dynamic.snk' to '/wrkdirs/usr/ports/devel/newtonsoft-json/work/Newtonsoft.Json-9.0.1/Src/Newtonsoft.Json/obj/Release/Net45/Newtonsoft.Json.Dynamic.snk'
	Target GenerateSatelliteAssemblies:
	No input files were specified for target GenerateSatelliteAssemblies, skipping.
	Target CoreCompile:
		Tool /usr/local/lib/mono/4.5/csc.exe execution started with arguments: /noconfig /debug:pdbonly /keyfile:Dynamic.snk /publicsign /optimize+ /out:obj/Release/Net45/Newtonsoft.Json.dll /resource:obj/Release/Net45/Newtonsoft.Json.Dynamic.snk Bson/BsonBinaryType.cs Bson/BsonBinaryWriter.cs Bson/BsonObjectId.cs Bson/BsonReader.cs Bson/BsonToken.cs Bson/BsonType.cs Bson/BsonWriter.cs ConstructorHandling.cs Converters/BinaryConverter.cs Converters/BsonObjectIdConverter.cs Converters/CustomCreationConverter.cs Converters/DataSetConverter.cs Converters/DataTableConverter.cs Converters/DateTimeConverterBase.cs Converters/DiscriminatedUnionConverter.cs Converters/EntityKeyMemberConverter.cs Converters/ExpandoObjectConverter.cs Converters/IsoDateTimeConverter.cs Converters/JavaScriptDateTimeConverter.cs Converters/JsonValueConverter.cs Converters/KeyValuePairConverter.cs Converters/RegexConverter.cs Converters/StringEnumConverter.cs Converters/VersionConverter.cs Converters/XmlNodeCon
verter.cs FloatParseHandling.cs DateFormatHandling.cs DateParseHandling.cs DateTimeZoneHandling.cs DefaultValueHandling.cs FloatFormatHandling.cs FormatterAssemblyStyle.cs Formatting.cs IArrayPool.cs IJsonLineInfo.cs JsonArrayAttribute.cs JsonConstructorAttribute.cs JsonContainerAttribute.cs JsonConvert.cs JsonConverter.cs JsonConverterAttribute.cs JsonConverterCollection.cs JsonDictionaryAttribute.cs JsonException.cs JsonExtensionDataAttribute.cs JsonIgnoreAttribute.cs JsonObjectAttribute.cs JsonPosition.cs JsonPropertyAttribute.cs JsonReader.cs JsonReaderException.cs JsonRequiredAttribute.cs JsonSerializationException.cs JsonSerializer.cs JsonSerializerSettings.cs JsonTextReader.cs JsonTextWriter.cs JsonToken.cs JsonValidatingReader.cs JsonWriter.cs JsonWriterException.cs Linq/CommentHandling.cs Linq/Extensions.cs Linq/IJEnumerable.cs Linq/JArray.cs Linq/JConstructor.cs Linq/JContainer.cs Linq/JEnumerable.cs Linq/JObject.cs Linq/JsonMergeSettings.cs Linq/JsonPath/ArrayInde
xFilter.cs Linq/JsonPath/ArrayMultipleIndexFilter.cs Linq/JsonPath/ArraySliceFilter.cs Linq/JsonPath/FieldFilter.cs Linq/JsonPath/FieldMultipleFilter.cs Linq/JsonPath/JPath.cs Linq/JProperty.cs Linq/JPropertyDescriptor.cs Linq/JPropertyKeyedCollection.cs Linq/JRaw.cs Linq/JsonPath/PathFilter.cs Linq/JsonPath/QueryExpression.cs Linq/JsonPath/QueryFilter.cs Linq/JsonPath/ScanFilter.cs Linq/JToken.cs Linq/JTokenEqualityComparer.cs Linq/JTokenReader.cs Linq/JTokenType.cs Linq/JTokenWriter.cs Linq/JValue.cs Linq/JsonLoadSettings.cs Linq/MergeArrayHandling.cs Linq/MergeNullValueHandling.cs MemberSerialization.cs MetadataPropertyHandling.cs MissingMemberHandling.cs NullValueHandling.cs ObjectCreationHandling.cs PreserveReferencesHandling.cs Properties/AssemblyInfo.cs ReferenceLoopHandling.cs Required.cs Schema/Extensions.cs Schema/JsonSchema.cs Schema/JsonSchemaBuilder.cs Schema/JsonSchemaConstants.cs Schema/JsonSchemaException.cs Schema/JsonSchemaGenerator.cs Schema/JsonSchemaMode
l.cs Schema/JsonSchemaModelBuilder.cs Schema/JsonSchemaNode.cs Schema/JsonSchemaNodeCollection.cs Schema/JsonSchemaResolver.cs Schema/JsonSchemaType.cs Schema/JsonSchemaWriter.cs Schema/UndefinedSchemaIdHandling.cs Schema/ValidationEventArgs.cs Schema/ValidationEventHandler.cs SerializationBinder.cs Serialization/CachedAttributeGetter.cs Serialization/SnakeCaseNamingStrategy.cs Serialization/CamelCaseNamingStrategy.cs Serialization/CamelCasePropertyNamesContractResolver.cs Serialization/DefaultContractResolver.cs Serialization/DefaultNamingStrategy.cs Serialization/DefaultReferenceResolver.cs Serialization/DefaultSerializationBinder.cs Serialization/DiagnosticsTraceWriter.cs Serialization/DynamicValueProvider.cs Serialization/ErrorContext.cs Serialization/ErrorEventArgs.cs Serialization/ExpressionValueProvider.cs Serialization/IAttributeProvider.cs Serialization/IContractResolver.cs Serialization/NamingStrategy.cs Serialization/IReferenceResolver.cs Serialization/ITraceWrite
r.cs Serialization/IValueProvider.cs Serialization/JsonArrayContract.cs Serialization/JsonContainerContract.cs Serialization/JsonContract.cs Serialization/JsonDictionaryContract.cs Serialization/JsonDynamicContract.cs Serialization/JsonFormatterConverter.cs Serialization/JsonISerializableContract.cs Serialization/JsonLinqContract.cs Serialization/JsonObjectContract.cs Serialization/JsonPrimitiveContract.cs Serialization/JsonProperty.cs Serialization/JsonPropertyCollection.cs Serialization/JsonSerializerInternalBase.cs Serialization/JsonSerializerInternalReader.cs Serialization/JsonSerializerInternalWriter.cs Serialization/JsonSerializerProxy.cs Serialization/JsonStringContract.cs Serialization/JsonTypeReflector.cs Serialization/MemoryTraceWriter.cs Serialization/ObjectConstructor.cs Serialization/OnErrorAttribute.cs Serialization/ReflectionAttributeProvider.cs Serialization/ReflectionValueProvider.cs Serialization/TraceJsonReader.cs Serialization/TraceJsonWriter.cs StringEsc
apeHandling.cs TraceLevel.cs TypeNameHandling.cs Utilities/Base64Encoder.cs Utilities/BidirectionalDictionary.cs Utilities/CollectionUtils.cs Utilities/CollectionWrapper.cs Utilities/ConvertUtils.cs Utilities/DateTimeParser.cs Utilities/DateTimeUtils.cs Utilities/DictionaryWrapper.cs Utilities/DynamicProxy.cs Utilities/DynamicProxyMetaObject.cs Utilities/DynamicReflectionDelegateFactory.cs Utilities/DynamicUtils.cs Utilities/JsonTokenUtils.cs Utilities/PropertyNameTable.cs Utilities/ReflectionObject.cs Utilities/EnumUtils.cs Utilities/EnumValue.cs Utilities/ExpressionReflectionDelegateFactory.cs Utilities/FSharpUtils.cs Utilities/ILGeneratorExtensions.cs Utilities/ImmutableCollectionsUtils.cs Utilities/JavaScriptUtils.cs Utilities/LateBoundReflectionDelegateFactory.cs Utilities/LinqBridge.cs Utilities/MathUtils.cs Utilities/MethodCall.cs Utilities/MiscellaneousUtils.cs Utilities/ReflectionDelegateFactory.cs Utilities/ReflectionUtils.cs Utilities/StringBuffer.cs Utilities/Str
ingReference.cs Utilities/StringUtils.cs Utilities/ThreadSafeStore.cs Utilities/TypeExtensions.cs Utilities/ValidationUtils.cs WriteState.cs obj/Release/Net45/.NETFramework,Version=v4.5.AssemblyAttribute.cs /target:library /define:"SIGNED;NET45;TRACE" /doc:bin/Release/Net45/Newtonsoft.Json.xml /nostdlib /reference:/usr/local/lib/mono/4.5-api/System.dll /reference:/usr/local/lib/mono/4.5-api/System.Numerics.dll /reference:/usr/local/lib/mono/4.5-api/System.Runtime.Serialization.dll /reference:/usr/local/lib/mono/4.5-api/System.Xml.Linq.dll /reference:/usr/local/lib/mono/4.5-api/System.Data.dll /reference:/usr/local/lib/mono/4.5-api/System.Xml.dll /reference:/usr/local/lib/mono/4.5-api/System.Core.dll /reference:/usr/local/lib/mono/4.5-api//mscorlib.dll /warn:4
		Microsoft (R) Visual C# Compiler version 2.8.2.62916 (2ad4aabc)
		Copyright (C) Microsoft Corporation. All rights reserved.
		Unhandled Exception:
		System.ExecutionEngineException: System.IndexOutOfRangeException: Index was outside the bounds of the array.
		  at System.Collections.Immutable.ImmutableArray`1+Builder[T].get_Item (System.Int32 index) [0x00009] in <36486b016d234fca8cd67892bf29c7b5>:0 
		  at Microsoft.CodeAnalysis.PooledObjects.ArrayBuilder`1[T].get_Item (System.Int32 index) [0x00000] in <b28b918e025b48209f28967b441780d7>:0 
		  at Microsoft.CodeAnalysis.CodeGen.ILBuilder.GetILOffsetFromMarker (System.Int32 ilMarker) [0x00000] in <b28b918e025b48209f28967b441780d7>:0 
		  at Microsoft.CodeAnalysis.CodeGen.ILBuilder.RealizeSequencePoints () [0x00029] in <b28b918e025b48209f28967b441780d7>:0 
		  at Microsoft.CodeAnalysis.CodeGen.ILBuilder.RealizeBlocks () [0x00201] in <b28b918e025b48209f28967b441780d7>:0 
		  at Microsoft.CodeAnalysis.CodeGen.ILBuilder.Realize () [0x0000d] in <b28b918e025b48209f28967b441780d7>:0 
		  at Microsoft.CodeAnalysis.CSharp.CodeGen.CodeGenerator.GenerateImpl () [0x0004f] in <b7d368a2667f4dca818a47370ae17a21>:0 
		  at Microsoft.CodeAnalysis.CSharp.CodeGen.CodeGenerator.Generate () [0x00000] in <b7d368a2667f4dca818a47370ae17a21>:0 
		  at Microsoft.CodeAnalysis.CSharp.MethodCompiler.GenerateMethodBody (Microsoft.CodeAnalysis.CSharp.Emit.PEModuleBuilder moduleBuilder, Microsoft.CodeAnalysis.CSharp.Symbols.MethodSymbol method, System.Int32 methodOrdinal, Microsoft.CodeAnalysis.CSharp.BoundStatement block, System.Collections.Immutable.ImmutableArray`1[T] lambdaDebugInfo, System.Collections.Immutable.ImmutableArray`1[T] closureDebugInfo, Microsoft.CodeAnalysis.CSharp.StateMachineTypeSymbol stateMachineTypeOpt, Microsoft.CodeAnalysis.CodeGen.VariableSlotAllocator variableSlotAllocatorOpt, Microsoft.CodeAnalysis.DiagnosticBag diagnostics, Microsoft.CodeAnalysis.CodeGen.DebugDocumentProvider debugDocumentProvider, Microsoft.CodeAnalysis.CSharp.ImportChain importChainOpt, System.Boolean emittingPdb, System.Boolean emitTestCoverageData, System.Collections.Immutable.ImmutableArray`1[T] dynamicAnalysisSpans) [0x000c3] in <b7d368a2667f4dca818a47370ae17a21>:0 
		  at Microsoft.CodeAnalysis.CSharp.MethodCompiler.CompileSynthesizedMethods (Microsoft.CodeAnalysis.CSharp.TypeCompilationState compilationState) [0x000fa] in <b7d368a2667f4dca818a47370ae17a21>:0 
		  at Microsoft.CodeAnalysis.CSharp.MethodCompiler.CompileNamedType (Microsoft.CodeAnalysis.CSharp.Symbols.NamedTypeSymbol containingType) [0x003da] in <b7d368a2667f4dca818a47370ae17a21>:0 
		  at Microsoft.CodeAnalysis.CSharp.MethodCompiler+<>c__DisplayClass21_0.<CompileNamedTypeAsTask>b__0 () [0x00000] in <b7d368a2667f4dca818a47370ae17a21>:0  ---> System.IndexOutOfRangeException: Index was outside the bounds of the array.
		  at System.Collections.Immutable.ImmutableArray`1+Builder[T].get_Item (System.Int32 index) [0x00009] in <36486b016d234fca8cd67892bf29c7b5>:0 
		  at Microsoft.CodeAnalysis.PooledObjects.ArrayBuilder`1[T].get_Item (System.Int32 index) [0x00000] in <b28b918e025b48209f28967b441780d7>:0 
		  at Microsoft.CodeAnalysis.CodeGen.ILBuilder.GetILOffsetFromMarker (System.Int32 ilMarker) [0x00000] in <b28b918e025b48209f28967b441780d7>:0 
		  at Microsoft.CodeAnalysis.CodeGen.ILBuilder.RealizeSequencePoints () [0x00029] in <b28b918e025b48209f28967b441780d7>:0 
		  at Microsoft.CodeAnalysis.CodeGen.ILBuilder.RealizeBlocks () [0x00201] in <b28b918e025b48209f28967b441780d7>:0 
		  at Microsoft.CodeAnalysis.CodeGen.ILBuilder.Realize () [0x0000d] in <b28b918e025b48209f28967b441780d7>:0 
		  at Microsoft.CodeAnalysis.CSharp.CodeGen.CodeGenerator.GenerateImpl () [0x0004f] in <b7d368a2667f4dca818a47370ae17a21>:0 
		  at Microsoft.CodeAnalysis.CSharp.CodeGen.CodeGenerator.Generate () [0x00000] in <b7d368a2667f4dca818a47370ae17a21>:0 
		  at Microsoft.CodeAnalysis.CSharp.MethodCompiler.GenerateMethodBody (Microsoft.CodeAnalysis.CSharp.Emit.PEModuleBuilder moduleBuilder, Microsoft.CodeAnalysis.CSharp.Symbols.MethodSymbol method, System.Int32 methodOrdinal, Microsoft.CodeAnalysis.CSharp.BoundStatement block, System.Collections.Immutable.ImmutableArray`1[T] lambdaDebugInfo, System.Collections.Immutable.ImmutableArray`1[T] closureDebugInfo, Microsoft.CodeAnalysis.CSharp.StateMachineTypeSymbol stateMachineTypeOpt, Microsoft.CodeAnalysis.CodeGen.VariableSlotAllocator variableSlotAllocatorOpt, Microsoft.CodeAnalysis.DiagnosticBag diagnostics, Microsoft.CodeAnalysis.CodeGen.DebugDocumentProvider debugDocumentProvider, Microsoft.CodeAnalysis.CSharp.ImportChain importChainOpt, System.Boolean emittingPdb, System.Boolean emitTestCoverageData, System.Collections.Immutable.ImmutableArray`1[T] dynamicAnalysisSpans) [0x000c3] in <b7d368a2667f4dca818a47370ae17a21>:0 
		  at Microsoft.CodeAnalysis.CSharp.MethodCompiler.CompileSynthesizedMethods (Microsoft.CodeAnalysis.CSharp.TypeCompilationState compilationState) [0x000fa] in <b7d368a2667f4dca818a47370ae17a21>:0 
		  at Microsoft.CodeAnalysis.CSharp.MethodCompiler.CompileNamedType (Microsoft.CodeAnalysis.CSharp.Symbols.NamedTypeSymbol containingType) [0x003da] in <b7d368a2667f4dca818a47370ae17a21>:0 
		  at Microsoft.CodeAnalysis.CSharp.MethodCompiler+<>c__DisplayClass21_0.<CompileNamedTypeAsTask>b__0 () [0x00000] in <b7d368a2667f4dca818a47370ae17a21>:0 
		   --- End of inner exception stack trace ---
		  at System.Environment.FailFast (System.String message, System.Exception exception) [0x00007] in <9253eee996774eb7bb0012c4a9fa9a20>:0 
		  at Microsoft.CodeAnalysis.FailFast.OnFatalException (System.Exception exception) [0x00038] in <b28b918e025b48209f28967b441780d7>:0 
		  at Microsoft.CodeAnalysis.FatalError.Report (System.Exception exception, System.Action`1[T] handler) [0x00080] in <b28b918e025b48209f28967b441780d7>:0 
		  at Microsoft.CodeAnalysis.FatalError.Report (System.Exception exception) [0x00000] in <b28b918e025b48209f28967b441780d7>:0 
		  at Microsoft.CodeAnalysis.FatalError.ReportUnlessCanceled (System.Exception exception) [0x0000a] in <b28b918e025b48209f28967b441780d7>:0 
		  at Microsoft.CodeAnalysis.CSharp.MethodCompiler+<>c__DisplayClass21_0.<CompileNamedTypeAsTask>b__0 () [0x0001c] in <b7d368a2667f4dca818a47370ae17a21>:0 
		  at Roslyn.Utilities.UICultureUtilities+<>c__DisplayClass5_0.<WithCurrentUICulture>b__0 () [0x00038] in <b28b918e025b48209f28967b441780d7>:0 
		  at System.Threading.Tasks.Task.InnerInvoke () [0x0000f] in <9253eee996774eb7bb0012c4a9fa9a20>:0 
		  at System.Threading.Tasks.Task.Execute () [0x00000] in <9253eee996774eb7bb0012c4a9fa9a20>:0 
		--- End of stack trace from previous location where exception was thrown ---
		  at Microsoft.CodeAnalysis.CSharp.MethodCompiler.WaitForWorkers () [0x00012] in <b7d368a2667f4dca818a47370ae17a21>:0 
		  at Microsoft.CodeAnalysis.CSharp.MethodCompiler.CompileMethodBodies (Microsoft.CodeAnalysis.CSharp.CSharpCompilation compilation, Microsoft.CodeAnalysis.CSharp.Emit.PEModuleBuilder moduleBeingBuiltOpt, System.Boolean emittingPdb, System.Boolean emitTestCoverageData, System.Boolean hasDeclarationErrors, Microsoft.CodeAnalysis.DiagnosticBag diagnostics, System.Predicate`1[T] filterOpt, System.Threading.CancellationToken cancellationToken) [0x00050] in <b7d368a2667f4dca818a47370ae17a21>:0 
		  at Microsoft.CodeAnalysis.CSharp.CSharpCompilation.CompileMethods (Microsoft.CodeAnalysis.Emit.CommonPEModuleBuilder moduleBuilder, System.Boolean emittingPdb, System.Boolean emitMetadataOnly, System.Boolean emitTestCoverageData, Microsoft.CodeAnalysis.DiagnosticBag diagnostics, System.Predicate`1[T] filterOpt, System.Threading.CancellationToken cancellationToken) [0x000aa] in <b7d368a2667f4dca818a47370ae17a21>:0 
		  at Microsoft.CodeAnalysis.CommonCompiler.CompileAndEmit (Microsoft.CodeAnalysis.TouchedFileLogger touchedFilesLogger, Microsoft.CodeAnalysis.Compilation& compilation, System.Collections.Immutable.ImmutableArray`1[T] analyzers, System.Collections.Immutable.ImmutableArray`1[T] additionalTextFiles, System.Collections.Immutable.ImmutableArray`1[T] embeddedTexts, Microsoft.CodeAnalysis.DiagnosticBag diagnostics, System.Threading.CancellationToken cancellationToken, System.Threading.CancellationTokenSource& analyzerCts, System.Boolean& reportAnalyzer, Microsoft.CodeAnalysis.Diagnostics.AnalyzerDriver& analyzerDriver) [0x00216] in <b28b918e025b48209f28967b441780d7>:0 
		  at Microsoft.CodeAnalysis.CommonCompiler.RunCore (System.IO.TextWriter consoleOutput, Microsoft.CodeAnalysis.ErrorLogger errorLogger, System.Threading.CancellationToken cancellationToken) [0x000ef] in <b28b918e025b48209f28967b441780d7>:0 
		  at Microsoft.CodeAnalysis.CommonCompiler.Run (System.IO.TextWriter consoleOutput, System.Threading.CancellationToken cancellationToken) [0x00035] in <b28b918e025b48209f28967b441780d7>:0 
		  at Microsoft.CodeAnalysis.CSharp.CommandLine.Csc+<>c__DisplayClass1_0.<Run>b__0 (System.IO.TextWriter tw) [0x00000] in <3853db4dce5d45189bea37fcfe62530b>:0 
		  at Microsoft.CodeAnalysis.CommandLine.ConsoleUtil.RunWithUtf8Output[T] (System.Boolean utf8Output, System.IO.TextWriter textWriter, System.Func`2[T,TResult] func) [0x00034] in <3853db4dce5d45189bea37fcfe62530b>:0 
		  at Microsoft.CodeAnalysis.CSharp.CommandLine.Csc.Run (System.String[] args, Microsoft.CodeAnalysis.BuildPaths buildPaths, System.IO.TextWriter textWriter, Microsoft.CodeAnalysis.IAnalyzerAssemblyLoader analyzerLoader) [0x00048] in <3853db4dce5d45189bea37fcfe62530b>:0 
		  at (wrapper delegate-invoke) <Module>.invoke_int_string[]_BuildPaths_TextWriter_IAnalyzerAssemblyLoader(string[],Microsoft.CodeAnalysis.BuildPaths,System.IO.TextWriter,Microsoft.CodeAnalysis.IAnalyzerAssemblyLoader)
		  at Microsoft.CodeAnalysis.CommandLine.DesktopBuildClient.RunLocalCompilation (System.String[] arguments, Microsoft.CodeAnalysis.BuildPaths buildPaths, System.IO.TextWriter textWriter) [0x00000] in <3853db4dce5d45189bea37fcfe62530b>:0 
		  at Microsoft.CodeAnalysis.CommandLine.BuildClient.RunCompilation (System.Collections.Generic.IEnumerable`1[T] originalArguments, Microsoft.CodeAnalysis.BuildPaths buildPaths, System.IO.TextWriter textWriter) [0x00098] in <3853db4dce5d45189bea37fcfe62530b>:0 
		  at Microsoft.CodeAnalysis.CommandLine.DesktopBuildClient.Run (System.Collections.Generic.IEnumerable`1[T] arguments, Microsoft.CodeAnalysis.CommandLine.RequestLanguage language, Microsoft.CodeAnalysis.CommandLine.CompileFunc compileFunc, Microsoft.CodeAnalysis.IAnalyzerAssemblyLoader analyzerAssemblyLoader) [0x00043] in <3853db4dce5d45189bea37fcfe62530b>:0 
		  at Microsoft.CodeAnalysis.CSharp.CommandLine.Program.MainCore (System.String[] args) [0x00006] in <3853db4dce5d45189bea37fcfe62530b>:0 
		  at Microsoft.CodeAnalysis.CSharp.CommandLine.Program.Main (System.String[] args) [0x00000] in <3853db4dce5d45189bea37fcfe62530b>:0 
		[ERROR] FATAL UNHANDLED EXCEPTION: System.ExecutionEngineException: System.IndexOutOfRangeException: Index was outside the bounds of the array.
		  at System.Collections.Immutable.ImmutableArray`1+Builder[T].get_Item (System.Int32 index) [0x00009] in <36486b016d234fca8cd67892bf29c7b5>:0 
		  at Microsoft.CodeAnalysis.PooledObjects.ArrayBuilder`1[T].get_Item (System.Int32 index) [0x00000] in <b28b918e025b48209f28967b441780d7>:0 
		  at Microsoft.CodeAnalysis.CodeGen.ILBuilder.GetILOffsetFromMarker (System.Int32 ilMarker) [0x00000] in <b28b918e025b48209f28967b441780d7>:0 
		  at Microsoft.CodeAnalysis.CodeGen.ILBuilder.RealizeSequencePoints () [0x00029] in <b28b918e025b48209f28967b441780d7>:0 
		  at Microsoft.CodeAnalysis.CodeGen.ILBuilder.RealizeBlocks () [0x00201] in <b28b918e025b48209f28967b441780d7>:0 
		  at Microsoft.CodeAnalysis.CodeGen.ILBuilder.Realize () [0x0000d] in <b28b918e025b48209f28967b441780d7>:0 
		  at Microsoft.CodeAnalysis.CSharp.CodeGen.CodeGenerator.GenerateImpl () [0x0004f] in <b7d368a2667f4dca818a47370ae17a21>:0 
		  at Microsoft.CodeAnalysis.CSharp.CodeGen.CodeGenerator.Generate () [0x00000] in <b7d368a2667f4dca818a47370ae17a21>:0 
		  at Microsoft.CodeAnalysis.CSharp.MethodCompiler.GenerateMethodBody (Microsoft.CodeAnalysis.CSharp.Emit.PEModuleBuilder moduleBuilder, Microsoft.CodeAnalysis.CSharp.Symbols.MethodSymbol method, System.Int32 methodOrdinal, Microsoft.CodeAnalysis.CSharp.BoundStatement block, System.Collections.Immutable.ImmutableArray`1[T] lambdaDebugInfo, System.Collections.Immutable.ImmutableArray`1[T] closureDebugInfo, Microsoft.CodeAnalysis.CSharp.StateMachineTypeSymbol stateMachineTypeOpt, Microsoft.CodeAnalysis.CodeGen.VariableSlotAllocator variableSlotAllocatorOpt, Microsoft.CodeAnalysis.DiagnosticBag diagnostics, Microsoft.CodeAnalysis.CodeGen.DebugDocumentProvider debugDocumentProvider, Microsoft.CodeAnalysis.CSharp.ImportChain importChainOpt, System.Boolean emittingPdb, System.Boolean emitTestCoverageData, System.Collections.Immutable.ImmutableArray`1[T] dynamicAnalysisSpans) [0x000c3] in <b7d368a2667f4dca818a47370ae17a21>:0 
		  at Microsoft.CodeAnalysis.CSharp.MethodCompiler.CompileSynthesizedMethods (Microsoft.CodeAnalysis.CSharp.TypeCompilationState compilationState) [0x000fa] in <b7d368a2667f4dca818a47370ae17a21>:0 
		  at Microsoft.CodeAnalysis.CSharp.MethodCompiler.CompileNamedType (Microsoft.CodeAnalysis.CSharp.Symbols.NamedTypeSymbol containingType) [0x003da] in <b7d368a2667f4dca818a47370ae17a21>:0 
		  at Microsoft.CodeAnalysis.CSharp.MethodCompiler+<>c__DisplayClass21_0.<CompileNamedTypeAsTask>b__0 () [0x00000] in <b7d368a2667f4dca818a47370ae17a21>:0  ---> System.IndexOutOfRangeException: Index was outside the bounds of the array.
		  at System.Collections.Immutable.ImmutableArray`1+Builder[T].get_Item (System.Int32 index) [0x00009] in <36486b016d234fca8cd67892bf29c7b5>:0 
		  at Microsoft.CodeAnalysis.PooledObjects.ArrayBuilder`1[T].get_Item (System.Int32 index) [0x00000] in <b28b918e025b48209f28967b441780d7>:0 
		  at Microsoft.CodeAnalysis.CodeGen.ILBuilder.GetILOffsetFromMarker (System.Int32 ilMarker) [0x00000] in <b28b918e025b48209f28967b441780d7>:0 
		  at Microsoft.CodeAnalysis.CodeGen.ILBuilder.RealizeSequencePoints () [0x00029] in <b28b918e025b48209f28967b441780d7>:0 
		  at Microsoft.CodeAnalysis.CodeGen.ILBuilder.RealizeBlocks () [0x00201] in <b28b918e025b48209f28967b441780d7>:0 
		  at Microsoft.CodeAnalysis.CodeGen.ILBuilder.Realize () [0x0000d] in <b28b918e025b48209f28967b441780d7>:0 
		  at Microsoft.CodeAnalysis.CSharp.CodeGen.CodeGenerator.GenerateImpl () [0x0004f] in <b7d368a2667f4dca818a47370ae17a21>:0 
		  at Microsoft.CodeAnalysis.CSharp.CodeGen.CodeGenerator.Generate () [0x00000] in <b7d368a2667f4dca818a47370ae17a21>:0 
		  at Microsoft.CodeAnalysis.CSharp.MethodCompiler.GenerateMethodBody (Microsoft.CodeAnalysis.CSharp.Emit.PEModuleBuilder moduleBuilder, Microsoft.CodeAnalysis.CSharp.Symbols.MethodSymbol method, System.Int32 methodOrdinal, Microsoft.CodeAnalysis.CSharp.BoundStatement block, System.Collections.Immutable.ImmutableArray`1[T] lambdaDebugInfo, System.Collections.Immutable.ImmutableArray`1[T] closureDebugInfo, Microsoft.CodeAnalysis.CSharp.StateMachineTypeSymbol stateMachineTypeOpt, Microsoft.CodeAnalysis.CodeGen.VariableSlotAllocator variableSlotAllocatorOpt, Microsoft.CodeAnalysis.DiagnosticBag diagnostics, Microsoft.CodeAnalysis.CodeGen.DebugDocumentProvider debugDocumentProvider, Microsoft.CodeAnalysis.CSharp.ImportChain importChainOpt, System.Boolean emittingPdb, System.Boolean emitTestCoverageData, System.Collections.Immutable.ImmutableArray`1[T] dynamicAnalysisSpans) [0x000c3] in <b7d368a2667f4dca818a47370ae17a21>:0 
		  at Microsoft.CodeAnalysis.CSharp.MethodCompiler.CompileSynthesizedMethods (Microsoft.CodeAnalysis.CSharp.TypeCompilationState compilationState) [0x000fa] in <b7d368a2667f4dca818a47370ae17a21>:0 
		  at Microsoft.CodeAnalysis.CSharp.MethodCompiler.CompileNamedType (Microsoft.CodeAnalysis.CSharp.Symbols.NamedTypeSymbol containingType) [0x003da] in <b7d368a2667f4dca818a47370ae17a21>:0 
		  at Microsoft.CodeAnalysis.CSharp.MethodCompiler+<>c__DisplayClass21_0.<CompileNamedTypeAsTask>b__0 () [0x00000] in <b7d368a2667f4dca818a47370ae17a21>:0 
		   --- End of inner exception stack trace ---
		  at System.Environment.FailFast (System.String message, System.Exception exception) [0x00007] in <9253eee996774eb7bb0012c4a9fa9a20>:0 
		  at Microsoft.CodeAnalysis.FailFast.OnFatalException (System.Exception exception) [0x00038] in <b28b918e025b48209f28967b441780d7>:0 
		  at Microsoft.CodeAnalysis.FatalError.Report (System.Exception exception, System.Action`1[T] handler) [0x00080] in <b28b918e025b48209f28967b441780d7>:0 
		  at Microsoft.CodeAnalysis.FatalError.Report (System.Exception exception) [0x00000] in <b28b918e025b48209f28967b441780d7>:0 
		  at Microsoft.CodeAnalysis.FatalError.ReportUnlessCanceled (System.Exception exception) [0x0000a] in <b28b918e025b48209f28967b441780d7>:0 
		  at Microsoft.CodeAnalysis.CSharp.MethodCompiler+<>c__DisplayClass21_0.<CompileNamedTypeAsTask>b__0 () [0x0001c] in <b7d368a2667f4dca818a47370ae17a21>:0 
		  at Roslyn.Utilities.UICultureUtilities+<>c__DisplayClass5_0.<WithCurrentUICulture>b__0 () [0x00038] in <b28b918e025b48209f28967b441780d7>:0 
		  at System.Threading.Tasks.Task.InnerInvoke () [0x0000f] in <9253eee996774eb7bb0012c4a9fa9a20>:0 
		  at System.Threading.Tasks.Task.Execute () [0x00000] in <9253eee996774eb7bb0012c4a9fa9a20>:0 
		--- End of stack trace from previous location where exception was thrown ---
		  at Microsoft.CodeAnalysis.CSharp.MethodCompiler.WaitForWorkers () [0x00012] in <b7d368a2667f4dca818a47370ae17a21>:0 
		  at Microsoft.CodeAnalysis.CSharp.MethodCompiler.CompileMethodBodies (Microsoft.CodeAnalysis.CSharp.CSharpCompilation compilation, Microsoft.CodeAnalysis.CSharp.Emit.PEModuleBuilder moduleBeingBuiltOpt, System.Boolean emittingPdb, System.Boolean emitTestCoverageData, System.Boolean hasDeclarationErrors, Microsoft.CodeAnalysis.DiagnosticBag diagnostics, System.Predicate`1[T] filterOpt, System.Threading.CancellationToken cancellationToken) [0x00050] in <b7d368a2667f4dca818a47370ae17a21>:0 
		  at Microsoft.CodeAnalysis.CSharp.CSharpCompilation.CompileMethods (Microsoft.CodeAnalysis.Emit.CommonPEModuleBuilder moduleBuilder, System.Boolean emittingPdb, System.Boolean emitMetadataOnly, System.Boolean emitTestCoverageData, Microsoft.CodeAnalysis.DiagnosticBag diagnostics, System.Predicate`1[T] filterOpt, System.Threading.CancellationToken cancellationToken) [0x000aa] in <b7d368a2667f4dca818a47370ae17a21>:0 
		  at Microsoft.CodeAnalysis.CommonCompiler.CompileAndEmit (Microsoft.CodeAnalysis.TouchedFileLogger touchedFilesLogger, Microsoft.CodeAnalysis.Compilation& compilation, System.Collections.Immutable.ImmutableArray`1[T] analyzers, System.Collections.Immutable.ImmutableArray`1[T] additionalTextFiles, System.Collections.Immutable.ImmutableArray`1[T] embeddedTexts, Microsoft.CodeAnalysis.DiagnosticBag diagnostics, System.Threading.CancellationToken cancellationToken, System.Threading.CancellationTokenSource& analyzerCts, System.Boolean& reportAnalyzer, Microsoft.CodeAnalysis.Diagnostics.AnalyzerDriver& analyzerDriver) [0x00216] in <b28b918e025b48209f28967b441780d7>:0 
		  at Microsoft.CodeAnalysis.CommonCompiler.RunCore (System.IO.TextWriter consoleOutput, Microsoft.CodeAnalysis.ErrorLogger errorLogger, System.Threading.CancellationToken cancellationToken) [0x000ef] in <b28b918e025b48209f28967b441780d7>:0 
		  at Microsoft.CodeAnalysis.CommonCompiler.Run (System.IO.TextWriter consoleOutput, System.Threading.CancellationToken cancellationToken) [0x00035] in <b28b918e025b48209f28967b441780d7>:0 
		  at Microsoft.CodeAnalysis.CSharp.CommandLine.Csc+<>c__DisplayClass1_0.<Run>b__0 (System.IO.TextWriter tw) [0x00000] in <3853db4dce5d45189bea37fcfe62530b>:0 
		  at Microsoft.CodeAnalysis.CommandLine.ConsoleUtil.RunWithUtf8Output[T] (System.Boolean utf8Output, System.IO.TextWriter textWriter, System.Func`2[T,TResult] func) [0x00034] in <3853db4dce5d45189bea37fcfe62530b>:0 
		  at Microsoft.CodeAnalysis.CSharp.CommandLine.Csc.Run (System.String[] args, Microsoft.CodeAnalysis.BuildPaths buildPaths, System.IO.TextWriter textWriter, Microsoft.CodeAnalysis.IAnalyzerAssemblyLoader analyzerLoader) [0x00048] in <3853db4dce5d45189bea37fcfe62530b>:0 
		  at (wrapper delegate-invoke) <Module>.invoke_int_string[]_BuildPaths_TextWriter_IAnalyzerAssemblyLoader(string[],Microsoft.CodeAnalysis.BuildPaths,System.IO.TextWriter,Microsoft.CodeAnalysis.IAnalyzerAssemblyLoader)
		  at Microsoft.CodeAnalysis.CommandLine.DesktopBuildClient.RunLocalCompilation (System.String[] arguments, Microsoft.CodeAnalysis.BuildPaths buildPaths, System.IO.TextWriter textWriter) [0x00000] in <3853db4dce5d45189bea37fcfe62530b>:0 
		  at Microsoft.CodeAnalysis.CommandLine.BuildClient.RunCompilation (System.Collections.Generic.IEnumerable`1[T] originalArguments, Microsoft.CodeAnalysis.BuildPaths buildPaths, System.IO.TextWriter textWriter) [0x00098] in <3853db4dce5d45189bea37fcfe62530b>:0 
		  at Microsoft.CodeAnalysis.CommandLine.DesktopBuildClient.Run (System.Collections.Generic.IEnumerable`1[T] arguments, Microsoft.CodeAnalysis.CommandLine.RequestLanguage language, Microsoft.CodeAnalysis.CommandLine.CompileFunc compileFunc, Microsoft.CodeAnalysis.IAnalyzerAssemblyLoader analyzerAssemblyLoader) [0x00043] in <3853db4dce5d45189bea37fcfe62530b>:0 
		  at Microsoft.CodeAnalysis.CSharp.CommandLine.Program.MainCore (System.String[] args) [0x00006] in <3853db4dce5d45189bea37fcfe62530b>:0 
		  at Microsoft.CodeAnalysis.CSharp.CommandLine.Program.Main (System.String[] args) [0x00000] in <3853db4dce5d45189bea37fcfe62530b>:0 
/usr/local/lib/mono/xbuild/14.0/bin/Microsoft.CSharp.targets: error : Compiler crashed with code: 1.
	Task "Csc" execution -- FAILED
	Done building target "CoreCompile" in project "/wrkdirs/usr/ports/devel/newtonsoft-json/work/Newtonsoft.Json-9.0.1/Src/Newtonsoft.Json/Newtonsoft.Json.csproj".-- FAILED
Done building project "/wrkdirs/usr/ports/devel/newtonsoft-json/work/Newtonsoft.Json-9.0.1/Src/Newtonsoft.Json/Newtonsoft.Json.csproj".-- FAILED

Build FAILED.
Errors:

/wrkdirs/usr/ports/devel/newtonsoft-json/work/Newtonsoft.Json-9.0.1/Src/Newtonsoft.Json/Newtonsoft.Json.csproj (default targets) ->
/usr/local/lib/mono/xbuild/14.0/bin/Microsoft.CSharp.targets (CoreCompile target) ->

	/usr/local/lib/mono/xbuild/14.0/bin/Microsoft.CSharp.targets: error : Compiler crashed with code: 1.

	 0 Warning(s)
	 1 Error(s)

Time Elapsed 00:00:04.2188550
*** Error code 1

Stop.
make: stopped making "build" in /usr/ports/devel/newtonsoft-json