[package - 135releng-armv7-default][misc/shimmy] Failed for shimmy-1.5.6 in build
- Go to: [ bottom of page ] [ top of archives ] [ this month ]
Date: Fri, 03 Oct 2025 18:26:24 UTC
You are receiving this mail as a port that you maintain
is failing to build on the FreeBSD package build server.
Please investigate the failure and submit a PR to fix
build.
Maintainer: tagattie@FreeBSD.org
Log URL: https://pkg-status.freebsd.org/ampere3/data/135releng-armv7-default/fcc5efebc7d0/logs/shimmy-1.5.6.log
Build URL: https://pkg-status.freebsd.org/ampere3/build.html?mastername=135releng-armv7-default&build=fcc5efebc7d0
Log:
=>> Building misc/shimmy
build started at Fri Oct 3 18:19:42 -00 2025
port directory: /usr/ports/misc/shimmy
package name: shimmy-1.5.6
building for: FreeBSD 135releng-armv7-default-job-02 13.5-RELEASE-p4 FreeBSD 13.5-RELEASE-p4 1305000 arm
maintained by: tagattie@FreeBSD.org
Makefile datestamp: -rw-r--r-- 1 root wheel 1537 Sep 25 01:11 /usr/ports/misc/shimmy/Makefile
Ports top last git commit: fcc5efebc7d
Ports top unclean checkout: no
Port dir last git commit: 7c76adf6e21
Port dir unclean checkout: no
Poudriere version: poudriere-git-3.4.3
Host OSVERSION: 1600000
Jail OSVERSION: 1305000
Job Id: 02
---Begin Environment---
SHELL=/bin/csh
OSVERSION=1305000
UNAME_v=FreeBSD 13.5-RELEASE-p4 1305000
UNAME_r=13.5-RELEASE-p4
BLOCKSIZE=K
MAIL=/var/mail/root
MM_CHARSET=UTF-8
LANG=C.UTF-8
STATUS=1
HOME=/root
PATH=/sbin:/bin:/usr/sbin:/usr/bin:/usr/local/sbin:/usr/local/bin:/root/bin
MAKE_OBJDIR_CHECK_WRITABLE=0
LOCALBASE=/usr/local
USER=root
POUDRIERE_NAME=poudriere-git
LIBEXECPREFIX=/usr/local/libexec/poudriere
POUDRIERE_VERSION=3.4.3
MASTERMNT=/usr/local/poudriere/data/.m/135releng-armv7-default/ref
LC_COLLATE=C
POUDRIERE_BUILD_TYPE=bulk
PACKAGE_BUILDING=yes
SAVED_TERM=
OUTPUT_REDIRECTED_STDERR=4
OUTPUT_REDIRECTED=1
PWD=/usr/local/poudriere/data/.m/135releng-armv7-default/02/.p
OUTPUT_REDIRECTED_STDOUT=3
P_PORTS_FEATURES=FLAVORS SUBPACKAGES SELECTED_OPTIONS
MASTERNAME=135releng-armv7-default
SCRIPTPREFIX=/usr/local/share/poudriere
SCRIPTNAME=bulk.sh
OLDPWD=/usr/local/poudriere/data/.m/135releng-armv7-default/ref/.p/pool
POUDRIERE_PKGNAME=poudriere-git-3.4.3
SCRIPTPATH=/usr/local/share/poudriere/bulk.sh
POUDRIEREPATH=/usr/local/bin/poudriere
---End Environment---
---Begin Poudriere Port Flags/Env---
PORT_FLAGS=
PKGENV=
FLAVOR=
MAKE_ARGS=
---End Poudriere Port Flags/Env---
---Begin OPTIONS List---
===> The following configuration options are available for shimmy-1.5.6:
DOCS=on: Build and/or install documentation
VULKAN=on: Vulkan GPU support
===> Use 'make config' to modify these settings
---End OPTIONS List---
--MAINTAINER--
tagattie@FreeBSD.org
--End MAINTAINER--
--CONFIGURE_ARGS--
--End CONFIGURE_ARGS--
--CONFIGURE_ENV--
XDG_DATA_HOME=/wrkdirs/usr/ports/misc/shimmy/work XDG_CONFIG_HOME=/wrkdirs/usr/ports/misc/shimmy/work XDG_CACHE_HOME=/wrkdirs/usr/ports/misc/shimmy/work/.cache HOME=/wrkdirs/usr/ports/misc/shimmy/work TMPDIR="/wrkdirs/usr/ports/misc/shimmy/work" PATH=/wrkdirs/usr/ports/misc/shimmy/work/.bin:/sbin:/bin:/usr/sbin:/usr/bin:/usr/local/sbin:/usr/local/bin:/root/bin PKG_CONFIG_LIBDIR=/wrkdirs/usr/ports/misc/shimmy/work/.pkgconfig:/usr/local/libdata/pkgconfig:/usr/local/share/pkgconfig:/usr/libdata/pkgconfig SHELL=/bin/sh CONFIG_SHELL=/bin/sh CMAKE_PREFIX_PATH="/usr/local"
--End CONFIGURE_ENV--
--MAKE_ENV--
GGML_NATIVE=OFF XDG_DATA_HOME=/wrkdirs/usr/ports/misc/shimmy/work XDG_CONFIG_HOME=/wrkdirs/usr/ports/misc/shimmy/work XDG_CACHE_HOME=/wrkdirs/usr/ports/misc/shimmy/work/.cache HOME=/wrkdirs/usr/ports/misc/shimmy/work TMPDIR="/wrkdirs/usr/ports/misc/shimmy/work" PATH=/wrkdirs/usr/ports/misc/shimmy/work/.bin:/sbin:/bin:/usr/sbin:/usr/bin:/usr/local/sbin:/usr/local/bin:/root/bin PKG_CONFIG_LIBDIR=/wrkdirs/usr/ports/misc/shimmy/work/.pkgconfig:/usr/local/libdata/pkgconfig:/usr/local/share/pkgconfig:/usr/libdata/pkgconfig MK_DEBUG_FILES=no MK_KERNEL_SYMBOLS=no SHELL=/bin/sh NO_LINT=YES PREFIX=/usr/local LOCALBASE=/usr/local CC="/usr/local/llvm19/bin/clang" CFLAGS="-O2 -pipe -fstack-protector-strong -isystem /usr/local/include -fno-strict-aliasing " CPP="/usr/local/llvm19/bin/clang-cpp" CPPFLAGS="-isystem /usr/local/include" LDFLAGS=" -L/usr/local/lib " LIBS="" CXX="/usr/local/llvm19/bin/clang++" CXXFLAGS="-O2 -pipe -fstack-protector-strong -isystem /usr/local/include -fn
o-strict-aliasing -isystem /usr/local/include " BSD_INSTALL_PROGRAM="install -s -m 555" BSD_INSTALL_LIB="install -s -m 0644" BSD_INSTALL_SCRIPT="install -m 555" BSD_INSTALL_DATA="install -m 0644" BSD_INSTALL_MAN="install -m 444"
--End MAKE_ENV--
--PLIST_SUB--
PORTDOCS="" OSREL=13.5 PREFIX=%D LOCALBASE=/usr/local RESETPREFIX=/usr/local LIB32DIR=lib DOCSDIR="share/doc/shimmy" EXAMPLESDIR="share/examples/shimmy" DATADIR="share/shimmy" WWWDIR="www/shimmy" ETCDIR="etc/shimmy"
--End PLIST_SUB--
--SUB_LIST--
PREFIX=/usr/local LOCALBASE=/usr/local DATADIR=/usr/local/share/shimmy DOCSDIR=/usr/local/share/doc/shimmy EXAMPLESDIR=/usr/local/share/examples/shimmy WWWDIR=/usr/local/www/shimmy ETCDIR=/usr/local/etc/shimmy
--End SUB_LIST--
---Begin make.conf---
# XXX: We really need this but cannot use it while 'make checksum' does not
# try the next mirror on checksum failure. It currently retries the same
# failed mirror and then fails rather then trying another. It *does*
# try the next if the size is mismatched though.
#MASTER_SITE_FREEBSD=yes
# Build ALLOW_MAKE_JOBS_PACKAGES with 3 jobs
MAKE_JOBS_NUMBER=3
USE_PACKAGE_DEPENDS=yes
BATCH=yes
WRKDIRPREFIX=/wrkdirs
PORTSDIR=/usr/ports
PACKAGES=/packages
DISTDIR=/distfiles
PACKAGE_BUILDING=yes
PACKAGE_BUILDING_FLAVORS=yes
#### ####
# XXX: We really need this but cannot use it while 'make checksum' does not
# try the next mirror on checksum failure. It currently retries the same
# failed mirror and then fails rather then trying another. It *does*
# try the next if the size is mismatched though.
#MASTER_SITE_FREEBSD=yes
# Build ALLOW_MAKE_JOBS_PACKAGES with 3 jobs
MAKE_JOBS_NUMBER=3
#### Misc Poudriere ####
.include "/etc/make.conf.ports_env"
GID=0
UID=0
---End make.conf---
--Resource limits--
cpu time (seconds, -t) unlimited
file size (512-blocks, -f) unlimited
data seg size (kbytes, -d) 524288
stack size (kbytes, -s) 65536
core file size (512-blocks, -c) unlimited
max memory size (kbytes, -m) unlimited
locked memory (kbytes, -l) unlimited
max user processes (-u) 89999
open files (-n) 8192
virtual mem size (kbytes, -v) unlimited
swap limit (kbytes, -w) unlimited
socket buffer size (bytes, -b) unlimited
pseudo-terminals (-p) unlimited
kqueues (-k) unlimited
umtx shared locks (-o) unlimited
--End resource limits--
=======================<phase: check-sanity >============================
===== env: NO_DEPENDS=yes USER=root UID=0 GID=0
===> License MIT accepted by the user
===========================================================================
=======================<phase: pkg-depends >============================
===== env: USE_PACKAGE_DEPENDS_ONLY=1 USER=root UID=0 GID=0
===> shimmy-1.5.6 depends on file: /usr/local/sbin/pkg - not found
===> Installing existing package /packages/All/pkg-2.3.1.pkg
[135releng-armv7-default-job-02] Installing pkg-2.3.1...
[135releng-armv7-default-job-02] Extracting pkg-2.3.1: .......... done
===> shimmy-1.5.6 depends on file: /usr/local/sbin/pkg - found
===> Returning to build of shimmy-1.5.6
===========================================================================
=======================<phase: fetch-depends >============================
===== env: USE_PACKAGE_DEPENDS_ONLY=1 USER=root UID=0 GID=0
===========================================================================
=======================<phase: fetch >============================
===== env: NO_DEPENDS=yes USER=root UID=0 GID=0
===> License MIT accepted by the user
===> Fetching all distfiles required by shimmy-1.5.6 for building
===========================================================================
=======================<phase: checksum >============================
===== env: NO_DEPENDS=yes USER=root UID=0 GID=0
===> License MIT accepted by the user
===> Fetching all distfiles required by shimmy-1.5.6 for building
=> SHA256 Checksum OK for rust/crates/addr2line-0.24.2.crate.
=> SHA256 Checksum OK for rust/crates/adler2-2.0.1.crate.
=> SHA256 Checksum OK for rust/crates/aho-corasick-1.1.3.crate.
=> SHA256 Checksum OK for rust/crates/android_system_properties-0.1.5.crate.
=> SHA256 Checksum OK for rust/crates/anes-0.1.6.crate.
=> SHA256 Checksum OK for rust/crates/anstream-0.6.20.crate.
=> SHA256 Checksum OK for rust/crates/anstyle-1.0.11.crate.
=> SHA256 Checksum OK for rust/crates/anstyle-parse-0.2.7.crate.
=> SHA256 Checksum OK for rust/crates/anstyle-query-1.1.4.crate.
=> SHA256 Checksum OK for rust/crates/anstyle-wincon-3.0.10.crate.
=> SHA256 Checksum OK for rust/crates/anyhow-1.0.99.crate.
=> SHA256 Checksum OK for rust/crates/async-trait-0.1.89.crate.
=> SHA256 Checksum OK for rust/crates/atomic-waker-1.1.2.crate.
=> SHA256 Checksum OK for rust/crates/autocfg-1.5.0.crate.
=> SHA256 Checksum OK for rust/crates/axum-0.7.9.crate.
=> SHA256 Checksum OK for rust/crates/axum-core-0.4.5.crate.
=> SHA256 Checksum OK for rust/crates/backtrace-0.3.75.crate.
=> SHA256 Checksum OK for rust/crates/base64-0.21.7.crate.
=> SHA256 Checksum OK for rust/crates/base64-0.22.1.crate.
=> SHA256 Checksum OK for rust/crates/bindgen-0.72.1.crate.
=> SHA256 Checksum OK for rust/crates/bitflags-1.3.2.crate.
=> SHA256 Checksum OK for rust/crates/bitflags-2.9.4.crate.
=> SHA256 Checksum OK for rust/crates/block-buffer-0.10.4.crate.
=> SHA256 Checksum OK for rust/crates/bumpalo-3.19.0.crate.
=> SHA256 Checksum OK for rust/crates/byteorder-1.5.0.crate.
=> SHA256 Checksum OK for rust/crates/bytes-1.10.1.crate.
=> SHA256 Checksum OK for rust/crates/cast-0.3.0.crate.
=> SHA256 Checksum OK for rust/crates/cc-1.2.37.crate.
=> SHA256 Checksum OK for rust/crates/cexpr-0.6.0.crate.
=> SHA256 Checksum OK for rust/crates/cfg-if-1.0.3.crate.
=> SHA256 Checksum OK for rust/crates/chrono-0.4.42.crate.
=> SHA256 Checksum OK for rust/crates/ciborium-0.2.2.crate.
=> SHA256 Checksum OK for rust/crates/ciborium-io-0.2.2.crate.
=> SHA256 Checksum OK for rust/crates/ciborium-ll-0.2.2.crate.
=> SHA256 Checksum OK for rust/crates/clang-sys-1.8.1.crate.
=> SHA256 Checksum OK for rust/crates/clap-4.5.47.crate.
=> SHA256 Checksum OK for rust/crates/clap_builder-4.5.47.crate.
<snip>
CMAKE_TOOLCHAIN_FILE_armv7_unknown_freebsd = None
HOST_CMAKE_TOOLCHAIN_FILE = None
CMAKE_TOOLCHAIN_FILE = None
CMAKE_GENERATOR_armv7-unknown-freebsd = None
CMAKE_GENERATOR_armv7_unknown_freebsd = None
HOST_CMAKE_GENERATOR = None
CMAKE_GENERATOR = None
CMAKE_PREFIX_PATH_armv7-unknown-freebsd = None
CMAKE_PREFIX_PATH_armv7_unknown_freebsd = None
HOST_CMAKE_PREFIX_PATH = None
CMAKE_PREFIX_PATH = None
CMAKE_armv7-unknown-freebsd = None
CMAKE_armv7_unknown_freebsd = None
HOST_CMAKE = None
CMAKE = None
running: cd "/wrkdirs/usr/ports/misc/shimmy/work/target/release/build/llama-cpp-sys-2-c61f6111e68b6bfc/out/build" && CMAKE_PREFIX_PATH="" LC_ALL="C" "cmake" "/wrkdirs/usr/ports/misc/shimmy/work/llama-cpp-rs-5066492a156fa138e4e81210a48dd1d2099dbace/llama-cpp-sys-2/llama.cpp" "-DLLAMA_BUILD_TESTS=OFF" "-DLLAMA_BUILD_EXAMPLES=OFF" "-DLLAMA_BUILD_SERVER=OFF" "-DLLAMA_BUILD_TOOLS=OFF" "-DLLAMA_CURL=OFF" "-DCMAKE_BUILD_PARALLEL_LEVEL=32" "-DCMAKE_BUILD_TYPE=Release" "-DGGML_NATIVE=OFF" "-DBUILD_SHARED_LIBS=OFF" "-DGGML_VULKAN=ON" "-DGGML_OPENMP=OFF" "-DCMAKE_INSTALL_PREFIX=/wrkdirs/usr/ports/misc/shimmy/work/target/release/build/llama-cpp-sys-2-c61f6111e68b6bfc/out" "-DCMAKE_C_FLAGS= -ffunction-sections -fdata-sections -fPIC --target=armv7-unknown-freebsd-gnueabihf -pipe -fstack-protector-strong -isystem /usr/local/include -fno-strict-aliasing" "-DCMAKE_C_COMPILER=/usr/local/llvm19/bin/clang" "-DCMAKE_CXX_FLAGS= -ffunction-sections -fdata-sections -fPIC -stdlib=libc++ --target=a
rmv7-unknown-freebsd-gnueabihf -pipe -fstack-protector-strong -isystem /usr/local/include -fno-strict-aliasing -isystem /usr/local/include" "-DCMAKE_CXX_COMPILER=/usr/local/llvm19/bin/clang++" "-DCMAKE_ASM_FLAGS= -ffunction-sections -fdata-sections -fPIC --target=armv7-unknown-freebsd-gnueabihf -pipe -fstack-protector-strong -isystem /usr/local/include -fno-strict-aliasing" "-DCMAKE_ASM_COMPILER=/usr/local/llvm19/bin/clang"
-- The C compiler identification is Clang 19.1.7
-- The CXX compiler identification is Clang 19.1.7
-- Detecting C compiler ABI info
-- Detecting C compiler ABI info - done
-- Check for working C compiler: /usr/local/llvm19/bin/clang - skipped
-- Detecting C compile features
-- Detecting C compile features - done
-- Detecting CXX compiler ABI info
-- Detecting CXX compiler ABI info - done
-- Check for working CXX compiler: /usr/local/llvm19/bin/clang++ - skipped
-- Detecting CXX compile features
-- Detecting CXX compile features - done
-- Could NOT find Git (missing: GIT_EXECUTABLE)
-- Could NOT find Git (missing: GIT_EXECUTABLE)
-- Performing Test CMAKE_HAVE_LIBC_PTHREAD
-- Performing Test CMAKE_HAVE_LIBC_PTHREAD - Failed
-- Check if compiler accepts -pthread
-- Check if compiler accepts -pthread - yes
-- Found Threads: TRUE
-- Warning: ccache not found - consider installing it for faster compilation or disable this warning with GGML_CCACHE=OFF
-- CMAKE_SYSTEM_PROCESSOR: armv7
-- GGML_SYSTEM_ARCH: ARM
-- Including CPU backend
-- ARM detected
-- Performing Test GGML_COMPILER_SUPPORTS_FP16_FORMAT_I3E
-- Performing Test GGML_COMPILER_SUPPORTS_FP16_FORMAT_I3E - Failed
-- Adding CPU backend variant ggml-cpu:
-- Found Vulkan: /usr/local/lib/libvulkan.so (found version "1.4.322") found components: glslc missing components: glslangValidator
-- Vulkan found
-- GL_KHR_cooperative_matrix supported by glslc
-- GL_NV_cooperative_matrix2 supported by glslc
-- GL_EXT_integer_dot_product supported by glslc
-- GL_EXT_bfloat16 supported by glslc
-- Including Vulkan backend
-- ggml version: 0.0.0
-- ggml commit: unknown
-- Looking for pthread_create in pthreads
-- Looking for pthread_create in pthreads - not found
-- Looking for pthread_create in pthread
-- Looking for pthread_create in pthread - found
-- Configuring done (5.7s)
-- Generating done (0.1s)
-- Build files have been written to: /wrkdirs/usr/ports/misc/shimmy/work/target/release/build/llama-cpp-sys-2-c61f6111e68b6bfc/out/build
running: cd "/wrkdirs/usr/ports/misc/shimmy/work/target/release/build/llama-cpp-sys-2-c61f6111e68b6bfc/out/build" && LC_ALL="C" "cmake" "--build" "/wrkdirs/usr/ports/misc/shimmy/work/target/release/build/llama-cpp-sys-2-c61f6111e68b6bfc/out/build" "--target" "install" "--config" "Release" "--parallel" "3"
[ 1%] Building C object ggml/src/CMakeFiles/ggml-base.dir/ggml.c.o
[ 2%] Creating directories for 'vulkan-shaders-gen'
[ 3%] Building CXX object common/CMakeFiles/build_info.dir/build-info.cpp.o
[ 4%] No download step for 'vulkan-shaders-gen'
[ 4%] Built target build_info
[ 6%] Building CXX object ggml/src/CMakeFiles/ggml-base.dir/ggml.cpp.o
[ 7%] No update step for 'vulkan-shaders-gen'
[ 8%] No patch step for 'vulkan-shaders-gen'
[ 9%] Performing configure step for 'vulkan-shaders-gen'
-- The C compiler identification is Clang 19.1.7
-- The CXX compiler identification is Clang 19.1.7
-- Detecting C compiler ABI info
-- Detecting C compiler ABI info - done
-- Check for working C compiler: /usr/local/llvm19/bin/clang - skipped
-- Detecting C compile features
-- Detecting C compile features - done
-- Detecting CXX compiler ABI info
-- Detecting CXX compiler ABI info - done
-- Check for working CXX compiler: /usr/local/llvm19/bin/clang++ - skipped
-- Detecting CXX compile features
-- Detecting CXX compile features - done
-- Performing Test CMAKE_HAVE_LIBC_PTHREAD
-- Performing Test CMAKE_HAVE_LIBC_PTHREAD - Failed
-- Looking for pthread_create in pthreads
-- Looking for pthread_create in pthreads - not found
-- Looking for pthread_create in pthread
-- Looking for pthread_create in pthread - found
-- Found Threads: TRUE
-- Enabling coopmat glslc support
-- Enabling coopmat2 glslc support
-- Enabling dot glslc support
-- Enabling bfloat16 glslc support
-- Configuring done (3.4s)
-- Generating done (0.0s)
-- Build files have been written to: /wrkdirs/usr/ports/misc/shimmy/work/target/release/build/llama-cpp-sys-2-c61f6111e68b6bfc/out/build/ggml/src/ggml-vulkan/vulkan-shaders-gen-prefix/src/vulkan-shaders-gen-build
[ 11%] Performing build step for 'vulkan-shaders-gen'
[ 50%] Building CXX object CMakeFiles/vulkan-shaders-gen.dir/vulkan-shaders-gen.cpp.o
[ 12%] Building C object ggml/src/CMakeFiles/ggml-base.dir/ggml-alloc.c.o
[ 13%] Building CXX object ggml/src/CMakeFiles/ggml-base.dir/ggml-backend.cpp.o
[ 14%] Building CXX object ggml/src/CMakeFiles/ggml-base.dir/ggml-opt.cpp.o
[ 16%] Building CXX object ggml/src/CMakeFiles/ggml-base.dir/ggml-threading.cpp.o
[ 17%] Building C object ggml/src/CMakeFiles/ggml-base.dir/ggml-quants.c.o
[ 18%] Building CXX object ggml/src/CMakeFiles/ggml-base.dir/gguf.cpp.o
[100%] Linking CXX executable vulkan-shaders-gen
[100%] Built target vulkan-shaders-gen
[ 19%] Performing install step for 'vulkan-shaders-gen'
-- Installing: /wrkdirs/usr/ports/misc/shimmy/work/target/release/build/llama-cpp-sys-2-c61f6111e68b6bfc/out/build/Release/./vulkan-shaders-gen
[ 20%] Completed 'vulkan-shaders-gen'
[ 20%] Built target vulkan-shaders-gen
[ 22%] Linking CXX static library libggml-base.a
[ 22%] Built target ggml-base
[ 23%] Generate vulkan shaders
ggml_vulkan: Generating and compiling shaders to SPIR-V
[ 24%] Building C object ggml/src/CMakeFiles/ggml-cpu.dir/ggml-cpu/ggml-cpu.c.o
[ 25%] Building CXX object ggml/src/CMakeFiles/ggml-cpu.dir/ggml-cpu/ggml-cpu.cpp.o
[ 27%] Building CXX object ggml/src/CMakeFiles/ggml-cpu.dir/ggml-cpu/repack.cpp.o
[ 28%] Building CXX object ggml/src/CMakeFiles/ggml-cpu.dir/ggml-cpu/hbm.cpp.o
[ 29%] Building C object ggml/src/CMakeFiles/ggml-cpu.dir/ggml-cpu/quants.c.o
[ 30%] Building CXX object ggml/src/CMakeFiles/ggml-cpu.dir/ggml-cpu/traits.cpp.o
[ 32%] Building CXX object ggml/src/CMakeFiles/ggml-cpu.dir/ggml-cpu/amx/amx.cpp.o
[ 33%] Building CXX object ggml/src/CMakeFiles/ggml-cpu.dir/ggml-cpu/amx/mmq.cpp.o
[ 34%] Building CXX object ggml/src/CMakeFiles/ggml-cpu.dir/ggml-cpu/binary-ops.cpp.o
[ 35%] Building CXX object ggml/src/CMakeFiles/ggml-cpu.dir/ggml-cpu/unary-ops.cpp.o
[ 37%] Building CXX object ggml/src/CMakeFiles/ggml-cpu.dir/ggml-cpu/vec.cpp.o
[ 38%] Building CXX object ggml/src/CMakeFiles/ggml-cpu.dir/ggml-cpu/ops.cpp.o
[ 39%] Building CXX object ggml/src/CMakeFiles/ggml-cpu.dir/ggml-cpu/llamafile/sgemm.cpp.o
/wrkdirs/usr/ports/misc/shimmy/work/llama-cpp-rs-5066492a156fa138e4e81210a48dd1d2099dbace/llama-cpp-sys-2/llama.cpp/ggml/src/ggml-cpu/llamafile/sgemm.cpp:243:12: error: use of undeclared identifier 'vld1q_f16'
243 | return vld1q_f16((const float16_t *)p);
| ^
/wrkdirs/usr/ports/misc/shimmy/work/llama-cpp-rs-5066492a156fa138e4e81210a48dd1d2099dbace/llama-cpp-sys-2/llama.cpp/ggml/src/ggml-cpu/llamafile/sgemm.cpp:246:25: error: use of undeclared identifier 'vld1_f16'
246 | return vcvt_f32_f16(vld1_f16((const float16_t *)p));
| ^
2 errors generated.
--- ggml/src/CMakeFiles/ggml-cpu.dir/ggml-cpu/llamafile/sgemm.cpp.o ---
*** [ggml/src/CMakeFiles/ggml-cpu.dir/ggml-cpu/llamafile/sgemm.cpp.o] Error code 1
make[2]: stopped in /wrkdirs/usr/ports/misc/shimmy/work/target/release/build/llama-cpp-sys-2-c61f6111e68b6bfc/out/build
1 error
make[2]: stopped in /wrkdirs/usr/ports/misc/shimmy/work/target/release/build/llama-cpp-sys-2-c61f6111e68b6bfc/out/build
--- ggml/src/CMakeFiles/ggml-cpu.dir/all ---
*** [ggml/src/CMakeFiles/ggml-cpu.dir/all] Error code 2
make[1]: stopped in /wrkdirs/usr/ports/misc/shimmy/work/target/release/build/llama-cpp-sys-2-c61f6111e68b6bfc/out/build
--- ggml/src/ggml-vulkan/CMakeFiles/ggml-vulkan.dir/all ---
*** [ggml/src/ggml-vulkan/CMakeFiles/ggml-vulkan.dir/all] Error code 6
make[1]: stopped in /wrkdirs/usr/ports/misc/shimmy/work/target/release/build/llama-cpp-sys-2-c61f6111e68b6bfc/out/build
2 errors
make[1]: stopped in /wrkdirs/usr/ports/misc/shimmy/work/target/release/build/llama-cpp-sys-2-c61f6111e68b6bfc/out/build
*** [all] Error code 2
make: stopped in /wrkdirs/usr/ports/misc/shimmy/work/target/release/build/llama-cpp-sys-2-c61f6111e68b6bfc/out/build
make: stopped in /wrkdirs/usr/ports/misc/shimmy/work/target/release/build/llama-cpp-sys-2-c61f6111e68b6bfc/out/build
--- stderr
CMake Warning at cmake/build-info.cmake:14 (message):
Git not found. Build info will not be accurate.
Call Stack (most recent call first):
CMakeLists.txt:89 (include)
CMake Warning at common/CMakeLists.txt:32 (message):
Git repository not found; to enable automatic generation of build info,
make sure Git is installed and the project is a Git repository.
CMake Warning:
Manually-specified variables were not used by the project:
CMAKE_ASM_COMPILER
CMAKE_ASM_FLAGS
CMAKE_BUILD_PARALLEL_LEVEL
1 error
thread 'main' panicked at /wrkdirs/usr/ports/misc/shimmy/work/shimmy-1.5.6/cargo-crates/cmake-0.1.54/src/lib.rs:1119:5:
command did not execute successfully, got: exit status: 2
build script failed, must exit now
stack backtrace:
0: __rustc::rust_begin_unwind
1: core::panicking::panic_fmt
2: cmake::fail
3: cmake::run
4: cmake::Config::build
5: build_script_build::main
6: core::ops::function::FnOnce::call_once
note: Some details are omitted, run with `RUST_BACKTRACE=full` for a verbose backtrace.
warning: build failed, waiting for other jobs to finish...
warning: `axum` (lib) generated 1 warning (1 duplicate)
warning: `minijinja` (lib) generated 1 warning (1 duplicate)
*** Error code 101
Stop.
make: stopped in /usr/ports/misc/shimmy