[package - 135amd64-quarterly][print/lilypond-devel] Failed for lilypond-devel-2.25.27 in build

From: <pkg-fallout_at_FreeBSD.org>
Date: Sun, 09 Nov 2025 03:40:59 UTC
You are receiving this mail as a port that you maintain
is failing to build on the FreeBSD package build server.
Please investigate the failure and submit a PR to fix
build.

Maintainer:     m.ne@gmx.net
Log URL:        https://pkg-status.freebsd.org/beefy14/data/135amd64-quarterly/1b401e77fe72/logs/lilypond-devel-2.25.27.log
Build URL:      https://pkg-status.freebsd.org/beefy14/build.html?mastername=135amd64-quarterly&build=1b401e77fe72
Log:

=>> Building print/lilypond-devel
build started at Sun Nov  9 03:32:07 -00 2025
port directory: /usr/ports/print/lilypond-devel
package name: lilypond-devel-2.25.27
building for: FreeBSD 135amd64-quarterly-job-07 13.5-RELEASE-p6 FreeBSD 13.5-RELEASE-p6 amd64
maintained by: m.ne@gmx.net
Makefile datestamp: -rw-r--r--  1 root  wheel  2153 Oct  4 01:02 /usr/ports/print/lilypond-devel/Makefile
Ports top last git commit: 1b401e77f
Ports top unclean checkout: no
Port dir last git commit: ff3cbc27e
Port dir unclean checkout: no
Poudriere version: poudriere-git-3.4.4
Host OSVERSION: 1600000
Jail OSVERSION: 1305000
Job Id: 07

---Begin Environment---
SHELL=/bin/csh
OSVERSION=1305000
UNAME_v=FreeBSD 13.5-RELEASE-p6
UNAME_r=13.5-RELEASE-p6
BLOCKSIZE=K
MAIL=/var/mail/root
MM_CHARSET=UTF-8
LANG=C.UTF-8
STATUS=1
HOME=/root
PATH=/sbin:/bin:/usr/sbin:/usr/bin:/usr/local/sbin:/usr/local/bin:/root/bin
MAKE_OBJDIR_CHECK_WRITABLE=0
LOCALBASE=/usr/local
USER=root
POUDRIERE_NAME=poudriere-git
LIBEXECPREFIX=/usr/local/libexec/poudriere
POUDRIERE_VERSION=3.4.4
MASTERMNT=/usr/local/poudriere/data/.m/135amd64-quarterly/ref
LC_COLLATE=C
POUDRIERE_BUILD_TYPE=bulk
PACKAGE_BUILDING=yes
SAVED_TERM=
OUTPUT_REDIRECTED_STDERR=4
OUTPUT_REDIRECTED=1
PWD=/usr/local/poudriere/data/.m/135amd64-quarterly/07/.p
OUTPUT_REDIRECTED_STDOUT=3
P_PORTS_FEATURES=FLAVORS SUBPACKAGES SELECTED_OPTIONS
MASTERNAME=135amd64-quarterly
SCRIPTPREFIX=/usr/local/share/poudriere
SCRIPTNAME=bulk.sh
OLDPWD=/usr/local/poudriere/data/.m/135amd64-quarterly/ref/.p/pool
POUDRIERE_PKGNAME=poudriere-git-3.4.4
SCRIPTPATH=/usr/local/share/poudriere/bulk.sh
POUDRIEREPATH=/usr/local/bin/poudriere
---End Environment---

---Begin Poudriere Port Flags/Env---
PORT_FLAGS=
PKGENV=
FLAVOR=
MAKE_ARGS=
---End Poudriere Port Flags/Env---

---Begin OPTIONS List---
===> The following configuration options are available for lilypond-devel-2.25.27:
     NLS=on: Native Language Support
====> Guile extension language support: you have to select exactly one of them
     GUILE2=off: Use guile2
     GUILE3=on: Use guile3
===> Use 'make config' to modify these settings
---End OPTIONS List---

--MAINTAINER--
m.ne@gmx.net
--End MAINTAINER--

--CONFIGURE_ARGS--
--prefix=/usr/local ${_LATE_CONFIGURE_ARGS}
--End CONFIGURE_ARGS--

--CONFIGURE_ENV--
ac_cv_prog_MAKEINFO="/usr/local/bin/makeinfo"  FLEX=/usr/bin/flex  GUILE_FLAVOR=guile-3.0  HOME=/wrkdirs/usr/ports/print/lilypond-devel/work  YACC=yacc MAKE=/usr/local/bin/gmake ac_cv_path_PERL=/usr/local/bin/perl ac_cv_path_PERL_PATH=/usr/local/bin/perl  PERL_USE_UNSAFE_INC=1 PKG_CONFIG=pkgconf PYTHON="/usr/local/bin/python3.11" GUILE=/usr/local/bin/guile-3.0 GUILE_SNARF=/usr/local/bin/guile-snarf-3.0 GUILE_CONFIG=/usr/local/bin/guile-config-3.0 GUILE_TOOLS=/usr/local/bin/guile-tools-3.0 GUILD=/usr/local/bin/guild-3.0 GUILE_EFFECTIVE_VERSION=3.0 XDG_DATA_HOME=/wrkdirs/usr/ports/print/lilypond-devel/work  XDG_CONFIG_HOME=/wrkdirs/usr/ports/print/lilypond-devel/work  XDG_CACHE_HOME=/wrkdirs/usr/ports/print/lilypond-devel/work/.cache  HOME=/wrkdirs/usr/ports/print/lilypond-devel/work TMPDIR="/tmp" PATH=/wrkdirs/usr/ports/print/lilypond-devel/work/.bin:/sbin:/bin:/usr/sbin:/usr/bin:/usr/local/sbin:/usr/local/bin:/root/bin PKG_CONFIG_LIBDIR=/wrkdirs/usr/ports/print/lilypond-deve
l/work/.pkgconfig:/usr/local/libdata/pkgconfig:/usr/local/share/pkgconfig:/usr/libdata/pkgconfig SHELL=/bin/sh CONFIG_SHELL=/bin/sh PKG_CONFIG_PATH=/usr/local/libdata/pkgconfig/guile/3.0 CONFIG_SITE=/usr/ports/Templates/config.site lt_cv_sys_max_cmd_len=524288
--End CONFIGURE_ENV--

--MAKE_ENV--
PERL_USE_UNSAFE_INC=1 GUILE=/usr/local/bin/guile-3.0 GUILE_SNARF=/usr/local/bin/guile-snarf-3.0 GUILE_CONFIG=/usr/local/bin/guile-config-3.0 GUILE_TOOLS=/usr/local/bin/guile-tools-3.0 GUILD=/usr/local/bin/guild-3.0 XDG_DATA_HOME=/wrkdirs/usr/ports/print/lilypond-devel/work  XDG_CONFIG_HOME=/wrkdirs/usr/ports/print/lilypond-devel/work  XDG_CACHE_HOME=/wrkdirs/usr/ports/print/lilypond-devel/work/.cache  HOME=/wrkdirs/usr/ports/print/lilypond-devel/work TMPDIR="/tmp" PATH=/wrkdirs/usr/ports/print/lilypond-devel/work/.bin:/sbin:/bin:/usr/sbin:/usr/bin:/usr/local/sbin:/usr/local/bin:/root/bin PKG_CONFIG_LIBDIR=/wrkdirs/usr/ports/print/lilypond-devel/work/.pkgconfig:/usr/local/libdata/pkgconfig:/usr/local/share/pkgconfig:/usr/libdata/pkgconfig MK_DEBUG_FILES=no MK_KERNEL_SYMBOLS=no SHELL=/bin/sh NO_LINT=YES PKG_CONFIG_PATH=/usr/local/libdata/pkgconfig/guile/3.0 PREFIX=/usr/local  LOCALBASE=/usr/local  CC="cc" CFLAGS="-O2 -pipe  -fstack-protector-strong -fno-strict-aliasing "  CPP=
"cpp" CPPFLAGS=""  LDFLAGS=" " LIBS=""  CXX="c++" CXXFLAGS="-O2 -pipe  -fstack-protector-strong -fno-strict-aliasing   -std=c++17 " CXXSTD=c++17 BSD_INSTALL_PROGRAM="install  -s -m 555"  BSD_INSTALL_LIB="install  -s -m 0644"  BSD_INSTALL_SCRIPT="install  -m 555"  BSD_INSTALL_DATA="install  -m 0644"  BSD_INSTALL_MAN="install  -m 444"
--End MAKE_ENV--

--PLIST_SUB--
DISTVERSION=2.25.27 GUILE2="@comment " NO_GUILE2="" GUILE3="" NO_GUILE3="@comment " NLS="" NO_NLS="@comment " GTK2_VERSION="2.10.0"  GTK3_VERSION="3.0.0"  GTK4_VERSION="4.0.0" PYTHON_INCLUDEDIR=include/python3.11  PYTHON_LIBDIR=lib/python3.11  PYTHON_PLATFORM=freebsd13  PYTHON_SITELIBDIR=lib/python3.11/site-packages  PYTHON_SUFFIX=311  PYTHON_BASESUFFIX=311  PYTHON_TAG=.cpython-311  PYTHON_SOABI=.cpython-311  PYTHON_VER=3.11  PYTHON_BASEVER=3.11  PYTHON_VERSION=python3.11 PYTHON2="@comment " PYTHON3="" GUILE_VER=3.0 GUILE_SFX=3  GUILE_SITE=share/guile/site/3.0  GUILE_GLOBAL_SITE=share/guile/site  GUILE_SITE_CCACHE=lib/guile/3.0/site-ccache  GUILE_DOCS=share/doc/guile30  GUILE_EXAMPLES=share/examples/guile30 GUILE_PKGCONFIG_DIR=libdata/pkgconfig/guile/3.0 OSREL=13.5 PREFIX=%D LOCALBASE=/usr/local  RESETPREFIX=/usr/local LIB32DIR=lib PERL_VERSION=5.42.0  PERL_VER=5.42  PERL5_MAN1=lib/perl5/site_perl/man/man1  PERL5_MAN3=lib/perl5/site_perl/man/man3  SITE_PERL=lib/perl5/site_pe
rl  SITE_ARCH=lib/perl5/site_perl/mach/5.42 DOCSDIR="share/doc/lilypond"  EXAMPLESDIR="share/examples/lilypond"  DATADIR="share/lilypond"  WWWDIR="www/lilypond"  ETCDIR="etc/lilypond"
--End PLIST_SUB--

--SUB_LIST--
 GUILE2="@comment " NO_GUILE2="" GUILE3="" NO_GUILE3="@comment " NLS="" NO_NLS="@comment " PYTHON_INCLUDEDIR=/usr/local/include/python3.11  PYTHON_LIBDIR=/usr/local/lib/python3.11  PYTHON_PLATFORM=freebsd13  PYTHON_SITELIBDIR=/usr/local/lib/python3.11/site-packages  PYTHON_SUFFIX=311  PYTHON_BASESUFFIX=311  PYTHON_TAG=.cpython-311  PYTHON_SOABI=.cpython-311  PYTHON_VER=3.11  PYTHON_BASEVER=3.11  PYTHON_VERSION=python3.11 PYTHON2="@comment " PYTHON3="" PREFIX=/usr/local LOCALBASE=/usr/local  DATADIR=/usr/local/share/lilypond DOCSDIR=/usr/local/share/doc/lilypond EXAMPLESDIR=/usr/local/share/examples/lilypond  WWWDIR=/usr/local/www/lilypond ETCDIR=/usr/local/etc/lilypond
--End SUB_LIST--

---Begin make.conf---
USE_PACKAGE_DEPENDS=yes
BATCH=yes
WRKDIRPREFIX=/wrkdirs
PORTSDIR=/usr/ports
PACKAGES=/packages
DISTDIR=/distfiles
PACKAGE_BUILDING=yes
PACKAGE_BUILDING_FLAVORS=yes
####  ####
# XXX: We really need this but cannot use it while 'make checksum' does not
# try the next mirror on checksum failure.  It currently retries the same
# failed mirror and then fails rather then trying another.  It *does*
# try the next if the size is mismatched though.
#MASTER_SITE_FREEBSD=yes
# Build ALLOW_MAKE_JOBS_PACKAGES with 3 jobs
MAKE_JOBS_NUMBER=3
#### Misc Poudriere ####
.include "/etc/make.conf.ports_env"
GID=0
UID=0
---End make.conf---
--Resource limits--
cpu time               (seconds, -t)  unlimited
file size           (512-blocks, -f)  unlimited
data seg size           (kbytes, -d)  33554432
stack size              (kbytes, -s)  524288
core file size      (512-blocks, -c)  unlimited
max memory size         (kbytes, -m)  unlimited
locked memory           (kbytes, -l)  unlimited
max user processes              (-u)  89999
open files                      (-n)  8192
virtual mem size        (kbytes, -v)  unlimited
swap limit              (kbytes, -w)  unlimited
socket buffer size       (bytes, -b)  unlimited
pseudo-terminals                (-p)  unlimited
kqueues                         (-k)  unlimited
umtx shared locks               (-o)  unlimited
--End resource limits--
=======================<phase: check-sanity   >============================
===== env: NO_DEPENDS=yes USER=root UID=0 GID=0
===>  License GPLv3 accepted by the user
===========================================================================
=======================<phase: pkg-depends    >============================
===== env: USE_PACKAGE_DEPENDS_ONLY=1 USER=root UID=0 GID=0
===>   lilypond-devel-2.25.27 depends on file: /usr/local/sbin/pkg - not found
===>   Installing existing package /packages/All/pkg-2.4.2.pkg
[135amd64-quarterly-job-07] Installing pkg-2.4.2...
[135amd64-quarterly-job-07] Extracting pkg-2.4.2: .......... done
===>   lilypond-devel-2.25.27 depends on file: /usr/local/sbin/pkg - found
===>   Returning to build of lilypond-devel-2.25.27
===========================================================================
=======================<phase: fetch-depends  >============================
===== env: USE_PACKAGE_DEPENDS_ONLY=1 USER=root UID=0 GID=0
===========================================================================
=======================<phase: fetch          >============================
===== env: NO_DEPENDS=yes USER=root UID=0 GID=0
===>  License GPLv3 accepted by the user
===> Fetching all distfiles required by lilypond-devel-2.25.27 for building
===========================================================================
=======================<phase: checksum       >============================
===== env: NO_DEPENDS=yes USER=root UID=0 GID=0
===>  License GPLv3 accepted by the user
===> Fetching all distfiles required by lilypond-devel-2.25.27 for building
=> SHA256 Checksum OK for lilypond-2.25.27.tar.gz.
===========================================================================
=======================<phase: extract-depends>============================
===== env: USE_PACKAGE_DEPENDS_ONLY=1 USER=root UID=0 GID=0
===========================================================================
=======================<phase: extract        >============================
===== env: NO_DEPENDS=yes USER=root UID=0 GID=0
===>  License GPLv3 accepted by the user
===> Fetching all distfiles required by lilypond-devel-2.25.27 for building
===>  Extracting for lilypond-devel-2.25.27
=> SHA256 Checksum OK for lilypond-2.25.27.tar.gz.
===========================================================================
=======================<phase: patch-depends  >============================
===== env: USE_PACKAGE_DEPENDS_ONLY=1 USER=root UID=0 GID=0
===========================================================================
=======================<phase: patch          >============================
===== env: NO_DEPENDS=yes USER=root UID=0 GID=0
===>  Patching for lilypond-devel-2.25.27
===>  Applying FreeBSD patches for lilypond-devel-2.25.27 from /usr/ports/print/lilypond-devel/files
===========================================================================
=======================<phase: build-depends  >============================
===== env: USE_PACKAGE_DEPENDS_ONLY=1 USER=root UID=0 GID=0
===>   lilypond-devel-2.25.27 depends on executable: bash - not found
===>   Installing existing package /packages/All/bash-5.3.3_2.pkg
[135amd64-quarterly-job-07] Installing bash-5.3.3_2...
[135amd64-quarterly-job-07] `-- Installing gettext-runtime-0.23.1...
[135amd64-quarterly-job-07] |   `-- Installing indexinfo-0.3.1_1...
[135amd64-quarterly-job-07] |   `-- Extracting indexinfo-0.3.1_1: .... done
[135amd64-quarterly-job-07] `-- Extracting gettext-runtime-0.23.1: .......... done
[135amd64-quarterly-job-07] Extracting bash-5.3.3_2: .......... done
===>   lilypond-devel-2.25.27 depends on executable: bash - found
===>   Returning to build of lilypond-devel-2.25.27
===>   lilypond-devel-2.25.27 depends on executable: dblatex - not found
===>   Installing existing package /packages/All/dblatex-0.3.12_1.pkg
[135amd64-quarterly-job-07] Installing dblatex-0.3.12_1...
[135amd64-quarterly-job-07] `-- Installing docbook-xml-5.0_3...
[135amd64-quarterly-job-07] |   `-- Installing xmlcatmgr-2.2_4...
[135amd64-quarterly-job-07] |   `-- Extracting xmlcatmgr-2.2_4: ......... done
 + Creating /usr/local/share/sgml/catalog
 + Registering CATALOG catalog.ports (SGML)
 + Creating /usr/local/share/sgml/catalog.ports
 + Creating /usr/local/share/xml/catalog
<snip>
      |                            ^
/usr/include/FlexLexer.h:134:20: warning: 'yy_create_buffer' overrides a member function but is not marked 'override' [-Wsuggest-override]
  134 |   yy_buffer_state* yy_create_buffer( std::istream& s, int size );
      |                    ^
/usr/include/FlexLexer.h:69:28: note: overridden virtual function is here
   69 |   virtual yy_buffer_state* yy_create_buffer( std::istream& s, int size ) = 0;
      |                            ^
/usr/include/FlexLexer.h:135:8: warning: 'yy_delete_buffer' overrides a member function but is not marked 'override' [-Wsuggest-override]
  135 |   void yy_delete_buffer( yy_buffer_state* b );
      |        ^
/usr/include/FlexLexer.h:70:16: note: overridden virtual function is here
   70 |   virtual void yy_delete_buffer( yy_buffer_state* b ) = 0;
      |                ^
/usr/include/FlexLexer.h:136:8: warning: 'yyrestart' overrides a member function but is not marked 'override' [-Wsuggest-override]
  136 |   void yyrestart( std::istream* s );
      |        ^
/usr/include/FlexLexer.h:71:16: note: overridden virtual function is here
   71 |   virtual void yyrestart( std::istream* s ) = 0;
      |                ^
/usr/include/FlexLexer.h:137:8: warning: 'yyrestart' overrides a member function but is not marked 'override' [-Wsuggest-override]
  137 |   void yyrestart( std::istream& s );
      |        ^
/usr/include/FlexLexer.h:72:16: note: overridden virtual function is here
   72 |   virtual void yyrestart( std::istream& s ) = 0;
      |                ^
/usr/include/FlexLexer.h:142:15: warning: 'yylex' overrides a member function but is not marked 'override' [-Wsuggest-override]
  142 |   virtual int yylex();
      |               ^
/usr/include/FlexLexer.h:74:15: note: overridden virtual function is here
   74 |   virtual int yylex() = 0;
      |               ^
/usr/include/FlexLexer.h:143:16: warning: 'switch_streams' overrides a member function but is not marked 'override' [-Wsuggest-override]
  143 |   virtual void switch_streams( std::istream& new_in, std::ostream& new_out );
      |                ^
/usr/include/FlexLexer.h:93:16: note: overridden virtual function is here
   93 |   virtual void switch_streams( std::istream& new_in,
      |                ^
/usr/include/FlexLexer.h:144:16: warning: 'switch_streams' overrides a member function but is not marked 'override' [-Wsuggest-override]
  144 |   virtual void switch_streams( std::istream* new_in = 0, std::ostream* new_out = 0 );
      |                ^
/usr/include/FlexLexer.h:91:16: note: overridden virtual function is here
   91 |   virtual void switch_streams( std::istream* new_in,
      |                ^
Making lily/out/accidental-placement.o < cc
Making lily/out/accidental.o < cc
9 warnings generated.
Making lily/out/align-interface.o < cc
Making lily/out/all-font-metrics-scheme.o < cc
Making lily/out/all-font-metrics.o < cc
Making lily/out/alternative-sequence-iterator.o < cc
Making lily/out/ambitus-engraver.o < cc
Making lily/out/apply-context-iterator.o < cc
Making lily/out/arpeggio-engraver.o < cc
Making lily/out/arpeggio.o < cc
Making lily/out/articulations.o < cc
Making lily/out/audio-column.o < cc
Making lily/out/audio-element-info.o < cc
Making lily/out/audio-element.o < cc
Making lily/out/audio-item.o < cc
Making lily/out/audio-staff.o < cc
Making lily/out/auto-beam-engraver.o < cc
Making lily/out/axis-group-engraver.o < cc
Making lily/out/axis-group-interface-scheme.o < cc
Making lily/out/axis-group-interface.o < cc
Making lily/out/balloon-engraver.o < cc
Making lily/out/balloon.o < cc
Making lily/out/bar-engraver.o < cc
Making lily/out/bar-number-engraver.o < cc
Making lily/out/beam-collision-engraver.o < cc
Making lily/out/beam-engraver.o < cc
Making lily/out/beam-performer.o < cc
Making lily/out/beam-quanting.o < cc
Making lily/out/beam.o < cc
Making lily/out/beaming-pattern.o < cc
Making lily/out/bezier-bow.o < cc
Making lily/out/bezier-scheme.o < cc
Making lily/out/bezier.o < cc
Making lily/out/book-scheme.o < cc
Making lily/out/book.o < cc
Making lily/out/box.o < cc
Making lily/out/bracket.o < cc
Making lily/out/break-align-engraver.o < cc
Making lily/out/break-alignment-interface.o < cc
Making lily/out/break-substitution.o < cc
Making lily/out/breathing-sign.o < cc
Making lily/out/caesura-engraver.o < cc
Making lily/out/cairo.o < cc
Making lily/out/calculated-sequential-music.o < cc
cairo.cc:383:13: warning: cast from 'FT_Error (*)(FT_Face)' (aka 'int (*)(FT_FaceRec_ *)') to 'cairo_destroy_func_t' (aka 'void (*)(void *)') converts to incompatible function type [-Wcast-function-type-mismatch]
  383 |             reinterpret_cast<cairo_destroy_func_t> (FT_Done_Face)))
      |             ^~~~~~~~~~~~~~~~~~~~~~~~~~~~~~~~~~~~~~~~~~~~~~~~~~~~~
Making lily/out/change-iterator.o < cc
Making lily/out/chord-name.o < cc
PLEASE submit a bug report to https://bugs.freebsd.org/submit/ and include the crash backtrace, preprocessed source, and associated run script.
Stack dump:
0.	Program arguments: c++ -c -DHAVE_CONFIG_H -I/wrkdirs/usr/ports/print/lilypond-devel/work/lilypond-2.25.27/lily/include -I./out -I/wrkdirs/usr/ports/print/lilypond-devel/work/lilypond-2.25.27/flower/include -O2 -pipe -fstack-protector-strong -fno-strict-aliasing -std=c++17 -O2 -finline-functions -g -pipe -Wno-cast-function-type -isystem/usr/local/include/guile/3.0 -isystem/usr/local -isystem/usr/local/include -D_THREAD_SAFE -pthread -isystem/usr/local/include -isystem/usr/local/include/freetype2 -isystem/usr/local/include/libpng16 -isystem/usr/local/include -isystem/usr/local/include/pango-1.0 -isystem/usr/local/include -pthread -isystem/usr/local/include/fribidi -isystem/usr/local/include/cairo -D_THREAD_SAFE -isystem/usr/local/include/pixman-1 -isystem/usr/local/include/harfbuzz -isystem/usr/local/include/freetype2 -isystem/usr/local/include/libpng16 -isystem/usr/local/include/glib-2.0 -isystem/usr/local/lib/glib-2.0/include -isystem/usr/local/include/cairo -isystem/usr/
local/include -isystem/usr/local/include/freetype2 -isystem/usr/local/include/libpng16 -D_THREAD_SAFE -isystem/usr/local/include/pixman-1 -isystem/usr/local/include/libpng16 -std=c++17 -fno-exceptions -Wall -Wconversion -Wno-sign-conversion -Wextra -Wold-style-cast -Woverloaded-virtual -Wsuggest-override -MMD -MP -MF ./out/chord-name.dep -MT ./out/chord-name.o -O2 -pipe -fstack-protector-strong -fno-strict-aliasing -std=c++17 -o out/chord-name.o chord-name.cc
1.	/usr/include/c++/v1/__algorithm/unique.h:41:59: current parser token ')'
2.	/usr/include/c++/v1/__algorithm/unique.h:27:1 <Spelling=/usr/include/c++/v1/__config:617:39>: parsing namespace 'std'
3.	/usr/include/c++/v1/__algorithm/unique.h:27:1 <Spelling=/usr/include/c++/v1/__config:618:39>: parsing namespace 'std::__1'
4.	/usr/include/c++/v1/__algorithm/unique.h:33:66: parsing function body 'std::__unique'
5.	/usr/include/c++/v1/__algorithm/unique.h:33:66: in compound statement ('{}')
6.	/usr/include/c++/v1/__algorithm/unique.h:35:26: in compound statement ('{}')
 #0 0x00000000055395b1 (/usr/bin/c+++0x55395b1)
 #1 0x0000000005537565 (/usr/bin/c+++0x5537565)
 #2 0x0000000005503628 (/usr/bin/c+++0x5503628)
 #3 0x000000082b106310 (/lib/libthr.so.3+0x1a310)
 #4 0x000000082b1058db (/lib/libthr.so.3+0x198db)
 #5 0x00000008278d52d3 ([vdso]+0x2d3)
 #6 0x00000000025daf20 (/usr/bin/c+++0x25daf20)
 #7 0x00000000025b7424 (/usr/bin/c+++0x25b7424)
 #8 0x0000000003d3def7 (/usr/bin/c+++0x3d3def7)
 #9 0x0000000003d3e4ee (/usr/bin/c+++0x3d3e4ee)
#10 0x0000000003d069c9 (/usr/bin/c+++0x3d069c9)
#11 0x0000000003d0641e (/usr/bin/c+++0x3d0641e)
#12 0x0000000003d06305 (/usr/bin/c+++0x3d06305)
#13 0x0000000003d09c66 (/usr/bin/c+++0x3d09c66)
#14 0x0000000003d089e8 (/usr/bin/c+++0x3d089e8)
#15 0x0000000003d00aea (/usr/bin/c+++0x3d00aea)
#16 0x000000000379aef2 (/usr/bin/c+++0x379aef2)
#17 0x0000000003794b35 (/usr/bin/c+++0x3794b35)
#18 0x00000000037a387a (/usr/bin/c+++0x37a387a)
#19 0x00000000037976a9 (/usr/bin/c+++0x37976a9)
#20 0x0000000003798ec4 (/usr/bin/c+++0x3798ec4)
#21 0x000000000379a2ce (/usr/bin/c+++0x379a2ce)
#22 0x0000000003794b35 (/usr/bin/c+++0x3794b35)
#23 0x000000000379556d (/usr/bin/c+++0x379556d)
#24 0x0000000003794beb (/usr/bin/c+++0x3794beb)
#25 0x00000000037949fe (/usr/bin/c+++0x37949fe)
#26 0x00000000038244f3 (/usr/bin/c+++0x38244f3)
#27 0x0000000003822a0a (/usr/bin/c+++0x3822a0a)
#28 0x0000000003822330 (/usr/bin/c+++0x3822330)
#29 0x0000000003825b90 (/usr/bin/c+++0x3825b90)
#30 0x00000000038232f6 (/usr/bin/c+++0x38232f6)
#31 0x0000000003822330 (/usr/bin/c+++0x3822330)
#32 0x0000000003828370 (/usr/bin/c+++0x3828370)
#33 0x00000000038231a7 (/usr/bin/c+++0x38231a7)
#34 0x0000000003822330 (/usr/bin/c+++0x3822330)
#35 0x000000000382ad22 (/usr/bin/c+++0x382ad22)
#36 0x0000000003823c66 (/usr/bin/c+++0x3823c66)
#37 0x0000000003822330 (/usr/bin/c+++0x3822330)
#38 0x0000000003825b90 (/usr/bin/c+++0x3825b90)
#39 0x00000000038232f6 (/usr/bin/c+++0x38232f6)
#40 0x0000000003822330 (/usr/bin/c+++0x3822330)
#41 0x000000000382ad22 (/usr/bin/c+++0x382ad22)
#42 0x000000000382bdb8 (/usr/bin/c+++0x382bdb8)
#43 0x00000000037785c4 (/usr/bin/c+++0x37785c4)
#44 0x00000000037e4f3f (/usr/bin/c+++0x37e4f3f)
#45 0x00000000037b8d32 (/usr/bin/c+++0x37b8d32)
#46 0x00000000037b7d29 (/usr/bin/c+++0x37b7d29)
#47 0x00000000037b768c (/usr/bin/c+++0x37b768c)
#48 0x00000000037e29f0 (/usr/bin/c+++0x37e29f0)
#49 0x000000000377514e (/usr/bin/c+++0x377514e)
#50 0x00000000037bfe4a (/usr/bin/c+++0x37bfe4a)
#51 0x00000000037bf884 (/usr/bin/c+++0x37bf884)
#52 0x00000000037e2da0 (/usr/bin/c+++0x37e2da0)
#53 0x000000000377514e (/usr/bin/c+++0x377514e)
#54 0x00000000037bfe4a (/usr/bin/c+++0x37bfe4a)
#55 0x00000000037bf884 (/usr/bin/c+++0x37bf884)
#56 0x00000000037e2bf2 (/usr/bin/c+++0x37e2bf2)
#57 0x000000000377514e (/usr/bin/c+++0x377514e)
#58 0x0000000003773858 (/usr/bin/c+++0x3773858)
#59 0x000000000376efbe (/usr/bin/c+++0x376efbe)
#60 0x0000000003142326 (/usr/bin/c+++0x3142326)
#61 0x0000000003071904 (/usr/bin/c+++0x3071904)
#62 0x00000000031fedf0 (/usr/bin/c+++0x31fedf0)
#63 0x000000000248c33b (/usr/bin/c+++0x248c33b)
#64 0x000000000249965c (/usr/bin/c+++0x249965c)
#65 0x0000000002eeb83e (/usr/bin/c+++0x2eeb83e)
#66 0x0000000005503422 (/usr/bin/c+++0x5503422)
#67 0x0000000002eeafcc (/usr/bin/c+++0x2eeafcc)
#68 0x0000000002eaea3d (/usr/bin/c+++0x2eaea3d)
#69 0x0000000002eaeccc (/usr/bin/c+++0x2eaeccc)
#70 0x0000000002ec9b20 (/usr/bin/c+++0x2ec9b20)
#71 0x0000000002498df1 (/usr/bin/c+++0x2498df1)
c++: error: clang frontend command failed with exit code 138 (use -v to see invocation)
FreeBSD clang version 19.1.7 (https://github.com/llvm/llvm-project.git llvmorg-19.1.7-0-gcd708029e0b2)
Target: x86_64-unknown-freebsd13.5
Thread model: posix
InstalledDir: /usr/bin
c++: note: diagnostic msg: 
********************

PLEASE ATTACH THE FOLLOWING FILES TO THE BUG REPORT:
Preprocessed source(s) and associated run script(s) are located at:
c++: note: diagnostic msg: /tmp/chord-name-69af61.cpp
c++: note: diagnostic msg: /tmp/chord-name-69af61.sh
c++: note: diagnostic msg: 

********************
gmake[1]: *** [../make/c++-rules.make:5: out/chord-name.o] Error 1
gmake[1]: *** Waiting for unfinished jobs....
1 warning generated.
gmake: *** [make/generic-targets.make:6: all] Error 2
===> Compilation failed unexpectedly.
Try to set MAKE_JOBS_UNSAFE=yes and rebuild before reporting the failure to
the maintainer.
*** Error code 1

Stop.
make: stopped in /usr/ports/print/lilypond-devel