[package - main-armv7-default][lang/gnu-apl] Failed for gnu-apl-1.8_3 in build
- Go to: [ bottom of page ] [ top of archives ] [ this month ]
Date: Sun, 04 May 2025 03:49:36 UTC
You are receiving this mail as a port that you maintain
is failing to build on the FreeBSD package build server.
Please investigate the failure and submit a PR to fix
build.
Maintainer: danfe@FreeBSD.org
Log URL: https://pkg-status.freebsd.org/ampere2/data/main-armv7-default/p25bf3a3260c7_s680d34896c/logs/gnu-apl-1.8_3.log
Build URL: https://pkg-status.freebsd.org/ampere2/build.html?mastername=main-armv7-default&build=p25bf3a3260c7_s680d34896c
Log:
=>> Building lang/gnu-apl
build started at Sun May 4 03:43:59 UTC 2025
port directory: /usr/ports/lang/gnu-apl
package name: gnu-apl-1.8_3
building for: FreeBSD main-armv7-default-job-01 15.0-CURRENT FreeBSD 15.0-CURRENT 1500035 arm
maintained by: danfe@FreeBSD.org
Makefile datestamp: -rw-r--r-- 1 root wheel 2031 Nov 30 01:02 /usr/ports/lang/gnu-apl/Makefile
Ports top last git commit: 25bf3a3260c
Ports top unclean checkout: no
Port dir last git commit: 6b7215ed565
Port dir unclean checkout: no
Poudriere version: poudriere-git-3.4.2-7-gf78625a5
Host OSVERSION: 1500035
Jail OSVERSION: 1500035
Job Id: 01
---Begin Environment---
SHELL=/bin/sh
OSVERSION=1500035
UNAME_v=FreeBSD 15.0-CURRENT 1500035
UNAME_r=15.0-CURRENT
BLOCKSIZE=K
MAIL=/var/mail/root
MM_CHARSET=UTF-8
LANG=C.UTF-8
STATUS=1
HOME=/root
PATH=/sbin:/bin:/usr/sbin:/usr/bin:/usr/local/sbin:/usr/local/bin:/root/bin
MAKE_OBJDIR_CHECK_WRITABLE=0
LOCALBASE=/usr/local
USER=root
POUDRIERE_NAME=poudriere-git
LIBEXECPREFIX=/usr/local/libexec/poudriere
POUDRIERE_VERSION=3.4.2-7-gf78625a5
MASTERMNT=/usr/local/poudriere/data/.m/main-armv7-default/ref
LC_COLLATE=C
POUDRIERE_BUILD_TYPE=bulk
PACKAGE_BUILDING=yes
SAVED_TERM=
OUTPUT_REDIRECTED_STDERR=4
OUTPUT_REDIRECTED=1
PWD=/usr/local/poudriere/data/.m/main-armv7-default/01/.p
OUTPUT_REDIRECTED_STDOUT=3
P_PORTS_FEATURES=FLAVORS SUBPACKAGES SELECTED_OPTIONS
MASTERNAME=main-armv7-default
SCRIPTPREFIX=/usr/local/share/poudriere
SCRIPTNAME=bulk.sh
OLDPWD=/usr/local/poudriere/data/.m/main-armv7-default/ref/.p/pool
POUDRIERE_PKGNAME=poudriere-git-3.4.2-7-gf78625a5
SCRIPTPATH=/usr/local/share/poudriere/bulk.sh
POUDRIEREPATH=/usr/local/bin/poudriere
---End Environment---
---Begin Poudriere Port Flags/Env---
PORT_FLAGS=
PKGENV=
FLAVOR=
MAKE_ARGS=
---End Poudriere Port Flags/Env---
---Begin OPTIONS List---
===> The following configuration options are available for gnu-apl-1.8_3:
DOCS=on: Build and/or install documentation
GTK3=off: GTK 3 GUI toolkit support
LIBAPL=off: Build libapl.so instead of executable
PCRE=off: Use Perl Compatible Regular Expressions
PGSQL=off: PostgreSQL database support
SQLITE=off: SQLite database support
===> Use 'make config' to modify these settings
---End OPTIONS List---
--MAINTAINER--
danfe@FreeBSD.org
--End MAINTAINER--
--CONFIGURE_ARGS--
--without-gtk3 --without-pcre --without-postgresql --without-sqlite3 --prefix=/usr/local ${_LATE_CONFIGURE_ARGS}
--End CONFIGURE_ARGS--
--CONFIGURE_ENV--
CXX_WERROR=no MAKE=/usr/local/bin/gmake XDG_DATA_HOME=/wrkdirs/usr/ports/lang/gnu-apl/work XDG_CONFIG_HOME=/wrkdirs/usr/ports/lang/gnu-apl/work XDG_CACHE_HOME=/wrkdirs/usr/ports/lang/gnu-apl/work/.cache HOME=/wrkdirs/usr/ports/lang/gnu-apl/work TMPDIR="/tmp" PATH=/wrkdirs/usr/ports/lang/gnu-apl/work/.bin:/sbin:/bin:/usr/sbin:/usr/bin:/usr/local/sbin:/usr/local/bin:/root/bin PKG_CONFIG_LIBDIR=/wrkdirs/usr/ports/lang/gnu-apl/work/.pkgconfig:/usr/local/libdata/pkgconfig:/usr/local/share/pkgconfig:/usr/libdata/pkgconfig SHELL=/bin/sh CONFIG_SHELL=/bin/sh CMAKE_PREFIX_PATH="/usr/local" CONFIG_SITE=/usr/ports/Templates/config.site lt_cv_sys_max_cmd_len=524288
--End CONFIGURE_ENV--
--MAKE_ENV--
XDG_DATA_HOME=/wrkdirs/usr/ports/lang/gnu-apl/work XDG_CONFIG_HOME=/wrkdirs/usr/ports/lang/gnu-apl/work XDG_CACHE_HOME=/wrkdirs/usr/ports/lang/gnu-apl/work/.cache HOME=/wrkdirs/usr/ports/lang/gnu-apl/work TMPDIR="/tmp" PATH=/wrkdirs/usr/ports/lang/gnu-apl/work/.bin:/sbin:/bin:/usr/sbin:/usr/bin:/usr/local/sbin:/usr/local/bin:/root/bin PKG_CONFIG_LIBDIR=/wrkdirs/usr/ports/lang/gnu-apl/work/.pkgconfig:/usr/local/libdata/pkgconfig:/usr/local/share/pkgconfig:/usr/libdata/pkgconfig MK_DEBUG_FILES=no MK_KERNEL_SYMBOLS=no SHELL=/bin/sh NO_LINT=YES PREFIX=/usr/local LOCALBASE=/usr/local CC="cc" CFLAGS="-O2 -pipe -fstack-protector-strong -isystem /usr/local/include -fno-strict-aliasing " CPP="cpp" CPPFLAGS="-isystem /usr/local/include" LDFLAGS=" -fstack-protector-strong " LIBS="-L/usr/local/lib" CXX="c++" CXXFLAGS="-O2 -pipe -fstack-protector-strong -isystem /usr/local/include -fno-strict-aliasing -isystem /usr/local/include " BSD_INSTALL_PROGRAM="install -s -m 555" BSD_
INSTALL_LIB="install -s -m 0644" BSD_INSTALL_SCRIPT="install -m 555" BSD_INSTALL_DATA="install -m 0644" BSD_INSTALL_MAN="install -m 444"
--End MAKE_ENV--
--PLIST_SUB--
PORTDOCS="" DOCS="" NO_DOCS="@comment " GTK3="@comment " NO_GTK3="" LIBAPL="@comment " NO_LIBAPL="" PCRE="@comment " NO_PCRE="" PGSQL="@comment " NO_PGSQL="" SQLITE="@comment " NO_SQLITE="" OSREL=15.0 PREFIX=%D LOCALBASE=/usr/local RESETPREFIX=/usr/local LIB32DIR=lib DOCSDIR="share/doc/apl" EXAMPLESDIR="share/examples/apl" DATADIR="share/apl" WWWDIR="www/apl" ETCDIR="etc/apl"
--End PLIST_SUB--
--SUB_LIST--
DOCS="" NO_DOCS="@comment " GTK3="@comment " NO_GTK3="" LIBAPL="@comment " NO_LIBAPL="" PCRE="@comment " NO_PCRE="" PGSQL="@comment " NO_PGSQL="" SQLITE="@comment " NO_SQLITE="" PREFIX=/usr/local LOCALBASE=/usr/local DATADIR=/usr/local/share/apl DOCSDIR=/usr/local/share/doc/apl EXAMPLESDIR=/usr/local/share/examples/apl WWWDIR=/usr/local/www/apl ETCDIR=/usr/local/etc/apl
--End SUB_LIST--
---Begin make.conf---
# XXX: We really need this but cannot use it while 'make checksum' does not
# try the next mirror on checksum failure. It currently retries the same
# failed mirror and then fails rather then trying another. It *does*
# try the next if the size is mismatched though.
#MASTER_SITE_FREEBSD=yes
# Build ALLOW_MAKE_JOBS_PACKAGES with 3 jobs
MAKE_JOBS_NUMBER=3
USE_PACKAGE_DEPENDS=yes
BATCH=yes
WRKDIRPREFIX=/wrkdirs
PORTSDIR=/usr/ports
PACKAGES=/packages
DISTDIR=/distfiles
PACKAGE_BUILDING=yes
PACKAGE_BUILDING_FLAVORS=yes
#### ####
# XXX: We really need this but cannot use it while 'make checksum' does not
# try the next mirror on checksum failure. It currently retries the same
# failed mirror and then fails rather then trying another. It *does*
# try the next if the size is mismatched though.
#MASTER_SITE_FREEBSD=yes
# Build ALLOW_MAKE_JOBS_PACKAGES with 3 jobs
MAKE_JOBS_NUMBER=3
#### Misc Poudriere ####
.include "/etc/make.conf.ports_env"
GID=0
UID=0
---End make.conf---
--Resource limits--
cpu time (seconds, -t) unlimited
file size (512-blocks, -f) unlimited
data seg size (kbytes, -d) 524288
stack size (kbytes, -s) 65536
core file size (512-blocks, -c) unlimited
max memory size (kbytes, -m) unlimited
locked memory (kbytes, -l) unlimited
max user processes (-u) 89999
open files (-n) 8192
virtual mem size (kbytes, -v) unlimited
swap limit (kbytes, -w) unlimited
socket buffer size (bytes, -b) unlimited
pseudo-terminals (-p) unlimited
kqueues (-k) unlimited
umtx shared locks (-o) unlimited
pipebuf (-y) unlimited
--End resource limits--
=======================<phase: check-sanity >============================
===== env: NO_DEPENDS=yes USER=root UID=0 GID=0
===> License GPLv3+ accepted by the user
===========================================================================
=======================<phase: pkg-depends >============================
===== env: USE_PACKAGE_DEPENDS_ONLY=1 USER=root UID=0 GID=0
===> gnu-apl-1.8_3 depends on file: /usr/local/sbin/pkg - not found
===> Installing existing package /packages/All/pkg-2.1.0.pkg
[main-armv7-default-job-01] Installing pkg-2.1.0...
[main-armv7-default-job-01] Extracting pkg-2.1.0: .......... done
===> gnu-apl-1.8_3 depends on file: /usr/local/sbin/pkg - found
===> Returning to build of gnu-apl-1.8_3
===========================================================================
=======================<phase: fetch-depends >============================
===== env: USE_PACKAGE_DEPENDS_ONLY=1 USER=root UID=0 GID=0
===========================================================================
=======================<phase: fetch >============================
===== env: NO_DEPENDS=yes USER=root UID=0 GID=0
===> License GPLv3+ accepted by the user
===> Fetching all distfiles required by gnu-apl-1.8_3 for building
===========================================================================
=======================<phase: checksum >============================
===== env: NO_DEPENDS=yes USER=root UID=0 GID=0
===> License GPLv3+ accepted by the user
===> Fetching all distfiles required by gnu-apl-1.8_3 for building
=> SHA256 Checksum OK for apl-1.8.tar.gz.
===========================================================================
=======================<phase: extract-depends>============================
===== env: USE_PACKAGE_DEPENDS_ONLY=1 USER=root UID=0 GID=0
===========================================================================
=======================<phase: extract >============================
===== env: NO_DEPENDS=yes USER=root UID=0 GID=0
===> License GPLv3+ accepted by the user
===> Fetching all distfiles required by gnu-apl-1.8_3 for building
===> Extracting for gnu-apl-1.8_3
=> SHA256 Checksum OK for apl-1.8.tar.gz.
===========================================================================
=======================<phase: patch-depends >============================
===== env: USE_PACKAGE_DEPENDS_ONLY=1 USER=root UID=0 GID=0
===========================================================================
=======================<phase: patch >============================
===== env: NO_DEPENDS=yes USER=root UID=0 GID=0
===> Patching for gnu-apl-1.8_3
===> Applying FreeBSD patches for gnu-apl-1.8_3 from /usr/ports/lang/gnu-apl/files
===========================================================================
=======================<phase: build-depends >============================
===== env: USE_PACKAGE_DEPENDS_ONLY=1 USER=root UID=0 GID=0
===> gnu-apl-1.8_3 depends on package: gmake>=4.4.1 - not found
===> Installing existing package /packages/All/gmake-4.4.1.pkg
[main-armv7-default-job-01] Installing gmake-4.4.1...
[main-armv7-default-job-01] `-- Installing gettext-runtime-0.23.1...
[main-armv7-default-job-01] | `-- Installing indexinfo-0.3.1_1...
[main-armv7-default-job-01] | `-- Extracting indexinfo-0.3.1_1: .... done
[main-armv7-default-job-01] `-- Extracting gettext-runtime-0.23.1: .......... done
[main-armv7-default-job-01] Extracting gmake-4.4.1: .......... done
===> gnu-apl-1.8_3 depends on package: gmake>=4.4.1 - found
===> Returning to build of gnu-apl-1.8_3
<snip>
2538oIn file included from | i/usr/include/c++/v1/sstream d: 317 r:
eIn file included from ts/usr/include/c++/v1/__ostream/basic_ostream.hri:az16ie:
t(In file included from ss/usr/include/c++/v1/__system_error/error_code.h_i:tz18ye:
p_In file included from et/usr/include/c++/v1/__system_error/error_category.h:y::p15ce:
o /usr/include/c++/v1/stringp_:y_2841(n:
)7 :| { ^ error:
rimplicit instantiation of undefined template 'std::char_traits<Unicode>'e/usr/include/c++/v1/__fwd/string.h
s:i23 z:2841e29 | (: _ _note: ntemplate is declared here ,
v23ta | rlsautiert_ustc_yttp ye_p(Le)I:)B:;Cc Po}Pp
_y T(| E_ ^M_
PpL./../UCS_string.hh A:+T189 E:__28_V:sI zSnote: , in instantiation of member function 'std::basic_string<Unicode>::resize' requested here c
_h _a189sr | ,_ t _r _a{ni )tA;ss
;s
e| r ^| t
^(
s/usr/include/c++/v1/stringi:z1386e:(12): >note: in instantiation of member function 'std::basic_string<Unicode>::append' requested here0
); 1386 | r e s irzeet(usrinz ea(p)p e-n d1()_;_ s}v
. d| a ^t
a(/usr/include/c++/v1/__fwd/string.h):,23 :_29_:s vnote: .template is declared heres
iz e23( | )s)t;r
u c| t ^
_LIBC./../UCS_string.hhP:P220_:T23E:M Pnote: Lin instantiation of function template specialization 'std::basic_string<Unicode>::append<UCS_string, 0>' requested hereA
TE _220V | I S c h a r{_ tbraasiitcs_;s
t r| i ^n
g::append(other); }
| ^
/usr/include/c++/v1/__fwd/string.h:23:29: note: template is declared here
23 | struct _LIBCPP_TEMPLATE_VIS char_traits;
| ^
In file included from template_F0.cc:22:
In file included from ./template.hh:25:
In file included from ./../Native_interface.hh:26:
In file included from ./../Common.hh:57:
In file included from /usr/include/c++/v1/complex:270:
In file included from /usr/include/c++/v1/sstream:317:
In file included from /usr/include/c++/v1/__ostream/basic_ostream.h:16:
In file included from /usr/include/c++/v1/__system_error/error_code.h:18:
In file included from In file included from file_io.cc/usr/include/c++/v1/__system_error/error_category.h::2615:
:
In file included from /usr/include/c++/v1/string./../Quad_FIO.hh::284424::
7In file included from :/usr/include/c++/v1/vector :error: 325implicit instantiation of undefined template 'std::char_traits<Unicode>':
In file included from /usr/include/c++/v1/__format/formatter_bool.h:19 :
2844In file included from | /usr/include/c++/v1/__format/formatter_integral.h : 21 :
In file included from /usr/include/c++/v1/__format/formatter_output.h :t22r:
aIn file included from i/usr/include/c++/v1/__format/parser_std_format_spec.ht:s39_:
t/usr/include/c++/v1/stringy:p2538e::5::a serror: simplicit instantiation of undefined template 'std::char_traits<Unicode>'i
gn( _2538_ | p [ _ _ stzr]a,i tvsa_ltuyep_et:y:pceo(p)y)(;
| | ^ ^
/usr/include/c++/v1/__fwd/string.h/usr/include/c++/v1/__fwd/string.h::2323::2929:: note: note: template is declared heretemplate is declared here
2323 | | ssttrruucctt __LLIIBBCCPPPP__TTEEMMPPLLAATTEE__VVIISS cchhaarr__ttrraaiittss;;
| | ^ ^
fatal error: too many errors emitted, stopping now [-ferror-limit=]
In file included from template_F12.cc:22:
In file included from ./template.hh:25:
In file included from ./../Native_interface.hh:26:
In file included from ./../Common.hh:57:
In file included from /usr/include/c++/v1/complex:270:
In file included from /usr/include/c++/v1/sstream:317:
In file included from /usr/include/c++/v1/__ostream/basic_ostream.h:16:
In file included from /usr/include/c++/v1/__system_error/error_code.h:18:
In file included from /usr/include/c++/v1/__system_error/error_category.h:15:
/usr/include/c++/v1/string:2221:5: error: implicit instantiation of undefined template 'std::char_traits<Unicode>'
2221 | traits_type::assign(__p[__newsz], value_type());20 errors generated.
| ^
/usr/include/c++/v1/string:2134:5: note: in instantiation of member function 'std::basic_string<Unicode>::__null_terminate_at' requested here
2134 | __null_terminate_at(std::__to_address(__get_pointer()), __pos);
| ^
/usr/include/c++/v1/string:3304:5: note: in instantiation of member function 'std::basic_string<Unicode>::__erase_to_end' requested here
3304 | __erase_to_end(__n);
| ^
/usr/include/c++/v1/string:1303:84: note: in instantiation of member function 'std::basic_string<Unicode>::resize' requested here
1303 | _LIBCPP_HIDE_FROM_ABI _LIBCPP_CONSTEXPR_SINCE_CXX20 void resize(size_type __n) { resize(__n, value_type()); }
| ^
./../UCS_string.hh:189:28: note: in instantiation of member function 'std::basic_string<Unicode>::resize' requested here
189 | { Assert(size() > 0); resize(size() - 1); }
| ^
/usr/include/c++/v1/__fwd/string.h:23:29: note: template is declared here
23 | struct _LIBCPP_TEMPLATE_VIS char_traits;
| ^
In file included from file_io.cc:26:
In file included from ./../Quad_FIO.hh:24:
In file included from /usr/include/c++/v1/vector:325:
In file included from /usr/include/c++/v1/__format/formatter_bool.h:19:
In file included from /usr/include/c++/v1/__format/formatter_integral.h:21:
In file included from /usr/include/c++/v1/__format/formatter_output.h:22:
In file included from /usr/include/c++/v1/__format/parser_std_format_spec.h:39:
/usr/include/c++/v1/string:2221:5: error: implicit instantiation of undefined template 'std::char_traits<Unicode>'
2221 | traits_type::assign(__p[__newsz], value_type());
| ^
/usr/include/c++/v1/string:2134:5: note: in instantiation of member function 'std::basic_string<Unicode>::__null_terminate_at' requested here
2134 | __null_terminate_at(std::__to_address(__get_pointer()), __pos);
| ^
/usr/include/c++/v1/string:3304:5: note: in instantiation of member function 'std::basic_string<Unicode>::__erase_to_end' requested here
3304 | __erase_to_end(__n);
| ^
/usr/include/c++/v1/string:1303:84: note: in instantiation of member function 'std::basic_string<Unicode>::resize' requested here
1303 | _LIBCPP_HIDE_FROM_ABI _LIBCPP_CONSTEXPR_SINCE_CXX20 void resize(size_type __n) { resize(__n, value_type()); }
| ^
./../UCS_string.hh:189:28: note: in instantiation of member function 'std::basic_string<Unicode>::resize' requested here
189 | { Assert(size() > 0); resize(size() - 1); }
| ^
/usr/include/c++/v1/__fwd/string.h:23:29: note: In file included from template is declared heretemplate_F12.cc
:22:
In file included from ./template.hh:25:
In file included from ./../Native_interface.hh:26:
In file included from ./../Common.hh:57:
In file included from /usr/include/c++/v1/complex:270:
In file included from /usr/include/c++/v1/sstream:317:
In file included from /usr/include/c++/v1/__ostream/basic_ostream.h23 | :struct _LI16BC:
PIn file included from P_TEMPLATE_V/usr/include/c++/v1/__system_error/error_code.hI:S18 :
cIn file included from h/usr/include/c++/v1/__system_error/error_category.ha:r15_:
t/usr/include/c++/v1/stringr:a2841i:t7s:;
error: implicit instantiation of undefined template 'std::char_traits<Unicode>'|
^
2841 | traits_type::copy(__p + __sz, __s, __n);
| ^
/usr/include/c++/v1/string:1386:12: note: in instantiation of member function 'std::basic_string<Unicode>::append' requested here
1386 | return append(__sv.data(), __sv.size());
| ^
./../UCS_string.hh:220:23: note: in instantiation of function template specialization 'std::basic_string<Unicode>::append<UCS_string, 0>' requested here
220 | { basic_string::append(other); }
| ^
/usr/include/c++/v1/__fwd/string.h:23:29: note: template is declared here
23 | struct _LIBCPP_TEMPLATE_VIS char_traits;
| ^
In file included from template_F12.cc:22:
In file included from ./template.hh:25:
In file included from ./../Native_interface.hh:26:
In file included from ./../Common.hh:57:
In file included from /usr/include/c++/v1/complex:270:
In file included from /usr/include/c++/v1/sstream:317:
In file included from /usr/include/c++/v1/__ostream/basic_ostream.h:16:
In file included from /usr/include/c++/v1/__system_error/error_code.h:18:
In file included from /usr/include/c++/v1/__system_error/error_category.h:15:
/usr/include/c++/v1/string:2844:7: error: implicit instantiation of undefined template 'std::char_traits<Unicode>'
2844 | traits_type::assign(__p[__sz], value_type());
| ^
/usr/include/c++/v1/__fwd/string.h:23:29: note: template is declared here
23 | struct _LIBCPP_TEMPLATE_VIS char_traits;
| ^
In file included from file_io.cc:26:
In file included from ./../Quad_FIO.hh:24:
In file included from /usr/include/c++/v1/vector:325:
In file included from /usr/include/c++/v1/__format/formatter_bool.h:19:
In file included from /usr/include/c++/v1/__format/formatter_integral.h:21:
In file included from /usr/include/c++/v1/__format/formatter_output.h:22:
In file included from /usr/include/c++/v1/__format/parser_std_format_spec.h:39:
/usr/include/c++/v1/string:2841:7: error: implicit instantiation of undefined template 'std::char_traits<Unicode>'
2841 | traits_type::copy(__p + __sz, __s, __n);
| ^
/usr/include/c++/v1/string:1386:12: note: in instantiation of member function 'std::basic_string<Unicode>::append' requested here
1386 | return append(__sv.data(), __fatal error: stoo many errors emitted, stopping now [-ferror-limit=]v
.size());
| ^
./../UCS_string.hh:220:23: note: in instantiation of function template specialization 'std::basic_string<Unicode>::append<UCS_string, 0>' requested here
220 | { basic_string::append(other); }
| ^
/usr/include/c++/v1/__fwd/string.h:23:29: note: template is declared here
23 | struct _LIBCPP_TEMPLATE_VIS char_traits;
| ^
In file included from file_io.cc:26:
In file included from ./../Quad_FIO.hh:24:
In file included from /usr/include/c++/v1/vector:325:
In file included from /usr/include/c++/v1/__format/formatter_bool.h:19:
In file included from /usr/include/c++/v1/__format/formatter_integral.h:21:
In file included from /usr/include/c++/v1/__format/formatter_output.h:22:
In file included from /usr/include/c++/v1/__format/parser_std_format_spec.h:39:
/usr/include/c++/v1/string:2844:7: error: implicit instantiation of undefined template 'std::char_traits<Unicode>'
2844 | traits_type::assign(__p[__sz], value_type());
| ^
/usr/include/c++/v1/__fwd/string.h:23:29: note: template is declared here
23 | struct _LIBCPP_TEMPLATE_VIS char_traits;
| ^
20 errors generated.
fatal error: too many errors emitted, stopping now [-ferror-limit=]
20 errors generated.
gmake[3]: *** [Makefile:565: lib_template_F0_la-template_F0.lo] Error 1
gmake[3]: *** Waiting for unfinished jobs....
gmake[3]: *** [Makefile:572: lib_template_F12_la-template_F12.lo] Error 1
gmake[3]: *** [Makefile:558: lib_file_io_la-file_io.lo] Error 1
gmake[3]: Leaving directory '/wrkdirs/usr/ports/lang/gnu-apl/work/apl-1.8/src/native'
gmake[2]: *** [Makefile:4484: all-recursive] Error 1
gmake[2]: Leaving directory '/wrkdirs/usr/ports/lang/gnu-apl/work/apl-1.8/src'
gmake[1]: *** [Makefile:524: all-recursive] Error 1
gmake[1]: Leaving directory '/wrkdirs/usr/ports/lang/gnu-apl/work/apl-1.8'
gmake: *** [Makefile:411: all] Error 2
===> Compilation failed unexpectedly.
Try to set MAKE_JOBS_UNSAFE=yes and rebuild before reporting the failure to
the maintainer.
*** Error code 1
Stop.
make: stopped making "build" in /usr/ports/lang/gnu-apl