[package - 134amd64-default][math/e-antic] Failed for e-antic-2.0.2_5 in build

From: <pkg-fallout_at_FreeBSD.org>
Date: Sat, 29 Mar 2025 14:30:30 UTC
You are receiving this mail as a port that you maintain
is failing to build on the FreeBSD package build server.
Please investigate the failure and submit a PR to fix
build.

Maintainer:     thierry@FreeBSD.org
Log URL:        https://pkg-status.freebsd.org/beefy16/data/134amd64-default/41118d5f4586/logs/e-antic-2.0.2_5.log
Build URL:      https://pkg-status.freebsd.org/beefy16/build.html?mastername=134amd64-default&build=41118d5f4586
Log:

=>> Building math/e-antic
build started at Sat Mar 29 14:28:02 UTC 2025
port directory: /usr/ports/math/e-antic
package name: e-antic-2.0.2_5
building for: FreeBSD 134amd64-default-job-10 13.4-RELEASE-p4 FreeBSD 13.4-RELEASE-p4 amd64
maintained by: thierry@FreeBSD.org
Makefile datestamp: -rw-r--r--  1 root  wheel  1936 Feb 16 01:03 /usr/ports/math/e-antic/Makefile
Ports top last git commit: 41118d5f458
Ports top unclean checkout: no
Port dir last git commit: fa53920e721
Port dir unclean checkout: no
Poudriere version: poudriere-git-3.4.2-7-gf78625a5
Host OSVERSION: 1500028
Jail OSVERSION: 1304000
Job Id: 10

---Begin Environment---
SHELL=/bin/csh
OSVERSION=1304000
UNAME_v=FreeBSD 13.4-RELEASE-p4
UNAME_r=13.4-RELEASE-p4
BLOCKSIZE=K
MAIL=/var/mail/root
MM_CHARSET=UTF-8
LANG=C.UTF-8
STATUS=1
HOME=/root
PATH=/sbin:/bin:/usr/sbin:/usr/bin:/usr/local/sbin:/usr/local/bin:/root/bin
MAKE_OBJDIR_CHECK_WRITABLE=0
LOCALBASE=/usr/local
USER=root
POUDRIERE_NAME=poudriere-git
LIBEXECPREFIX=/usr/local/libexec/poudriere
POUDRIERE_VERSION=3.4.2-7-gf78625a5
MASTERMNT=/usr/local/poudriere/data/.m/134amd64-default/ref
LC_COLLATE=C
POUDRIERE_BUILD_TYPE=bulk
PACKAGE_BUILDING=yes
SAVED_TERM=
OUTPUT_REDIRECTED_STDERR=4
OUTPUT_REDIRECTED=1
PWD=/usr/local/poudriere/data/.m/134amd64-default/10/.p
OUTPUT_REDIRECTED_STDOUT=3
P_PORTS_FEATURES=FLAVORS SUBPACKAGES SELECTED_OPTIONS
MASTERNAME=134amd64-default
SCRIPTPREFIX=/usr/local/share/poudriere
SCRIPTNAME=bulk.sh
OLDPWD=/usr/local/poudriere/data/.m/134amd64-default/ref/.p/pool
POUDRIERE_PKGNAME=poudriere-git-3.4.2-7-gf78625a5
SCRIPTPATH=/usr/local/share/poudriere/bulk.sh
POUDRIEREPATH=/usr/local/bin/poudriere
---End Environment---

---Begin Poudriere Port Flags/Env---
PORT_FLAGS=
PKGENV=
FLAVOR=
MAKE_ARGS=
---End Poudriere Port Flags/Env---

---Begin OPTIONS List---
---End OPTIONS List---

--MAINTAINER--
thierry@FreeBSD.org
--End MAINTAINER--

--CONFIGURE_ARGS--
--without-byexample	 --without-pytest	 --without-doc --prefix=/usr/local ${_LATE_CONFIGURE_ARGS}
--End CONFIGURE_ARGS--

--CONFIGURE_ENV--
MAKE=/usr/local/bin/gmake PYTHON="/usr/local/bin/python3.11" XDG_DATA_HOME=/wrkdirs/usr/ports/math/e-antic/work  XDG_CONFIG_HOME=/wrkdirs/usr/ports/math/e-antic/work  XDG_CACHE_HOME=/wrkdirs/usr/ports/math/e-antic/work/.cache  HOME=/wrkdirs/usr/ports/math/e-antic/work TMPDIR="/tmp" PATH=/wrkdirs/usr/ports/math/e-antic/work/.bin:/sbin:/bin:/usr/sbin:/usr/bin:/usr/local/sbin:/usr/local/bin:/root/bin PKG_CONFIG_LIBDIR=/wrkdirs/usr/ports/math/e-antic/work/.pkgconfig:/usr/local/libdata/pkgconfig:/usr/local/share/pkgconfig:/usr/libdata/pkgconfig SHELL=/bin/sh CONFIG_SHELL=/bin/sh DEFAULT_AUTOCONF=2.72 CMAKE_PREFIX_PATH="/usr/local" CONFIG_SITE=/usr/ports/Templates/config.site lt_cv_sys_max_cmd_len=524288
--End CONFIGURE_ENV--

--MAKE_ENV--
XDG_DATA_HOME=/wrkdirs/usr/ports/math/e-antic/work  XDG_CONFIG_HOME=/wrkdirs/usr/ports/math/e-antic/work  XDG_CACHE_HOME=/wrkdirs/usr/ports/math/e-antic/work/.cache  HOME=/wrkdirs/usr/ports/math/e-antic/work TMPDIR="/tmp" PATH=/wrkdirs/usr/ports/math/e-antic/work/.bin:/sbin:/bin:/usr/sbin:/usr/bin:/usr/local/sbin:/usr/local/bin:/root/bin PKG_CONFIG_LIBDIR=/wrkdirs/usr/ports/math/e-antic/work/.pkgconfig:/usr/local/libdata/pkgconfig:/usr/local/share/pkgconfig:/usr/libdata/pkgconfig MK_DEBUG_FILES=no MK_KERNEL_SYMBOLS=no SHELL=/bin/sh NO_LINT=YES DEFAULT_AUTOCONF=2.72 PREFIX=/usr/local  LOCALBASE=/usr/local  CC="cc" CFLAGS="-O2 -pipe  -fstack-protector-strong -isystem /usr/local/include -fno-strict-aliasing "  CPP="cpp" CPPFLAGS="-isystem /usr/local/include"  LDFLAGS=" -fstack-protector-strong " LIBS=""-lm" -L/usr/local/lib"  CXX="c++" CXXFLAGS="-O2 -pipe -fstack-protector-strong -isystem /usr/local/include -fno-strict-aliasing  -isystem /usr/local/include " BSD_INSTALL_PROGRAM
="install  -s -m 555"  BSD_INSTALL_LIB="install  -s -m 0644"  BSD_INSTALL_SCRIPT="install  -m 555"  BSD_INSTALL_DATA="install  -m 0644"  BSD_INSTALL_MAN="install  -m 444"
--End MAKE_ENV--

--PLIST_SUB--
VER=2.0.2 PYTHON_INCLUDEDIR=include/python3.11  PYTHON_LIBDIR=lib/python3.11  PYTHON_PLATFORM=freebsd13  PYTHON_SITELIBDIR=lib/python3.11/site-packages  PYTHON_SUFFIX=311  PYTHON_EXT_SUFFIX=.cpython-311  PYTHON_VER=3.11  PYTHON_VERSION=python3.11 PYTHON2="@comment " PYTHON3="" OSREL=13.4 PREFIX=%D LOCALBASE=/usr/local  RESETPREFIX=/usr/local LIB32DIR=lib DOCSDIR="share/doc/e-antic"  EXAMPLESDIR="share/examples/e-antic"  DATADIR="share/e-antic"  WWWDIR="www/e-antic"  ETCDIR="etc/e-antic"
--End PLIST_SUB--

--SUB_LIST--
PYTHON_INCLUDEDIR=/usr/local/include/python3.11  PYTHON_LIBDIR=/usr/local/lib/python3.11  PYTHON_PLATFORM=freebsd13  PYTHON_SITELIBDIR=/usr/local/lib/python3.11/site-packages  PYTHON_SUFFIX=311  PYTHON_EXT_SUFFIX=.cpython-311  PYTHON_VER=3.11  PYTHON_VERSION=python3.11 PYTHON2="@comment " PYTHON3="" PREFIX=/usr/local LOCALBASE=/usr/local  DATADIR=/usr/local/share/e-antic DOCSDIR=/usr/local/share/doc/e-antic EXAMPLESDIR=/usr/local/share/examples/e-antic  WWWDIR=/usr/local/www/e-antic ETCDIR=/usr/local/etc/e-antic
--End SUB_LIST--

---Begin make.conf---
USE_PACKAGE_DEPENDS=yes
BATCH=yes
WRKDIRPREFIX=/wrkdirs
PORTSDIR=/usr/ports
PACKAGES=/packages
DISTDIR=/distfiles
PACKAGE_BUILDING=yes
PACKAGE_BUILDING_FLAVORS=yes
####  ####
# XXX: We really need this but cannot use it while 'make checksum' does not
# try the next mirror on checksum failure.  It currently retries the same
# failed mirror and then fails rather then trying another.  It *does*
# try the next if the size is mismatched though.
#MASTER_SITE_FREEBSD=yes
# Build ALLOW_MAKE_JOBS_PACKAGES with 3 jobs
MAKE_JOBS_NUMBER=3
#### Misc Poudriere ####
.include "/etc/make.conf.ports_env"
GID=0
UID=0
---End make.conf---
--Resource limits--
cpu time               (seconds, -t)  unlimited
file size           (512-blocks, -f)  unlimited
data seg size           (kbytes, -d)  33554432
stack size              (kbytes, -s)  524288
core file size      (512-blocks, -c)  unlimited
max memory size         (kbytes, -m)  unlimited
locked memory           (kbytes, -l)  unlimited
max user processes              (-u)  89999
open files                      (-n)  8192
virtual mem size        (kbytes, -v)  unlimited
swap limit              (kbytes, -w)  unlimited
socket buffer size       (bytes, -b)  unlimited
pseudo-terminals                (-p)  unlimited
kqueues                         (-k)  unlimited
umtx shared locks               (-o)  unlimited
--End resource limits--
=======================<phase: check-sanity   >============================
===== env: NO_DEPENDS=yes USER=root UID=0 GID=0
===>  License GPLv3 LGPL3 accepted by the user
===========================================================================
=======================<phase: pkg-depends    >============================
===== env: USE_PACKAGE_DEPENDS_ONLY=1 USER=root UID=0 GID=0
===>   e-antic-2.0.2_5 depends on file: /usr/local/sbin/pkg - not found
===>   Installing existing package /packages/All/pkg-2.0.6.pkg
[134amd64-default-job-10] Installing pkg-2.0.6...
[134amd64-default-job-10] Extracting pkg-2.0.6: .......... done
===>   e-antic-2.0.2_5 depends on file: /usr/local/sbin/pkg - found
===>   Returning to build of e-antic-2.0.2_5
===========================================================================
=======================<phase: fetch-depends  >============================
===== env: USE_PACKAGE_DEPENDS_ONLY=1 USER=root UID=0 GID=0
===========================================================================
=======================<phase: fetch          >============================
===== env: NO_DEPENDS=yes USER=root UID=0 GID=0
===>  License GPLv3 LGPL3 accepted by the user
===> Fetching all distfiles required by e-antic-2.0.2_5 for building
===========================================================================
=======================<phase: checksum       >============================
===== env: NO_DEPENDS=yes USER=root UID=0 GID=0
===>  License GPLv3 LGPL3 accepted by the user
===> Fetching all distfiles required by e-antic-2.0.2_5 for building
=> SHA256 Checksum OK for flatsurf-e-antic-2.0.2_GH0.tar.gz.
=> SHA256 Checksum OK for catchorg-Catch2-62fd660_GH0.tar.gz.
=> SHA256 Checksum OK for USCiLab-cereal-ebef1e9_GH0.tar.gz.
=> SHA256 Checksum OK for wbhart-flint2-ae7ec89_GH0.tar.gz.
=> SHA256 Checksum OK for flatsurf-antic-f4e8a60_GH0.tar.gz.
===========================================================================
=======================<phase: extract-depends>============================
===== env: USE_PACKAGE_DEPENDS_ONLY=1 USER=root UID=0 GID=0
===========================================================================
=======================<phase: extract        >============================
===== env: NO_DEPENDS=yes USER=root UID=0 GID=0
===>  License GPLv3 LGPL3 accepted by the user
===> Fetching all distfiles required by e-antic-2.0.2_5 for building
===>  Extracting for e-antic-2.0.2_5
=> SHA256 Checksum OK for flatsurf-e-antic-2.0.2_GH0.tar.gz.
=> SHA256 Checksum OK for catchorg-Catch2-62fd660_GH0.tar.gz.
=> SHA256 Checksum OK for USCiLab-cereal-ebef1e9_GH0.tar.gz.
=> SHA256 Checksum OK for wbhart-flint2-ae7ec89_GH0.tar.gz.
=> SHA256 Checksum OK for flatsurf-antic-f4e8a60_GH0.tar.gz.
/bin/mkdir -p /wrkdirs/usr/ports/math/e-antic/work/flint-ae7ec89
/bin/ln -sf /wrkdirs/usr/ports/math/e-antic/work/flint-ae7ec89 /wrkdirs/usr/ports/math/e-antic/work/flint2-ae7ec89
/bin/rmdir /wrkdirs/usr/ports/math/e-antic/work/flint-ae7ec89
===========================================================================
=======================<phase: patch-depends  >============================
===== env: USE_PACKAGE_DEPENDS_ONLY=1 USER=root UID=0 GID=0
===========================================================================
=======================<phase: patch          >============================
===== env: NO_DEPENDS=yes USER=root UID=0 GID=0
===>  Patching for e-antic-2.0.2_5
===========================================================================
=======================<phase: build-depends  >============================
===== env: USE_PACKAGE_DEPENDS_ONLY=1 USER=root UID=0 GID=0
===>   e-antic-2.0.2_5 depends on package: py311-setuptools>0 - not found
===>   Installing existing package /packages/All/py311-setuptools-63.1.0_2.pkg
[134amd64-default-job-10] Installing py311-setuptools-63.1.0_2...
[134amd64-default-job-10] `-- Installing python311-3.11.11...
[134amd64-default-job-10] |   `-- Installing gettext-runtime-0.23.1...
[134amd64-default-job-10] |   | `-- Installing indexinfo-0.3.1_1...
[134amd64-default-job-10] |   | `-- Extracting indexinfo-0.3.1_1: .... done
[134amd64-default-job-10] |   `-- Extracting gettext-runtime-0.23.1: .......... done
[134amd64-default-job-10] |   `-- Installing libffi-3.4.6...
[134amd64-default-job-10] |   `-- Extracting libffi-3.4.6: .......... done
[134amd64-default-job-10] |   `-- Installing mpdecimal-4.0.0...
[134amd64-default-job-10] |   `-- Extracting mpdecimal-4.0.0: .......... done
[134amd64-default-job-10] |   `-- Installing readline-8.2.13_2...
[134amd64-default-job-10] |   `-- Extracting readline-8.2.13_2: .......... done
[134amd64-default-job-10] `-- Extracting python311-3.11.11: .......... done
[134amd64-default-job-10] Extracting py311-setuptools-63.1.0_2: .......... done
<snip>
 1522 |           benchmark::internal::make_unique<              \
      |           ^~~~~~~~~~~
/usr/local/include/benchmark/benchmark.h:1362:11: note: '::benchmark::internal' declared here
 1362 | namespace internal {
      |           ^
renfxx/b-constructor.cpp:75:1: error: no member named 'internal' in namespace 'eantic::benchmark'; did you mean '::benchmark::internal'?
   75 | BENCHMARK_TEMPLATE(ConstructTrivialElementInField, long)->Arg(1)->Arg(2)->Arg(4);
      | ^~~~~~~~~~~~~~~~~~~~~~~~~~~~~~~~~~~~~~~~~~~~~~~~~~~~~~~~
/usr/local/include/benchmark/benchmark.h:1522:11: note: expanded from macro 'BENCHMARK_TEMPLATE'
 1522 |           benchmark::internal::make_unique<              \
      |           ^~~~~~~~~~~
/usr/local/include/benchmark/benchmark.h:1362:11: note: '::benchmark::internal' declared here
 1362 | namespace internal {
      |           ^
renfxx/b-constructor.cpp:76:1: error: no member named 'internal' in namespace 'eantic::benchmark'; did you mean '::benchmark::internal'?
   76 | BENCHMARK_TEMPLATE(ConstructTrivialElementInField, long long)->Arg(1)->Arg(2)->Arg(4);
      | ^~~~~~~~~~~~~~~~~~~~~~~~~~~~~~~~~~~~~~~~~~~~~~~~~~~~~~~~~~~~~
/usr/local/include/benchmark/benchmark.h:1522:11: note: expanded from macro 'BENCHMARK_TEMPLATE'
 1522 |           benchmark::internal::make_unique<              \
      |           ^~~~~~~~~~~
/usr/local/include/benchmark/benchmark.h:1362:11: note: '::benchmark::internal' declared here
 1362 | namespace internal {
      |           ^
renfxx/b-constructor.cpp:77:1: error: no member named 'internal' in namespace 'eantic::benchmark'; did you mean '::benchmark::internal'?
   77 | BENCHMARK_TEMPLATE(ConstructTrivialElementInField, mpz_class)->Arg(1)->Arg(2)->Arg(4);
      | ^~~~~~~~~~~~~~~~~~~~~~~~~~~~~~~~~~~~~~~~~~~~~~~~~~~~~~~~~~~~~
/usr/local/include/benchmark/benchmark.h:1522:11: note: expanded from macro 'BENCHMARK_TEMPLATE'
 1522 |           benchmark::internal::make_unique<              \
      |           ^~~~~~~~~~~
/usr/local/include/benchmark/benchmark.h:1362:11: note: '::benchmark::internal' declared here
 1362 | namespace internal {
      |           ^
renfxx/b-constructor.cpp:78:1: error: no member named 'internal' in namespace 'eantic::benchmark'; did you mean '::benchmark::internal'?
   78 | BENCHMARK_TEMPLATE(ConstructTrivialElementInField, mpq_class)->Arg(1)->Arg(2)->Arg(4);
      | ^~~~~~~~~~~~~~~~~~~~~~~~~~~~~~~~~~~~~~~~~~~~~~~~~~~~~~~~~~~~~
/usr/local/include/benchmark/benchmark.h:1522:11: note: expanded from macro 'BENCHMARK_TEMPLATE'
 1522 |           benchmark::internal::make_unique<              \
      |           ^~~~~~~~~~~
/usr/local/include/benchmark/benchmark.h:1362:11: note: '::benchmark::internal' declared here
 1362 | namespace internal {
      |           ^
renfxx/b-constructor.cpp:79:1: error: no member named 'internal' in namespace 'eantic::benchmark'; did you mean '::benchmark::internal'?
   79 | BENCHMARK_TEMPLATE(ConstructTrivialElementInField, renf_elem_class)->Arg(1)->Arg(2)->Arg(4);
      | ^~~~~~~~~~~~~~~~~~~~~~~~~~~~~~~~~~~~~~~~~~~~~~~~~~~~~~~~~~~~~~~~~~~
/usr/local/include/benchmark/benchmark.h:1522:11: note: expanded from macro 'BENCHMARK_TEMPLATE'
 1522 |           benchmark::internal::make_unique<              \
      |           ^~~~~~~~~~~
/usr/local/include/benchmark/benchmark.h:1362:11: note: '::benchmark::internal' declared here
 1362 | namespace internal {
      |           ^
2 warnings and 15 errors generated.
gmake[2]: *** [Makefile:417: renfxx/b-constructor.o] Error 1
renfxx/b-relop.cpp:33:1: error: no member named 'internal' in namespace 'eantic::benchmark'; did you mean '::benchmark::internal'?
   33 | BENCHMARK_TEMPLATE(Equality, int)->Arg(1)->Arg(2)->Arg(4);
      | ^~~~~~~~~~~~~~~~~~~~~~~~~~~~~~~~~
/usr/local/include/benchmark/benchmark.h:1522:11: note: expanded from macro 'BENCHMARK_TEMPLATE'
 1522 |           benchmark::internal::make_unique<              \
      |           ^~~~~~~~~~~
/usr/local/include/benchmark/benchmark.h:1362:11: note: '::benchmark::internal' declared here
 1362 | namespace internal {
      |           ^
renfxx/b-relop.cpp:34:1: error: no member named 'internal' in namespace 'eantic::benchmark'; did you mean '::benchmark::internal'?
   34 | BENCHMARK_TEMPLATE(Equality, long)->Arg(1)->Arg(2)->Arg(4);
      | ^~~~~~~~~~~~~~~~~~~~~~~~~~~~~~~~~~
/usr/local/include/benchmark/benchmark.h:1522:11: note: expanded from macro 'BENCHMARK_TEMPLATE'
 1522 |           benchmark::internal::make_unique<              \
      |           ^~~~~~~~~~~
/usr/local/include/benchmark/benchmark.h:1362:11: note: '::benchmark::internal' declared here
 1362 | namespace internal {
      |           ^
renfxx/b-relop.cpp:35:1: error: no member named 'internal' in namespace 'eantic::benchmark'; did you mean '::benchmark::internal'?
   35 | BENCHMARK_TEMPLATE(Equality, long long)->Arg(1)->Arg(2)->Arg(4);
      | ^~~~~~~~~~~~~~~~~~~~~~~~~~~~~~~~~~~~~~~
/usr/local/include/benchmark/benchmark.h:1522:11: note: expanded from macro 'BENCHMARK_TEMPLATE'
 1522 |           benchmark::internal::make_unique<              \
      |           ^~~~~~~~~~~
/usr/local/include/benchmark/benchmark.h:1362:11: note: '::benchmark::internal' declared here
 1362 | namespace internal {
      |           ^
renfxx/b-relop.cpp:36:1: error: no member named 'internal' in namespace 'eantic::benchmark'; did you mean '::benchmark::internal'?
   36 | BENCHMARK_TEMPLATE(Equality, mpz_class)->Arg(1)->Arg(2)->Arg(4);
      | ^~~~~~~~~~~~~~~~~~~~~~~~~~~~~~~~~~~~~~~
/usr/local/include/benchmark/benchmark.h:1522:11: note: expanded from macro 'BENCHMARK_TEMPLATE'
 1522 |           benchmark::internal::make_unique<              \
      |           ^~~~~~~~~~~
/usr/local/include/benchmark/benchmark.h:1362:11: note: '::benchmark::internal' declared here
 1362 | namespace internal {
      |           ^
renfxx/b-relop.cpp:37:1: error: no member named 'internal' in namespace 'eantic::benchmark'; did you mean '::benchmark::internal'?
   37 | BENCHMARK_TEMPLATE(Equality, mpq_class)->Arg(1)->Arg(2)->Arg(4);
      | ^~~~~~~~~~~~~~~~~~~~~~~~~~~~~~~~~~~~~~~
/usr/local/include/benchmark/benchmark.h:1522:11: note: expanded from macro 'BENCHMARK_TEMPLATE'
 1522 |           benchmark::internal::make_unique<              \
      |           ^~~~~~~~~~~
/usr/local/include/benchmark/benchmark.h:1362:11: note: '::benchmark::internal' declared here
 1362 | namespace internal {
      |           ^
renfxx/b-relop.cpp:38:1: error: no member named 'internal' in namespace 'eantic::benchmark'; did you mean '::benchmark::internal'?
   38 | BENCHMARK_TEMPLATE(Equality, renf_elem_class)->Arg(1)->Arg(2)->Arg(4);
      | ^~~~~~~~~~~~~~~~~~~~~~~~~~~~~~~~~~~~~~~~~~~~~
/usr/local/include/benchmark/benchmark.h:1522:11: note: expanded from macro 'BENCHMARK_TEMPLATE'
 1522 |           benchmark::internal::make_unique<              \
      |           ^~~~~~~~~~~
/usr/local/include/benchmark/benchmark.h:1362:11: note: '::benchmark::internal' declared here
 1362 | namespace internal {
      |           ^
renfxx/b-relop.cpp:48:1: error: no member named 'internal' in namespace 'eantic::benchmark'; did you mean '::benchmark::internal'?
   48 | BENCHMARK(ZeroEquality)->Arg(1)->Arg(2)->Arg(4);
      | ^~~~~~~~~~~~~~~~~~~~~~~
/usr/local/include/benchmark/benchmark.h:1467:11: note: expanded from macro 'BENCHMARK'
 1467 |           benchmark::internal::make_unique<                           \
      |           ^~~~~~~~~~~
/usr/local/include/benchmark/benchmark.h:1362:11: note: '::benchmark::internal' declared here
 1362 | namespace internal {
      |           ^
renfxx/b-relop.cpp:58:1: error: no member named 'internal' in namespace 'eantic::benchmark'; did you mean '::benchmark::internal'?
   58 | BENCHMARK(ZeroInequality)->Arg(1)->Arg(2)->Arg(4);
      | ^~~~~~~~~~~~~~~~~~~~~~~~~
/usr/local/include/benchmark/benchmark.h:1467:11: note: expanded from macro 'BENCHMARK'
 1467 |           benchmark::internal::make_unique<                           \
      |           ^~~~~~~~~~~
/usr/local/include/benchmark/benchmark.h:1362:11: note: '::benchmark::internal' declared here
 1362 | namespace internal {
      |           ^
renfxx/b-relop.cpp:70:1: error: no member named 'internal' in namespace 'eantic::benchmark'; did you mean '::benchmark::internal'?
   70 | BENCHMARK_TEMPLATE(Inequality, int)->Arg(1)->Arg(2)->Arg(4);
      | ^~~~~~~~~~~~~~~~~~~~~~~~~~~~~~~~~~~
/usr/local/include/benchmark/benchmark.h:1522:11: note: expanded from macro 'BENCHMARK_TEMPLATE'
 1522 |           benchmark::internal::make_unique<              \
      |           ^~~~~~~~~~~
/usr/local/include/benchmark/benchmark.h:1362:11: note: '::benchmark::internal' declared here
 1362 | namespace internal {
      |           ^
renfxx/b-relop.cpp:71:1: error: no member named 'internal' in namespace 'eantic::benchmark'; did you mean '::benchmark::internal'?
   71 | BENCHMARK_TEMPLATE(Inequality, long)->Arg(1)->Arg(2)->Arg(4);
      | ^~~~~~~~~~~~~~~~~~~~~~~~~~~~~~~~~~~~
/usr/local/include/benchmark/benchmark.h:1522:11: note: expanded from macro 'BENCHMARK_TEMPLATE'
 1522 |           benchmark::internal::make_unique<              \
      |           ^~~~~~~~~~~
/usr/local/include/benchmark/benchmark.h:1362:11: note: '::benchmark::internal' declared here
 1362 | namespace internal {
      |           ^
renfxx/b-relop.cpp:72:1: error: no member named 'internal' in namespace 'eantic::benchmark'; did you mean '::benchmark::internal'?
   72 | BENCHMARK_TEMPLATE(Inequality, long long)->Arg(1)->Arg(2)->Arg(4);
      | ^~~~~~~~~~~~~~~~~~~~~~~~~~~~~~~~~~~~~~~~~
/usr/local/include/benchmark/benchmark.h:1522:11: note: expanded from macro 'BENCHMARK_TEMPLATE'
 1522 |           benchmark::internal::make_unique<              \
      |           ^~~~~~~~~~~
/usr/local/include/benchmark/benchmark.h:1362:11: note: '::benchmark::internal' declared here
 1362 | namespace internal {
      |           ^
renfxx/b-relop.cpp:73:1: error: no member named 'internal' in namespace 'eantic::benchmark'; did you mean '::benchmark::internal'?
   73 | BENCHMARK_TEMPLATE(Inequality, mpz_class)->Arg(1)->Arg(2)->Arg(4);
      | ^~~~~~~~~~~~~~~~~~~~~~~~~~~~~~~~~~~~~~~~~
/usr/local/include/benchmark/benchmark.h:1522:11: note: expanded from macro 'BENCHMARK_TEMPLATE'
 1522 |           benchmark::internal::make_unique<              \
      |           ^~~~~~~~~~~
/usr/local/include/benchmark/benchmark.h:1362:11: note: '::benchmark::internal' declared here
 1362 | namespace internal {
      |           ^
renfxx/b-relop.cpp:74:1: error: no member named 'internal' in namespace 'eantic::benchmark'; did you mean '::benchmark::internal'?
   74 | BENCHMARK_TEMPLATE(Inequality, mpq_class)->Arg(1)->Arg(2)->Arg(4);
      | ^~~~~~~~~~~~~~~~~~~~~~~~~~~~~~~~~~~~~~~~~
/usr/local/include/benchmark/benchmark.h:1522:11: note: expanded from macro 'BENCHMARK_TEMPLATE'
 1522 |           benchmark::internal::make_unique<              \
      |           ^~~~~~~~~~~
/usr/local/include/benchmark/benchmark.h:1362:11: note: '::benchmark::internal' declared here
 1362 | namespace internal {
      |           ^
renfxx/b-relop.cpp:75:1: error: no member named 'internal' in namespace 'eantic::benchmark'; did you mean '::benchmark::internal'?
   75 | BENCHMARK_TEMPLATE(Inequality, renf_elem_class)->Arg(1)->Arg(2)->Arg(4);
      | ^~~~~~~~~~~~~~~~~~~~~~~~~~~~~~~~~~~~~~~~~~~~~~~
/usr/local/include/benchmark/benchmark.h:1522:11: note: expanded from macro 'BENCHMARK_TEMPLATE'
 1522 |           benchmark::internal::make_unique<              \
      |           ^~~~~~~~~~~
/usr/local/include/benchmark/benchmark.h:1362:11: note: '::benchmark::internal' declared here
 1362 | namespace internal {
      |           ^
renfxx/b-relop.cpp:84:1: error: no member named 'internal' in namespace 'eantic::benchmark'; did you mean '::benchmark::internal'?
   84 | BENCHMARK(Nonzero)->Arg(1)->Arg(2)->Arg(4);
      | ^~~~~~~~~~~~~~~~~~
/usr/local/include/benchmark/benchmark.h:1467:11: note: expanded from macro 'BENCHMARK'
 1467 |           benchmark::internal::make_unique<                           \
      |           ^~~~~~~~~~~
/usr/local/include/benchmark/benchmark.h:1362:11: note: '::benchmark::internal' declared here
 1362 | namespace internal {
      |           ^
15 errors generated.
gmake[2]: *** [Makefile:417: renfxx/b-relop.o] Error 1
gmake[2]: Leaving directory '/wrkdirs/usr/ports/math/e-antic/work/e-antic-2.0.2/libeantic/benchmark'
gmake[1]: *** [Makefile:437: all-recursive] Error 1
gmake[1]: Leaving directory '/wrkdirs/usr/ports/math/e-antic/work/e-antic-2.0.2/libeantic'
gmake: *** [Makefile:330: all-recursive] Error 1
===> Compilation failed unexpectedly.
Try to set MAKE_JOBS_UNSAFE=yes and rebuild before reporting the failure to
the maintainer.
*** Error code 1

Stop.
make: stopped in /usr/ports/math/e-antic