[package - main-i386-default][sysutils/czkawka] Failed for czkawka-9.0.0 in build

From: <pkg-fallout_at_FreeBSD.org>
Date: Wed, 26 Mar 2025 20:17:29 UTC
You are receiving this mail as a port that you maintain
is failing to build on the FreeBSD package build server.
Please investigate the failure and submit a PR to fix
build.

Maintainer:     uzsolt@FreeBSD.org
Log URL:        https://pkg-status.freebsd.org/beefy17/data/main-i386-default/pd349181bd41f_sa27328ea392/logs/czkawka-9.0.0.log
Build URL:      https://pkg-status.freebsd.org/beefy17/build.html?mastername=main-i386-default&build=pd349181bd41f_sa27328ea392
Log:

=>> Building sysutils/czkawka
build started at Wed Mar 26 20:06:59 UTC 2025
port directory: /usr/ports/sysutils/czkawka
package name: czkawka-9.0.0
building for: FreeBSD main-i386-default-job-12 15.0-CURRENT FreeBSD 15.0-CURRENT 1500034 i386
maintained by: uzsolt@FreeBSD.org
Makefile datestamp: -rw-r--r--  1 root wheel 1416 Mar 25 01:01 /usr/ports/sysutils/czkawka/Makefile
Ports top last git commit: d349181bd41
Ports top unclean checkout: no
Port dir last git commit: ca5006d0a56
Port dir unclean checkout: no
Poudriere version: poudriere-git-3.4.2-7-gf78625a5
Host OSVERSION: 1500028
Jail OSVERSION: 1500034
Job Id: 12




!!! Jail is newer than host. (Jail: 1500034, Host: 1500028) !!!
!!! This is not supported. !!!
!!! Host kernel must be same or newer than jail. !!!
!!! Expect build failures. !!!



---Begin Environment---
SHELL=/bin/sh
BLOCKSIZE=K
MAIL=/var/mail/root
MM_CHARSET=UTF-8
LANG=C.UTF-8
OSVERSION=1500034
STATUS=1
HOME=/root
PATH=/sbin:/bin:/usr/sbin:/usr/bin:/usr/local/sbin:/usr/local/bin:/root/bin
MAKE_OBJDIR_CHECK_WRITABLE=0
UNAME_m=i386
UNAME_p=i386
UNAME_r=15.0-CURRENT
LOCALBASE=/usr/local
UNAME_v=FreeBSD 15.0-CURRENT 1500034
USER=root
POUDRIERE_NAME=poudriere-git
LIBEXECPREFIX=/usr/local/libexec/poudriere
POUDRIERE_VERSION=3.4.2-7-gf78625a5
MASTERMNT=/usr/local/poudriere/data/.m/main-i386-default/ref
LC_COLLATE=C
POUDRIERE_BUILD_TYPE=bulk
PACKAGE_BUILDING=yes
SAVED_TERM=
OUTPUT_REDIRECTED_STDERR=4
OUTPUT_REDIRECTED=1
PWD=/usr/local/poudriere/data/.m/main-i386-default/12/.p
OUTPUT_REDIRECTED_STDOUT=3
P_PORTS_FEATURES=FLAVORS SUBPACKAGES SELECTED_OPTIONS
MASTERNAME=main-i386-default
SCRIPTPREFIX=/usr/local/share/poudriere
SCRIPTNAME=bulk.sh
OLDPWD=/usr/local/poudriere/data/.m/main-i386-default/ref/.p/pool
POUDRIERE_PKGNAME=poudriere-git-3.4.2-7-gf78625a5
SCRIPTPATH=/usr/local/share/poudriere/bulk.sh
POUDRIEREPATH=/usr/local/bin/poudriere
---End Environment---

---Begin Poudriere Port Flags/Env---
PORT_FLAGS=
PKGENV=
FLAVOR=
MAKE_ARGS=
---End Poudriere Port Flags/Env---

---Begin OPTIONS List---
---End OPTIONS List---

--MAINTAINER--
uzsolt@FreeBSD.org
--End MAINTAINER--

--CONFIGURE_ARGS--

--End CONFIGURE_ARGS--

--CONFIGURE_ENV--
PKG_CONFIG=pkgconf XDG_DATA_HOME=/wrkdirs/usr/ports/sysutils/czkawka/work  XDG_CONFIG_HOME=/wrkdirs/usr/ports/sysutils/czkawka/work  XDG_CACHE_HOME=/wrkdirs/usr/ports/sysutils/czkawka/work/.cache  HOME=/wrkdirs/usr/ports/sysutils/czkawka/work TMPDIR="/wrkdirs/usr/ports/sysutils/czkawka/work" PATH=/wrkdirs/usr/ports/sysutils/czkawka/work/.bin:/sbin:/bin:/usr/sbin:/usr/bin:/usr/local/sbin:/usr/local/bin:/root/bin PKG_CONFIG_LIBDIR=/wrkdirs/usr/ports/sysutils/czkawka/work/.pkgconfig:/usr/local/libdata/pkgconfig:/usr/local/share/pkgconfig:/usr/libdata/pkgconfig SHELL=/bin/sh CONFIG_SHELL=/bin/sh
--End CONFIGURE_ENV--

--MAKE_ENV--
XDG_DATA_HOME=/wrkdirs/usr/ports/sysutils/czkawka/work  XDG_CONFIG_HOME=/wrkdirs/usr/ports/sysutils/czkawka/work  XDG_CACHE_HOME=/wrkdirs/usr/ports/sysutils/czkawka/work/.cache  HOME=/wrkdirs/usr/ports/sysutils/czkawka/work TMPDIR="/wrkdirs/usr/ports/sysutils/czkawka/work" PATH=/wrkdirs/usr/ports/sysutils/czkawka/work/.bin:/sbin:/bin:/usr/sbin:/usr/bin:/usr/local/sbin:/usr/local/bin:/root/bin PKG_CONFIG_LIBDIR=/wrkdirs/usr/ports/sysutils/czkawka/work/.pkgconfig:/usr/local/libdata/pkgconfig:/usr/local/share/pkgconfig:/usr/libdata/pkgconfig MK_DEBUG_FILES=no MK_KERNEL_SYMBOLS=no SHELL=/bin/sh NO_LINT=YES PREFIX=/usr/local  LOCALBASE=/usr/local  CC="cc" CFLAGS="-O2 -pipe  -fstack-protector-strong -fno-strict-aliasing "  CPP="cpp" CPPFLAGS=""  LDFLAGS=" -fstack-protector-strong " LIBS=""  CXX="c++" CXXFLAGS="-O2 -pipe -fstack-protector-strong -fno-strict-aliasing   " BSD_INSTALL_PROGRAM="install  -s -m 555"  BSD_INSTALL_LIB="install  -s -m 0644"  BSD_INSTALL_SCRIPT="install  -m 
555"  BSD_INSTALL_DATA="install  -m 0644"  BSD_INSTALL_MAN="install  -m 444"
--End MAKE_ENV--

--PLIST_SUB--
GTK2_VERSION="2.10.0"  GTK3_VERSION="3.0.0"  GTK4_VERSION="4.0.0" OSREL=15.0 PREFIX=%D LOCALBASE=/usr/local  RESETPREFIX=/usr/local LIB32DIR=lib DOCSDIR="share/doc/czkawka"  EXAMPLESDIR="share/examples/czkawka"  DATADIR="share/czkawka"  WWWDIR="www/czkawka"  ETCDIR="etc/czkawka"
--End PLIST_SUB--

--SUB_LIST--
PREFIX=/usr/local LOCALBASE=/usr/local  DATADIR=/usr/local/share/czkawka DOCSDIR=/usr/local/share/doc/czkawka EXAMPLESDIR=/usr/local/share/examples/czkawka  WWWDIR=/usr/local/www/czkawka ETCDIR=/usr/local/etc/czkawka
--End SUB_LIST--

---Begin make.conf---
# XXX: We really need this but cannot use it while 'make checksum' does not
# try the next mirror on checksum failure.  It currently retries the same
# failed mirror and then fails rather then trying another.  It *does*
# try the next if the size is mismatched though.
#MASTER_SITE_FREEBSD=yes
# Build ALLOW_MAKE_JOBS_PACKAGES with 3 jobs
MAKE_JOBS_NUMBER=3
USE_PACKAGE_DEPENDS=yes
BATCH=yes
WRKDIRPREFIX=/wrkdirs
PORTSDIR=/usr/ports
PACKAGES=/packages
DISTDIR=/distfiles
PACKAGE_BUILDING=yes
PACKAGE_BUILDING_FLAVORS=yes
MACHINE=i386
MACHINE_ARCH=i386
ARCH=${MACHINE_ARCH}
####  ####
# XXX: We really need this but cannot use it while 'make checksum' does not
# try the next mirror on checksum failure.  It currently retries the same
# failed mirror and then fails rather then trying another.  It *does*
# try the next if the size is mismatched though.
#MASTER_SITE_FREEBSD=yes
# Build ALLOW_MAKE_JOBS_PACKAGES with 3 jobs
MAKE_JOBS_NUMBER=3
#### Misc Poudriere ####
.include "/etc/make.conf.ports_env"
GID=0
UID=0
---End make.conf---
--Resource limits--
cpu time               (seconds, -t)  unlimited
file size           (512-blocks, -f)  unlimited
data seg size           (kbytes, -d)  524288
stack size              (kbytes, -s)  65536
core file size      (512-blocks, -c)  unlimited
max memory size         (kbytes, -m)  unlimited
locked memory           (kbytes, -l)  unlimited
max user processes              (-u)  89999
open files                      (-n)  8192
virtual mem size        (kbytes, -v)  unlimited
swap limit              (kbytes, -w)  unlimited
socket buffer size       (bytes, -b)  unlimited
pseudo-terminals                (-p)  unlimited
kqueues                         (-k)  unlimited
umtx shared locks               (-o)  unlimited
pipebuf                         (-y)  unlimited
--End resource limits--
=======================<phase: check-sanity   >============================
===== env: NO_DEPENDS=yes USER=root UID=0 GID=0
===>  License CC-BY-4.0 MIT accepted by the user
===========================================================================
=======================<phase: pkg-depends    >============================
===== env: USE_PACKAGE_DEPENDS_ONLY=1 USER=root UID=0 GID=0
===>   czkawka-9.0.0 depends on file: /usr/local/sbin/pkg - not found
===>   Installing existing package /packages/All/pkg-2.0.6.pkg
[main-i386-default-job-12] Installing pkg-2.0.6...
[main-i386-default-job-12] Extracting pkg-2.0.6: .......... done
===>   czkawka-9.0.0 depends on file: /usr/local/sbin/pkg - found
===>   Returning to build of czkawka-9.0.0
===========================================================================
=======================<phase: fetch-depends  >============================
===== env: USE_PACKAGE_DEPENDS_ONLY=1 USER=root UID=0 GID=0
===========================================================================
=======================<phase: fetch          >============================
===== env: NO_DEPENDS=yes USER=root UID=0 GID=0
===>  License CC-BY-4.0 MIT accepted by the user
=> rust/crates/atk-0.18.2.crate doesn't seem to exist in /portdistfiles/.
=> Attempting to fetch https://crates.io/api/v1/crates/atk/0.18.2/download?dummy=/rust/crates/atk-0.18.2.crate
rust/crates/atk-0.18.2.crate                            33 kB   14 MBps    00s
=> rust/crates/atk-sys-0.18.2.crate doesn't seem to exist in /portdistfiles/.
=> Attempting to fetch https://crates.io/api/v1/crates/atk-sys/0.18.2/download?dummy=/rust/crates/atk-sys-0.18.2.crate
rust/crates/atk-sys-0.18.2.crate                        22 kB  123 MBps    00s
=> rust/crates/basic-toml-0.1.10.crate doesn't seem to exist in /portdistfiles/.
=> Attempting to fetch https://crates.io/api/v1/crates/basic-toml/0.1.10/download?dummy=/rust/crates/basic-toml-0.1.10.crate
rust/crates/basic-toml-0.1.10.crate                     49 kB   10 MBps    00s
=> rust/crates/bitreader-0.3.11.crate doesn't seem to exist in /portdistfiles/.
=> Attempting to fetch https://crates.io/api/v1/crates/bitreader/0.3.11/download?dummy=/rust/crates/bitreader-0.3.11.crate
rust/crates/bitreader-0.3.11.crate                      11 kB   89 MBps    00s
=> rust/crates/dispatch2-0.2.0.crate doesn't seem to exist in /portdistfiles/.
=> Attempting to fetch https://crates.io/api/v1/crates/dispatch2/0.2.0/download?dummy=/rust/crates/dispatch2-0.2.0.crate
rust/crates/dispatch2-0.2.0.crate                       37 kB  617 kBps    00s
=> rust/crates/enum-utils-0.1.2.crate doesn't seem to exist in /portdistfiles/.
=> Attempting to fetch https://crates.io/api/v1/crates/enum-utils/0.1.2/download?dummy=/rust/crates/enum-utils-0.1.2.crate
rust/crates/enum-utils-0.1.2.crate                       9 kB   93 MBps    00s
=> rust/crates/enum-utils-from-str-0.1.2.crate doesn't seem to exist in /portdistfiles/.
=> Attempting to fetch https://crates.io/api/v1/crates/enum-utils-from-str/0.1.2/download?dummy=/rust/crates/enum-utils-from-str-0.1.2.crate
rust/crates/enum-utils-from-str-0.1.2.crate           4095  B   45 MBps    00s
=> rust/crates/fast_image_resize-5.1.2.crate doesn't seem to exist in /portdistfiles/.
=> Attempting to fetch https://crates.io/api/v1/crates/fast_image_resize/5.1.2/download?dummy=/rust/crates/fast_image_resize-5.1.2.crate
rust/crates/fast_image_resize-5.1.2.crate              144 kB 1145 kBps    00s
=> rust/crates/femtovg-0.12.0.crate doesn't seem to exist in /portdistfiles/.
=> Attempting to fetch https://crates.io/api/v1/crates/femtovg/0.12.0/download?dummy=/rust/crates/femtovg-0.12.0.crate
rust/crates/femtovg-0.12.0.crate                       258 kB 1357 kBps    01s
=> rust/crates/ffmpeg_cmdline_utils-0.3.0.crate doesn't seem to exist in /portdistfiles/.
=> Attempting to fetch https://crates.io/api/v1/crates/ffmpeg_cmdline_utils/0.3.0/download?dummy=/rust/crates/ffmpeg_cmdline_utils-0.3.0.crate
rust/crates/ffmpeg_cmdline_utils-0.3.0.crate            20 kB   68 MBps    00s
=> rust/crates/ffmpeg_gst_wrapper-0.2.0.crate doesn't seem to exist in /portdistfiles/.
<snip>
42 |     pub const ZERO: Self = Self {
   |               ---- required by a bound in this associated constant

error[E0277]: the trait bound `[u64; 4]: BitViewSized` is not satisfied
  --> /wrkdirs/usr/ports/sysutils/czkawka/work/czkawka-9.0.0/cargo-crates/vid_dup_finder_lib-0.2.0/src/video_hashing/video_hash.rs:66:71
   |
66 |         let mut bitarr: BitArray<[u64; HASH_QWORDS as usize], Lsb0> = BitArray::ZERO;
   |                                                                       ^^^^^^^^ the trait `BitViewSized` is not implemented for `[u64; 4]`
   |
   = help: the trait `BitViewSized` is implemented for `[T; N]`
note: required by a bound in `bitvec::array::BitArray`
  --> /wrkdirs/usr/ports/sysutils/czkawka/work/czkawka-9.0.0/cargo-crates/bitvec-1.0.1/src/array.rs:27:5
   |
25 | pub struct BitArray<A = [usize; 1], O = Lsb0>
   |            -------- required by a bound in this struct
26 | where
27 |     A: BitViewSized,
   |        ^^^^^^^^^^^^ required by this bound in `BitArray`

error[E0599]: no method named `iter_mut` found for struct `bitvec::array::BitArray` in the current scope
  --> /wrkdirs/usr/ports/sysutils/czkawka/work/czkawka-9.0.0/cargo-crates/vid_dup_finder_lib-0.2.0/src/video_hashing/video_hash.rs:68:50
   |
68 |         for (mut bitarr_val, hash_bit) in bitarr.iter_mut().zip(dct.hash_bits()) {
   |                                                  ^^^^^^^^ method not found in `BitArray<[u64; 4]>`
   |
help: one of the expressions' fields has a method of the same name
   |
68 |         for (mut bitarr_val, hash_bit) in bitarr.data.iter_mut().zip(dct.hash_bits()) {
   |                                                  +++++

error[E0277]: the trait bound `[u64; 4]: BitViewSized` is not satisfied
  --> /wrkdirs/usr/ports/sysutils/czkawka/work/czkawka-9.0.0/cargo-crates/vid_dup_finder_lib-0.2.0/src/video_hashing/video_hash.rs:72:52
   |
72 |         let hash = Self::from_components(src_path, bitarr, duration);
   |                                                    ^^^^^^ the trait `BitViewSized` is not implemented for `[u64; 4]`
   |
   = help: the trait `BitViewSized` is implemented for `[T; N]`
note: required by a bound in `bitvec::array::BitArray`
  --> /wrkdirs/usr/ports/sysutils/czkawka/work/czkawka-9.0.0/cargo-crates/bitvec-1.0.1/src/array.rs:27:5
   |
25 | pub struct BitArray<A = [usize; 1], O = Lsb0>
   |            -------- required by a bound in this struct
26 | where
27 |     A: BitViewSized,
   |        ^^^^^^^^^^^^ required by this bound in `BitArray`

error[E0599]: the method `into_inner` exists for struct `BitArray<[u64; 4]>`, but its trait bounds were not satisfied
   --> /wrkdirs/usr/ports/sysutils/czkawka/work/czkawka-9.0.0/cargo-crates/vid_dup_finder_lib-0.2.0/src/video_hashing/video_hash.rs:172:29
    |
172 |             hash: hash_bits.into_inner(),
    |                             ^^^^^^^^^^
    |
    = note: the following trait bounds were not satisfied:
            `[u64; 4]: BitViewSized`

error[E0277]: the trait bound `[u64; 4]: BitViewSized` is not satisfied
   --> /wrkdirs/usr/ports/sysutils/czkawka/work/czkawka-9.0.0/cargo-crates/vid_dup_finder_lib-0.2.0/src/video_hashing/video_hash.rs:268:41
    |
268 |             Self::from_components(name, BitArray::new([u64::MAX; HASH_QWORDS as usize]), 0)
    |                                         ^^^^^^^^^^^^^^^^^^^^^^^^^^^^^^^^^^^^^^^^^^^^^^^ the trait `BitViewSized` is not implemented for `[u64; 4]`
    |
    = help: the trait `BitViewSized` is implemented for `[T; N]`
note: required by a bound in `bitvec::array::BitArray`
   --> /wrkdirs/usr/ports/sysutils/czkawka/work/czkawka-9.0.0/cargo-crates/bitvec-1.0.1/src/array.rs:27:5
    |
25  | pub struct BitArray<A = [usize; 1], O = Lsb0>
    |            -------- required by a bound in this struct
26  | where
27  |     A: BitViewSized,
    |        ^^^^^^^^^^^^ required by this bound in `BitArray`

error[E0277]: the trait bound `[u64; 4]: BitViewSized` is not satisfied
   --> /wrkdirs/usr/ports/sysutils/czkawka/work/czkawka-9.0.0/cargo-crates/vid_dup_finder_lib-0.2.0/src/video_hashing/video_hash.rs:268:55
    |
268 |             Self::from_components(name, BitArray::new([u64::MAX; HASH_QWORDS as usize]), 0)
    |                                         ------------- ^^^^^^^^^^^^^^^^^^^^^^^^^^^^^^^^ the trait `BitViewSized` is not implemented for `[u64; 4]`
    |                                         |
    |                                         required by a bound introduced by this call
    |
    = help: the trait `BitViewSized` is implemented for `[T; N]`
note: required by a bound in `bitvec::array::BitArray::<A, O>::new`
   --> /wrkdirs/usr/ports/sysutils/czkawka/work/czkawka-9.0.0/cargo-crates/bitvec-1.0.1/src/array.rs:38:5
    |
38  |     A: BitViewSized,
    |        ^^^^^^^^^^^^ required by this bound in `BitArray::<A, O>::new`
...
59  |     pub fn new(data: A) -> Self {
    |            --- required by a bound in this associated function

error[E0277]: the trait bound `[u64; 4]: BitViewSized` is not satisfied
   --> /wrkdirs/usr/ports/sysutils/czkawka/work/czkawka-9.0.0/cargo-crates/vid_dup_finder_lib-0.2.0/src/video_hashing/video_hash.rs:272:41
    |
272 |             Self::from_components(name, BitArray::ZERO, 0)
    |                                         ^^^^^^^^^^^^^^ the trait `BitViewSized` is not implemented for `[u64; 4]`
    |
    = help: the trait `BitViewSized` is implemented for `[T; N]`
note: required by a bound in `bitvec::array::BitArray`
   --> /wrkdirs/usr/ports/sysutils/czkawka/work/czkawka-9.0.0/cargo-crates/bitvec-1.0.1/src/array.rs:27:5
    |
25  | pub struct BitArray<A = [usize; 1], O = Lsb0>
    |            -------- required by a bound in this struct
26  | where
27  |     A: BitViewSized,
    |        ^^^^^^^^^^^^ required by this bound in `BitArray`

error[E0277]: the trait bound `[u64; 4]: BitViewSized` is not satisfied
   --> /wrkdirs/usr/ports/sysutils/czkawka/work/czkawka-9.0.0/cargo-crates/vid_dup_finder_lib-0.2.0/src/video_hashing/video_hash.rs:272:41
    |
272 |             Self::from_components(name, BitArray::ZERO, 0)
    |                                         ^^^^^^^^ the trait `BitViewSized` is not implemented for `[u64; 4]`
    |
    = help: the trait `BitViewSized` is implemented for `[T; N]`
note: required by a bound in `bitvec::array::BitArray`
   --> /wrkdirs/usr/ports/sysutils/czkawka/work/czkawka-9.0.0/cargo-crates/bitvec-1.0.1/src/array.rs:27:5
    |
25  | pub struct BitArray<A = [usize; 1], O = Lsb0>
    |            -------- required by a bound in this struct
26  | where
27  |     A: BitViewSized,
    |        ^^^^^^^^^^^^ required by this bound in `BitArray`

error[E0277]: the trait bound `[u64; 4]: BitViewSized` is not satisfied
   --> /wrkdirs/usr/ports/sysutils/czkawka/work/czkawka-9.0.0/cargo-crates/vid_dup_finder_lib-0.2.0/src/video_hashing/video_hash.rs:298:27
    |
298 |             let mut hash: BitArray<[u64; HASH_QWORDS as usize], Lsb0> = BitArray::ZERO;
    |                           ^^^^^^^^^^^^^^^^^^^^^^^^^^^^^^^^^^^^^^^^^^^ the trait `BitViewSized` is not implemented for `[u64; 4]`
    |
    = help: the trait `BitViewSized` is implemented for `[T; N]`
note: required by a bound in `bitvec::array::BitArray`
   --> /wrkdirs/usr/ports/sysutils/czkawka/work/czkawka-9.0.0/cargo-crates/bitvec-1.0.1/src/array.rs:27:5
    |
25  | pub struct BitArray<A = [usize; 1], O = Lsb0>
    |            -------- required by a bound in this struct
26  | where
27  |     A: BitViewSized,
    |        ^^^^^^^^^^^^ required by this bound in `BitArray`

error[E0277]: the trait bound `[u64; 4]: BitViewSized` is not satisfied
   --> /wrkdirs/usr/ports/sysutils/czkawka/work/czkawka-9.0.0/cargo-crates/vid_dup_finder_lib-0.2.0/src/video_hashing/video_hash.rs:298:73
    |
298 |             let mut hash: BitArray<[u64; HASH_QWORDS as usize], Lsb0> = BitArray::ZERO;
    |                                                                         ^^^^^^^^^^^^^^ the trait `BitViewSized` is not implemented for `[u64; 4]`
    |
    = help: the trait `BitViewSized` is implemented for `[T; N]`
note: required by a bound in `bitvec::array::BitArray::<A, O>::ZERO`
   --> /wrkdirs/usr/ports/sysutils/czkawka/work/czkawka-9.0.0/cargo-crates/bitvec-1.0.1/src/array.rs:38:5
    |
38  |     A: BitViewSized,
    |        ^^^^^^^^^^^^ required by this bound in `BitArray::<A, O>::ZERO`
...
42  |     pub const ZERO: Self = Self {
    |               ---- required by a bound in this associated constant

error[E0277]: the trait bound `[u64; 4]: BitViewSized` is not satisfied
   --> /wrkdirs/usr/ports/sysutils/czkawka/work/czkawka-9.0.0/cargo-crates/vid_dup_finder_lib-0.2.0/src/video_hashing/video_hash.rs:298:73
    |
298 |             let mut hash: BitArray<[u64; HASH_QWORDS as usize], Lsb0> = BitArray::ZERO;
    |                                                                         ^^^^^^^^ the trait `BitViewSized` is not implemented for `[u64; 4]`
    |
    = help: the trait `BitViewSized` is implemented for `[T; N]`
note: required by a bound in `bitvec::array::BitArray`
   --> /wrkdirs/usr/ports/sysutils/czkawka/work/czkawka-9.0.0/cargo-crates/bitvec-1.0.1/src/array.rs:27:5
    |
25  | pub struct BitArray<A = [usize; 1], O = Lsb0>
    |            -------- required by a bound in this struct
26  | where
27  |     A: BitViewSized,
    |        ^^^^^^^^^^^^ required by this bound in `BitArray`

error[E0599]: no method named `iter_mut` found for struct `bitvec::array::BitArray` in the current scope
   --> /wrkdirs/usr/ports/sysutils/czkawka/work/czkawka-9.0.0/cargo-crates/vid_dup_finder_lib-0.2.0/src/video_hashing/video_hash.rs:299:33
    |
299 |             for mut bit in hash.iter_mut().take(HASH_BITS as usize) {
    |                                 ^^^^^^^^ method not found in `BitArray<[u64; 4]>`
    |
help: one of the expressions' fields has a method of the same name
    |
299 |             for mut bit in hash.data.iter_mut().take(HASH_BITS as usize) {
    |                                 +++++

error[E0599]: the method `into_inner` exists for struct `BitArray<[u64; 4]>`, but its trait bounds were not satisfied
   --> /wrkdirs/usr/ports/sysutils/czkawka/work/czkawka-9.0.0/cargo-crates/vid_dup_finder_lib-0.2.0/src/video_hashing/video_hash.rs:304:28
    |
304 |                 hash: hash.into_inner(),
    |                            ^^^^^^^^^^
    |
    = note: the following trait bounds were not satisfied:
            `[u64; 4]: BitViewSized`

Some errors have detailed explanations: E0277, E0599.
For more information about an error, try `rustc --explain E0277`.
error: could not compile `vid_dup_finder_lib` (lib) due to 17 previous errors

Caused by:
  process didn't exit successfully: `CARGO=/usr/local/bin/cargo CARGO_CRATE_NAME=vid_dup_finder_lib CARGO_MANIFEST_DIR=/wrkdirs/usr/ports/sysutils/czkawka/work/czkawka-9.0.0/cargo-crates/vid_dup_finder_lib-0.2.0 CARGO_MANIFEST_PATH=/wrkdirs/usr/ports/sysutils/czkawka/work/czkawka-9.0.0/cargo-crates/vid_dup_finder_lib-0.2.0/Cargo.toml CARGO_PKG_AUTHORS='' CARGO_PKG_DESCRIPTION='a library to find near-duplicate video files' CARGO_PKG_HOMEPAGE='' CARGO_PKG_LICENSE='MIT OR Apache-2.0' CARGO_PKG_LICENSE_FILE='' CARGO_PKG_NAME=vid_dup_finder_lib CARGO_PKG_README=README.md CARGO_PKG_REPOSITORY='https://github.com/Farmadupe/vid_dup_finder_lib' CARGO_PKG_RUST_VERSION='' CARGO_PKG_VERSION=0.2.0 CARGO_PKG_VERSION_MAJOR=0 CARGO_PKG_VERSION_MINOR=2 CARGO_PKG_VERSION_PATCH=0 CARGO_PKG_VERSION_PRE='' LD_LIBRARY_PATH=/wrkdirs/usr/ports/sysutils/czkawka/work/target/release/deps /usr/local/bin/rustc --crate-name vid_dup_finder_lib --edition=2021 /wrkdirs/usr/ports/sysutils/czkawka/work/czkawk
a-9.0.0/cargo-crates/vid_dup_finder_lib-0.2.0/src/lib.rs --error-format=json --json=diagnostic-rendered-ansi,artifacts,future-incompat --crate-type lib --emit=dep-info,metadata,link -C opt-level=3 -C panic=abort -C linker-plugin-lto -C codegen-units=1 -C overflow-checks=on --cfg 'feature="default"' --cfg 'feature="ffmpeg_backend"' --check-cfg 'cfg(docsrs,test)' --check-cfg 'cfg(feature, values("app_only_fns", "debug_hash_generation", "default", "ffmpeg_backend", "gstreamer", "gstreamer_backend", "hash_size_10", "hash_size_6", "test-util"))' -C metadata=ea3577628d8bcf2e -C extra-filename=-7b8c9e71bc8d5fd2 --out-dir /wrkdirs/usr/ports/sysutils/czkawka/work/target/release/deps -C strip=debuginfo -L dependency=/wrkdirs/usr/ports/sysutils/czkawka/work/target/release/deps --extern bitvec=/wrkdirs/usr/ports/sysutils/czkawka/work/target/release/deps/libbitvec-b176e9dccc4d4247.rmeta --extern enum_utils=/wrkdirs/usr/ports/sysutils/czkawka/work/target/release/deps/libenum_utils-6b6f0ca
ea28ee547.so --extern ffmpeg_gst_wrapper=/wrkdirs/usr/ports/sysutils/czkawka/work/target/release/deps/libffmpeg_gst_wrapper-d9d35fad1ea652e2.rmeta --extern image=/wrkdirs/usr/ports/sysutils/czkawka/work/target/release/deps/libimage-038ddf61503f9b7d.rmeta --extern itertools=/wrkdirs/usr/ports/sysutils/czkawka/work/target/release/deps/libitertools-aceda0a48f21951a.rmeta --extern ndarray=/wrkdirs/usr/ports/sysutils/czkawka/work/target/release/deps/libndarray-e145cd4c8d958707.rmeta --extern rand=/wrkdirs/usr/ports/sysutils/czkawka/work/target/release/deps/librand-2e18e7579f78ca58.rmeta --extern rustdct=/wrkdirs/usr/ports/sysutils/czkawka/work/target/release/deps/librustdct-4b9ec031b73a1f59.rmeta --extern serde=/wrkdirs/usr/ports/sysutils/czkawka/work/target/release/deps/libserde-e7bbfd1c393f02be.rmeta --extern thiserror=/wrkdirs/usr/ports/sysutils/czkawka/work/target/release/deps/libthiserror-0c284ecdcf749240.rmeta --extern vid_dup_finder_common=/wrkdirs/usr/ports/sysutils/czkaw
ka/work/target/release/deps/libvid_dup_finder_common-05952aa61571d1ad.rmeta --cap-lints warn -C link-arg=-fstack-protector-strong` (exit status: 1)
warning: build failed, waiting for other jobs to finish...
*** Error code 101

Stop.
make: stopped making "build" in /usr/ports/sysutils/czkawka