[package - 141i386-default][net/findomain] Failed for findomain-9.0.4_10 in build

From: <pkg-fallout_at_FreeBSD.org>
Date: Sat, 15 Mar 2025 12:43:06 UTC
You are receiving this mail as a port that you maintain
is failing to build on the FreeBSD package build server.
Please investigate the failure and submit a PR to fix
build.

Maintainer:     lcook@FreeBSD.org
Log URL:        https://pkg-status.freebsd.org/beefy21/data/141i386-default/a66c1b68c862/logs/findomain-9.0.4_10.log
Build URL:      https://pkg-status.freebsd.org/beefy21/build.html?mastername=141i386-default&build=a66c1b68c862
Log:

=>> Building net/findomain
build started at Sat Mar 15 12:27:04 UTC 2025
port directory: /usr/ports/net/findomain
package name: findomain-9.0.4_10
building for: FreeBSD 141i386-default-job-25 14.1-RELEASE-p8 FreeBSD 14.1-RELEASE-p8 i386
maintained by: lcook@FreeBSD.org
Makefile datestamp: -rw-r--r--  1 root wheel 9183 Feb 25 01:01 /usr/ports/net/findomain/Makefile
Ports top last git commit: a66c1b68c
Ports top unclean checkout: no
Port dir last git commit: cf7c4b037
Port dir unclean checkout: no
Poudriere version: poudriere-git-3.4.2-7-gf78625a5
Host OSVERSION: 1500028
Jail OSVERSION: 1401000
Job Id: 25

---Begin Environment---
SHELL=/bin/sh
BLOCKSIZE=K
MAIL=/var/mail/root
MM_CHARSET=UTF-8
LANG=C.UTF-8
OSVERSION=1401000
STATUS=1
HOME=/root
PATH=/sbin:/bin:/usr/sbin:/usr/bin:/usr/local/sbin:/usr/local/bin:/root/bin
MAKE_OBJDIR_CHECK_WRITABLE=0
UNAME_m=i386
UNAME_p=i386
UNAME_r=14.1-RELEASE-p8
LOCALBASE=/usr/local
UNAME_v=FreeBSD 14.1-RELEASE-p8
USER=root
POUDRIERE_NAME=poudriere-git
LIBEXECPREFIX=/usr/local/libexec/poudriere
POUDRIERE_VERSION=3.4.2-7-gf78625a5
MASTERMNT=/usr/local/poudriere/data/.m/141i386-default/ref
LC_COLLATE=C
POUDRIERE_BUILD_TYPE=bulk
PACKAGE_BUILDING=yes
SAVED_TERM=
OUTPUT_REDIRECTED_STDERR=4
OUTPUT_REDIRECTED=1
PWD=/usr/local/poudriere/data/.m/141i386-default/25/.p
OUTPUT_REDIRECTED_STDOUT=3
P_PORTS_FEATURES=FLAVORS SUBPACKAGES SELECTED_OPTIONS
MASTERNAME=141i386-default
SCRIPTPREFIX=/usr/local/share/poudriere
SCRIPTNAME=bulk.sh
OLDPWD=/usr/local/poudriere/data/.m/141i386-default/ref/.p/pool
POUDRIERE_PKGNAME=poudriere-git-3.4.2-7-gf78625a5
SCRIPTPATH=/usr/local/share/poudriere/bulk.sh
POUDRIEREPATH=/usr/local/bin/poudriere
---End Environment---

---Begin Poudriere Port Flags/Env---
PORT_FLAGS=
PKGENV=
FLAVOR=
MAKE_ARGS=
---End Poudriere Port Flags/Env---

---Begin OPTIONS List---
===> The following configuration options are available for findomain-9.0.4_10:
     DOCS=on: Build and/or install documentation
     PGSQL=off: Enable subdomain monitoring support
     SCREENSHOT=off: Enable website screenshot support (uses headless chrome)
===> Use 'make config' to modify these settings
---End OPTIONS List---

--MAINTAINER--
lcook@FreeBSD.org
--End MAINTAINER--

--CONFIGURE_ARGS--

--End CONFIGURE_ARGS--

--CONFIGURE_ENV--
PKG_CONFIG=pkgconf MAKE=/usr/local/bin/gmake ac_cv_path_PERL=/usr/local/bin/perl ac_cv_path_PERL_PATH=/usr/local/bin/perl  PERL_USE_UNSAFE_INC=1 XDG_DATA_HOME=/wrkdirs/usr/ports/net/findomain/work  XDG_CONFIG_HOME=/wrkdirs/usr/ports/net/findomain/work  XDG_CACHE_HOME=/wrkdirs/usr/ports/net/findomain/work/.cache  HOME=/wrkdirs/usr/ports/net/findomain/work TMPDIR="/wrkdirs/usr/ports/net/findomain/work" PATH=/wrkdirs/usr/ports/net/findomain/work/.bin:/sbin:/bin:/usr/sbin:/usr/bin:/usr/local/sbin:/usr/local/bin:/root/bin PKG_CONFIG_LIBDIR=/wrkdirs/usr/ports/net/findomain/work/.pkgconfig:/usr/local/libdata/pkgconfig:/usr/local/share/pkgconfig:/usr/libdata/pkgconfig SHELL=/bin/sh CONFIG_SHELL=/bin/sh
--End CONFIGURE_ENV--

--MAKE_ENV--
PERL_USE_UNSAFE_INC=1 OPENSSLBASE=/usr OPENSSLDIR=/etc/ssl OPENSSLINC=/usr/include OPENSSLLIB=/usr/lib XDG_DATA_HOME=/wrkdirs/usr/ports/net/findomain/work  XDG_CONFIG_HOME=/wrkdirs/usr/ports/net/findomain/work  XDG_CACHE_HOME=/wrkdirs/usr/ports/net/findomain/work/.cache  HOME=/wrkdirs/usr/ports/net/findomain/work TMPDIR="/wrkdirs/usr/ports/net/findomain/work" PATH=/wrkdirs/usr/ports/net/findomain/work/.bin:/sbin:/bin:/usr/sbin:/usr/bin:/usr/local/sbin:/usr/local/bin:/root/bin PKG_CONFIG_LIBDIR=/wrkdirs/usr/ports/net/findomain/work/.pkgconfig:/usr/local/libdata/pkgconfig:/usr/local/share/pkgconfig:/usr/libdata/pkgconfig MK_DEBUG_FILES=no MK_KERNEL_SYMBOLS=no SHELL=/bin/sh NO_LINT=YES PREFIX=/usr/local  LOCALBASE=/usr/local  CC="cc" CFLAGS="-O2 -pipe  -fstack-protector-strong -fno-strict-aliasing "  CPP="cpp" CPPFLAGS=""  LDFLAGS="  -fstack-protector-strong " LIBS=""  CXX="c++" CXXFLAGS="-O2 -pipe -fstack-protector-strong -fno-strict-aliasing  " BSD_INSTALL_PROGRAM="install  -
s -m 555"  BSD_INSTALL_LIB="install  -s -m 0644"  BSD_INSTALL_SCRIPT="install  -m 555"  BSD_INSTALL_DATA="install  -m 0644"  BSD_INSTALL_MAN="install  -m 444"
--End MAKE_ENV--

--PLIST_SUB--
PORTDOCS="" OSREL=14.1 PREFIX=%D LOCALBASE=/usr/local  RESETPREFIX=/usr/local LIB32DIR=lib PERL_VERSION=5.36.3  PERL_VER=5.36  PERL5_MAN1=lib/perl5/site_perl/man/man1  PERL5_MAN3=lib/perl5/site_perl/man/man3  SITE_PERL=lib/perl5/site_perl  SITE_ARCH=lib/perl5/site_perl/mach/5.36 DOCSDIR="share/doc/findomain"  EXAMPLESDIR="share/examples/findomain"  DATADIR="share/findomain"  WWWDIR="www/findomain"  ETCDIR="etc/findomain"
--End PLIST_SUB--

--SUB_LIST--
 PREFIX=/usr/local LOCALBASE=/usr/local  DATADIR=/usr/local/share/findomain DOCSDIR=/usr/local/share/doc/findomain EXAMPLESDIR=/usr/local/share/examples/findomain  WWWDIR=/usr/local/www/findomain ETCDIR=/usr/local/etc/findomain
--End SUB_LIST--

---Begin make.conf---
USE_PACKAGE_DEPENDS=yes
BATCH=yes
WRKDIRPREFIX=/wrkdirs
PORTSDIR=/usr/ports
PACKAGES=/packages
DISTDIR=/distfiles
PACKAGE_BUILDING=yes
PACKAGE_BUILDING_FLAVORS=yes
MACHINE=i386
MACHINE_ARCH=i386
ARCH=${MACHINE_ARCH}
####  ####
# XXX: We really need this but cannot use it while 'make checksum' does not
# try the next mirror on checksum failure.  It currently retries the same
# failed mirror and then fails rather then trying another.  It *does*
# try the next if the size is mismatched though.
#MASTER_SITE_FREEBSD=yes
# Build ALLOW_MAKE_JOBS_PACKAGES with 3 jobs
MAKE_JOBS_NUMBER=3
#### Misc Poudriere ####
.include "/etc/make.conf.ports_env"
GID=0
UID=0
DISABLE_MAKE_JOBS=poudriere
---End make.conf---
--Resource limits--
cpu time               (seconds, -t)  unlimited
file size           (512-blocks, -f)  unlimited
data seg size           (kbytes, -d)  524288
stack size              (kbytes, -s)  65536
core file size      (512-blocks, -c)  unlimited
max memory size         (kbytes, -m)  unlimited
locked memory           (kbytes, -l)  unlimited
max user processes              (-u)  89999
open files                      (-n)  8192
virtual mem size        (kbytes, -v)  unlimited
swap limit              (kbytes, -w)  unlimited
socket buffer size       (bytes, -b)  unlimited
pseudo-terminals                (-p)  unlimited
kqueues                         (-k)  unlimited
umtx shared locks               (-o)  unlimited
--End resource limits--
=======================<phase: check-sanity   >============================
===== env: NO_DEPENDS=yes USER=root UID=0 GID=0
===>  License GPLv3 accepted by the user
===========================================================================
=======================<phase: pkg-depends    >============================
===== env: USE_PACKAGE_DEPENDS_ONLY=1 USER=root UID=0 GID=0
===>   findomain-9.0.4_10 depends on file: /usr/local/sbin/pkg - not found
===>   Installing existing package /packages/All/pkg-2.0.6.pkg
[141i386-default-job-25] Installing pkg-2.0.6...
[141i386-default-job-25] Extracting pkg-2.0.6: .......... done
===>   findomain-9.0.4_10 depends on file: /usr/local/sbin/pkg - found
===>   Returning to build of findomain-9.0.4_10
===========================================================================
=======================<phase: fetch-depends  >============================
===== env: USE_PACKAGE_DEPENDS_ONLY=1 USER=root UID=0 GID=0
===========================================================================
=======================<phase: fetch          >============================
===== env: NO_DEPENDS=yes USER=root UID=0 GID=0
===>  License GPLv3 accepted by the user
===> Fetching all distfiles required by findomain-9.0.4_10 for building
===========================================================================
=======================<phase: checksum       >============================
===== env: NO_DEPENDS=yes USER=root UID=0 GID=0
===>  License GPLv3 accepted by the user
===> Fetching all distfiles required by findomain-9.0.4_10 for building
=> SHA256 Checksum OK for rust/crates/addr-0.15.6.crate.
=> SHA256 Checksum OK for rust/crates/addr2line-0.21.0.crate.
=> SHA256 Checksum OK for rust/crates/adler-1.0.2.crate.
=> SHA256 Checksum OK for rust/crates/aho-corasick-1.1.2.crate.
=> SHA256 Checksum OK for rust/crates/ansi_term-0.12.1.crate.
=> SHA256 Checksum OK for rust/crates/anyhow-1.0.75.crate.
=> SHA256 Checksum OK for rust/crates/arrayvec-0.5.2.crate.
=> SHA256 Checksum OK for rust/crates/async-compression-0.4.5.crate.
=> SHA256 Checksum OK for rust/crates/async-recursion-1.0.5.crate.
=> SHA256 Checksum OK for rust/crates/async-trait-0.1.74.crate.
=> SHA256 Checksum OK for rust/crates/atty-0.2.14.crate.
=> SHA256 Checksum OK for rust/crates/auto_generate_cdp-0.3.4.crate.
=> SHA256 Checksum OK for rust/crates/autocfg-0.1.8.crate.
=> SHA256 Checksum OK for rust/crates/autocfg-1.1.0.crate.
=> SHA256 Checksum OK for rust/crates/backtrace-0.3.69.crate.
=> SHA256 Checksum OK for rust/crates/base64-0.9.3.crate.
=> SHA256 Checksum OK for rust/crates/base64-0.10.1.crate.
=> SHA256 Checksum OK for rust/crates/base64-0.21.5.crate.
=> SHA256 Checksum OK for rust/crates/bitflags-1.3.2.crate.
=> SHA256 Checksum OK for rust/crates/bitflags-2.4.1.crate.
=> SHA256 Checksum OK for rust/crates/block-buffer-0.10.4.crate.
=> SHA256 Checksum OK for rust/crates/bumpalo-3.14.0.crate.
=> SHA256 Checksum OK for rust/crates/byteorder-1.5.0.crate.
=> SHA256 Checksum OK for rust/crates/bytes-1.5.0.crate.
=> SHA256 Checksum OK for rust/crates/cc-1.0.83.crate.
=> SHA256 Checksum OK for rust/crates/cfg-if-1.0.0.crate.
=> SHA256 Checksum OK for rust/crates/clap-2.34.0.crate.
=> SHA256 Checksum OK for rust/crates/cloudabi-0.0.3.crate.
=> SHA256 Checksum OK for rust/crates/config-0.11.0.crate.
=> SHA256 Checksum OK for rust/crates/convert_case-0.4.0.crate.
=> SHA256 Checksum OK for rust/crates/core-foundation-0.9.4.crate.
=> SHA256 Checksum OK for rust/crates/core-foundation-sys-0.8.6.crate.
=> SHA256 Checksum OK for rust/crates/cpufeatures-0.2.11.crate.
=> SHA256 Checksum OK for rust/crates/crc32fast-1.3.2.crate.
=> SHA256 Checksum OK for rust/crates/crossbeam-0.8.2.crate.
=> SHA256 Checksum OK for rust/crates/crossbeam-channel-0.5.8.crate.
=> SHA256 Checksum OK for rust/crates/crossbeam-deque-0.8.3.crate.
<snip>
    | ---------------------------- in this macro invocation
    |
    = help: consider using a Cargo feature instead
    = help: or consider adding in `Cargo.toml` the `check-cfg` lint config for the lint:
             [lints.rust]
             unexpected_cfgs = { level = "warn", check-cfg = ['cfg(std)'] }
    = help: or consider adding `println!("cargo::rustc-check-cfg=cfg(std)");` to the top of the `build.rs`
    = note: see <https://doc.rust-lang.org/nightly/rustc/check-cfg/cargo-specifics.html> for more information about checking conditional configuration
    = note: this warning originates in the macro `scalar_float_impl` (in Nightly builds, run with -Z macro-backtrace for more info)

warning: unexpected `cfg` condition name: `std`
   --> /wrkdirs/usr/ports/net/findomain/work/Findomain-9.0.4/cargo-crates/rand-0.6.5/src/distributions/utils.rs:290:19
    |
290 |         #[cfg(not(std))]
    |                   ^^^ help: found config with similar value: `feature = "std"`
...
349 | scalar_float_impl!(f64, u64);
    | ---------------------------- in this macro invocation
    |
    = help: consider using a Cargo feature instead
    = help: or consider adding in `Cargo.toml` the `check-cfg` lint config for the lint:
             [lints.rust]
             unexpected_cfgs = { level = "warn", check-cfg = ['cfg(std)'] }
    = help: or consider adding `println!("cargo::rustc-check-cfg=cfg(std)");` to the top of the `build.rs`
    = note: see <https://doc.rust-lang.org/nightly/rustc/check-cfg/cargo-specifics.html> for more information about checking conditional configuration
    = note: this warning originates in the macro `scalar_float_impl` (in Nightly builds, run with -Z macro-backtrace for more info)

warning: unexpected `cfg` condition name: `rustc_1_26`
  --> /wrkdirs/usr/ports/net/findomain/work/Findomain-9.0.4/cargo-crates/rand-0.6.5/src/rngs/small.rs:13:15
   |
13 | #[cfg(all(all(rustc_1_26, not(target_os = "emscripten")), target_pointer_width = "64"))]
   |               ^^^^^^^^^^
   |
   = help: consider using a Cargo feature instead
   = help: or consider adding in `Cargo.toml` the `check-cfg` lint config for the lint:
            [lints.rust]
            unexpected_cfgs = { level = "warn", check-cfg = ['cfg(rustc_1_26)'] }
   = help: or consider adding `println!("cargo::rustc-check-cfg=cfg(rustc_1_26)");` to the top of the `build.rs`
   = note: see <https://doc.rust-lang.org/nightly/rustc/check-cfg/cargo-specifics.html> for more information about checking conditional configuration

warning: unexpected `cfg` condition name: `rustc_1_26`
  --> /wrkdirs/usr/ports/net/findomain/work/Findomain-9.0.4/cargo-crates/rand-0.6.5/src/rngs/small.rs:15:19
   |
15 | #[cfg(not(all(all(rustc_1_26, not(target_os = "emscripten")), target_pointer_width = "64")))]
   |                   ^^^^^^^^^^
   |
   = help: consider using a Cargo feature instead
   = help: or consider adding in `Cargo.toml` the `check-cfg` lint config for the lint:
            [lints.rust]
            unexpected_cfgs = { level = "warn", check-cfg = ['cfg(rustc_1_26)'] }
   = help: or consider adding `println!("cargo::rustc-check-cfg=cfg(rustc_1_26)");` to the top of the `build.rs`
   = note: see <https://doc.rust-lang.org/nightly/rustc/check-cfg/cargo-specifics.html> for more information about checking conditional configuration

warning: unexpected `cfg` condition name: `rustc_1_26`
   --> /wrkdirs/usr/ports/net/findomain/work/Findomain-9.0.4/cargo-crates/rand-0.6.5/src/deprecated.rs:154:15
    |
154 |     #[cfg(all(rustc_1_26, not(target_os = "emscripten")))]
    |               ^^^^^^^^^^
    |
    = help: consider using a Cargo feature instead
    = help: or consider adding in `Cargo.toml` the `check-cfg` lint config for the lint:
             [lints.rust]
             unexpected_cfgs = { level = "warn", check-cfg = ['cfg(rustc_1_26)'] }
    = help: or consider adding `println!("cargo::rustc-check-cfg=cfg(rustc_1_26)");` to the top of the `build.rs`
    = note: see <https://doc.rust-lang.org/nightly/rustc/check-cfg/cargo-specifics.html> for more information about checking conditional configuration

warning: unexpected `cfg` condition name: `rustc_1_26`
   --> /wrkdirs/usr/ports/net/findomain/work/Findomain-9.0.4/cargo-crates/rand-0.6.5/src/deprecated.rs:159:15
    |
159 |     #[cfg(all(rustc_1_26, not(target_os = "emscripten")))]
    |               ^^^^^^^^^^
    |
    = help: consider using a Cargo feature instead
    = help: or consider adding in `Cargo.toml` the `check-cfg` lint config for the lint:
             [lints.rust]
             unexpected_cfgs = { level = "warn", check-cfg = ['cfg(rustc_1_26)'] }
    = help: or consider adding `println!("cargo::rustc-check-cfg=cfg(rustc_1_26)");` to the top of the `build.rs`
    = note: see <https://doc.rust-lang.org/nightly/rustc/check-cfg/cargo-specifics.html> for more information about checking conditional configuration

warning: this `#[deprecated]` annotation has no effect
   --> /wrkdirs/usr/ports/net/findomain/work/Findomain-9.0.4/cargo-crates/rand-0.6.5/src/distributions/mod.rs:439:1
    |
439 | #[deprecated(since="0.6.0", note="use WeightedIndex instead")]
    | ^^^^^^^^^^^^^^^^^^^^^^^^^^^^^^^^^^^^^^^^^^^^^^^^^^^^^^^^^^^^^^ help: remove the unnecessary deprecation attribute
    |
    = note: `#[warn(useless_deprecated)]` on by default

warning: use of deprecated constant `std::sync::atomic::ATOMIC_USIZE_INIT`: the `new` function is now preferred
   --> /wrkdirs/usr/ports/net/findomain/work/Findomain-9.0.4/cargo-crates/rand-0.6.5/src/rngs/adapter/reseeding.rs:289:42
    |
289 |     use std::sync::atomic::{AtomicUsize, ATOMIC_USIZE_INIT, Ordering};
    |                                          ^^^^^^^^^^^^^^^^^
    |
    = note: `#[warn(deprecated)]` on by default

warning: use of deprecated constant `std::sync::atomic::ATOMIC_BOOL_INIT`: the `new` function is now preferred
   --> /wrkdirs/usr/ports/net/findomain/work/Findomain-9.0.4/cargo-crates/rand-0.6.5/src/rngs/adapter/reseeding.rs:290:41
    |
290 |     use std::sync::atomic::{AtomicBool, ATOMIC_BOOL_INIT};
    |                                         ^^^^^^^^^^^^^^^^

warning: use of deprecated constant `std::sync::atomic::ATOMIC_USIZE_INIT`: the `new` function is now preferred
   --> /wrkdirs/usr/ports/net/findomain/work/Findomain-9.0.4/cargo-crates/rand-0.6.5/src/rngs/adapter/reseeding.rs:304:54
    |
304 |     static RESEEDING_RNG_FORK_COUNTER: AtomicUsize = ATOMIC_USIZE_INIT;
    |                                                      ^^^^^^^^^^^^^^^^^
    |
help: replace the use of the deprecated constant
    |
304 |     static RESEEDING_RNG_FORK_COUNTER: AtomicUsize = AtomicUsize::new(0);
    |                                                      ~~~~~~~~~~~~~~~~~~~

warning: use of deprecated constant `std::sync::atomic::ATOMIC_BOOL_INIT`: the `new` function is now preferred
   --> /wrkdirs/usr/ports/net/findomain/work/Findomain-9.0.4/cargo-crates/rand-0.6.5/src/rngs/adapter/reseeding.rs:310:50
    |
310 |     static FORK_HANDLER_REGISTERED: AtomicBool = ATOMIC_BOOL_INIT;
    |                                                  ^^^^^^^^^^^^^^^^
    |
help: replace the use of the deprecated constant
    |
310 |     static FORK_HANDLER_REGISTERED: AtomicBool = AtomicBool::new(false);
    |                                                  ~~~~~~~~~~~~~~~~~~~~~~

warning: trait objects without an explicit `dyn` are deprecated
   --> /wrkdirs/usr/ports/net/findomain/work/Findomain-9.0.4/cargo-crates/rand-0.6.5/src/distributions/weighted.rs:221:32
    |
221 |     fn cause(&self) -> Option<&::std::error::Error> {
    |                                ^^^^^^^^^^^^^^^^^^^
    |
    = warning: this is accepted in the current edition (Rust 2015) but is a hard error in Rust 2021!
    = note: for more information, see <https://doc.rust-lang.org/nightly/edition-guide/rust-2021/warnings-promoted-to-error.html>
    = note: `#[warn(bare_trait_objects)]` on by default
help: if this is a dyn-compatible trait, use `dyn`
    |
221 |     fn cause(&self) -> Option<&dyn (::std::error::Error)> {
    |                                +++++                   +

warning: trait `Float` is never used
   --> /wrkdirs/usr/ports/net/findomain/work/Findomain-9.0.4/cargo-crates/rand-0.6.5/src/distributions/utils.rs:251:18
    |
251 | pub(crate) trait Float : Sized {
    |                  ^^^^^
    |
    = note: `#[warn(dead_code)]` on by default

warning: associated items `lanes`, `extract`, and `replace` are never used
   --> /wrkdirs/usr/ports/net/findomain/work/Findomain-9.0.4/cargo-crates/rand-0.6.5/src/distributions/utils.rs:264:8
    |
262 | pub(crate) trait FloatAsSIMD : Sized {
    |                  ----------- associated items in this trait
263 |     #[inline(always)]
264 |     fn lanes() -> usize { 1 }
    |        ^^^^^
...
268 |     fn extract(self, index: usize) -> Self { debug_assert_eq!(index, 0); self }
    |        ^^^^^^^
269 |     #[inline(always)]
270 |     fn replace(self, index: usize, new_value: Self) -> Self { debug_assert_eq!(index, 0); new_value }
    |        ^^^^^^^

warning: method `all` is never used
   --> /wrkdirs/usr/ports/net/findomain/work/Findomain-9.0.4/cargo-crates/rand-0.6.5/src/distributions/utils.rs:275:8
    |
273 | pub(crate) trait BoolAsSIMD : Sized {
    |                  ---------- method in this trait
274 |     fn any(self) -> bool;
275 |     fn all(self) -> bool;
    |        ^^^

warning: `rand` (lib) generated 35 warnings
   Compiling headless_chrome v0.9.0 (/wrkdirs/usr/ports/net/findomain/work/rust-headless-chrome-61ce783806e5d75a03f731330edae6156bb0a2e0)
     Running `CARGO=/usr/local/bin/cargo CARGO_CRATE_NAME=build_script_build CARGO_MANIFEST_DIR=/wrkdirs/usr/ports/net/findomain/work/rust-headless-chrome-61ce783806e5d75a03f731330edae6156bb0a2e0 CARGO_MANIFEST_PATH=/wrkdirs/usr/ports/net/findomain/work/rust-headless-chrome-61ce783806e5d75a03f731330edae6156bb0a2e0/Cargo.toml CARGO_PKG_AUTHORS='Alistair Roche <alistair@sunburnt.country>' CARGO_PKG_DESCRIPTION='Control Chrome programatically' CARGO_PKG_HOMEPAGE='https://github.com/atroche/rust-headless-chrome' CARGO_PKG_LICENSE=MIT CARGO_PKG_LICENSE_FILE='' CARGO_PKG_NAME=headless_chrome CARGO_PKG_README=README.md CARGO_PKG_REPOSITORY='https://github.com/atroche/rust-headless-chrome' CARGO_PKG_RUST_VERSION='' CARGO_PKG_VERSION=0.9.0 CARGO_PKG_VERSION_MAJOR=0 CARGO_PKG_VERSION_MINOR=9 CARGO_PKG_VERSION_PATCH=0 CARGO_PKG_VERSION_PRE='' LD_LIBRARY_PATH=/wrkdirs/usr/ports/net/findomain/work/target/release/deps /usr/local/bin/rustc --crate-name build_script_build --edition=2018 /wr
kdirs/usr/ports/net/findomain/work/rust-headless-chrome-61ce783806e5d75a03f731330edae6156bb0a2e0/build.rs --error-format=json --json=diagnostic-rendered-ansi,artifacts,future-incompat --crate-type bin --emit=dep-info,link -C embed-bitcode=no -C debug-assertions=off --cfg 'feature="default"' --check-cfg 'cfg(docsrs,test)' --check-cfg 'cfg(feature, values("default", "directories", "fetch", "nightly", "ureq", "walkdir", "zip"))' -C metadata=f243fb9bf0afc7d8 -C extra-filename=-df39076f8a563d06 --out-dir /wrkdirs/usr/ports/net/findomain/work/target/release/build/headless_chrome-df39076f8a563d06 -C strip=debuginfo -L dependency=/wrkdirs/usr/ports/net/findomain/work/target/release/deps --extern auto_generate_cdp=/wrkdirs/usr/ports/net/findomain/work/target/release/deps/libauto_generate_cdp-28bd3947b96c2309.rlib -C link-arg=-fstack-protector-strong -L native=/wrkdirs/usr/ports/net/findomain/work/target/release/build/ring-eb1bcc3279477a30/out -L native=/wrkdirs/usr/ports/net/findomai
n/work/target/release/build/openssl-sys-7b18dc1ab1847708/out/openssl-build/install/lib`
error: linking with `cc` failed: exit status: 1
  |
  = note: LC_ALL="C" PATH="/usr/local/lib/rustlib/i686-unknown-freebsd/bin:/wrkdirs/usr/ports/net/findomain/work/.bin:/sbin:/bin:/usr/sbin:/usr/bin:/usr/local/sbin:/usr/local/bin:/root/bin" VSLANG="1033" "cc" "-m32" "-Wl,-znotext" "/wrkdirs/usr/ports/net/findomain/work/rustcKrjzb3/symbols.o" "<2 object files omitted>" "-Wl,--as-needed" "-Wl,-Bstatic" "/wrkdirs/usr/ports/net/findomain/work/target/release/deps/{libauto_generate_cdp-28bd3947b96c2309.rlib,libreqwest-fa9cdb7b764efdb8.rlib,librustls_pemfile-acc17f5eaa90ce5d.rlib,libhyper_rustls-5c5843c33afa9220.rlib,libhyper_tls-d4f12fb1a03fe5b7.rlib,libwebpki_roots-f0258ff0bd1572ba.rlib,libbase64-2bbea4b517c6d40f.rlib,libtrust_dns_resolver-fd77534fb623184f.rlib,libresolv_conf-faeba7891fcd62c3.rlib,libhostname-1c9d58bf550df916.rlib,libmatch_cfg-4869d3fea9d2b633.rlib,libquick_error-ab15d4590cc18fc9.rlib,liblru_cache-a217e15a008387ce.rlib,liblinked_hash_map-46c18108c25f4deb.rlib,libtrust_dns_proto-baf12b6cfcb74d7f.rlib,librand-eeb30
24ba5d10d7c.rlib,librand_chacha-21446f87fd37c5c8.rlib,libppv_lite86-46c2eb894b084ef2.rlib,librand_core-37b4387c2bf0a31a.rlib,libdata_encoding-5202e6d8b7a6674d.rlib,libipnet-d4942ba273456ffb.rlib,libidna-4dda95d60b7e4781.rlib,libthiserror-28ca240be7320766.rlib,libtokio_native_tls-1e3994b48ba8e4e6.rlib,libtokio_rustls-23e47e5f65268a83.rlib,libserde_urlencoded-0ab67c5c603fbb0f.rlib,libmime-056309147a3813ec.rlib,libencoding_rs-d614776a0cad67ed.rlib,libasync_compression-9cdd30662eb28509.rlib,libflate2-845028777a9dfdf2.rlib,libminiz_oxide-0f3b848098963620.rlib,libadler-01a9e9473d225b3d.rlib,libcrc32fast-2fd3fc09beb999b4.rlib,librustls-f05d908648797904.rlib,libsct-95672de966656fd6.rlib,libwebpki-a58a0adc28bdad5b.rlib,libring-916a6a9352074abe.rlib,libgetrandom-6e9f341f1c075e74.rlib,libspin-a49e87fe1a0a6ac7.rlib,libuntrusted-3e8b2796170c5754.rlib,libnative_tls-9ed3081b046ca496.rlib,libopenssl_probe-2b1c4717e6dc6c77.rlib,libopenssl-b23c58d2db11e6cd.rlib,libbitflags-f81e69be55baec26.rl
ib,libforeign_types-0beccf77350b2f88.rlib,libforeign_types_shared-18d6703354dcdf7c.rlib,libopenssl_sys-5b1068e9d141603f.rlib,libhyper-547168cd6d7f4829.rlib,libwant-de9b230575e06c16.rlib,libtry_lock-0f45ae7295da0b70.rlib,libsocket2-2457ea3844fcb6fa.rlib,libhttparse-b59b6dba6cbe04cb.rlib,libh2-d358745b71211dae.rlib,libindexmap-7f2ffe950b02958e.rlib,libequivalent-c3e128d39ea8c333.rlib,libhashbrown-0351a37ac2d7489f.rlib,libtokio_util-f60fce768b7e9c09.rlib,libtower_service-485a3788f31b0b55.rlib,libtracing-a3d2cba3806b6510.rlib,libtracing_core-8879d6dd1839eefa.rlib,libonce_cell-2b7eb4d34f039fe0.rlib,libtokio-ec3cb5c90dee876f.rlib,libsignal_hook_registry-ea01bf5e7cf6eb61.rlib,libnum_cpus-5147602983c526b9.rlib,libsocket2-ec85d1692479ded1.rlib,libmio-e020aedbec82963c.rlib,libparking_lot-76f71197e9437ae1.rlib,libparking_lot_core-b9e0f10dcc8cb7f0.rlib,liblibc-1032a2dca9058337.rlib,libcfg_if-016913a405c7a04c.rlib,libsmallvec-d37ab53b6f635299.rlib,liblock_api-27f878485ba3f518.rlib,libsco
peguard-e3a885c4958d25f6.rlib,libhttp_body-559016360134c428.rlib,liblog-5b9776f68f87cfb0.rlib,libfutures_util-eb440fc1f8cfb927.rlib,libmemchr-a38de2cc6348cdd7.rlib,libfutures_io-99d6d7416ea7660e.rlib,libslab-4529ac7ec8a4f931.rlib,libfutures_channel-442581d376110e0a.rlib,libpin_project_lite-acf48fbfcc2b8f97.rlib,libfutures_sink-a597605abb4a97f7.rlib,libfutures_task-7f0186a961aca7b4.rlib,libpin_utils-c42305a5a764b280.rlib,libfutures_core-622237f9f385f3a4.rlib,liburl-a9cf9349b5a8caca.rlib,libidna-9e6bf9b83a3a66c7.rlib,libunicode_normalization-d1954b4fab497230.rlib,libtinyvec-028b9da72d70e785.rlib,libtinyvec_macros-bd46966b26b7495c.rlib,libunicode_bidi-63ba1e6ef6c77b1a.rlib,libform_urlencoded-3ef2049f383d0752.rlib,libpercent_encoding-b5b8c24865bbb39b.rlib,libhttp-2d474138132b23db.rlib,libbytes-ac8e26a1b6b79f1f.rlib,libfnv-4fc8c265fdeaa0c7.rlib,libconvert_case-8a8239cb69161f18.rlib,libquote-f87f82b41e1f0efe.rlib,libserde_json-7301d77d76210ba7.rlib,libryu-85ec05edaeae7f39.rlib,lib
itoa-8e58a06cac9e16c5.rlib,libserde-5ad954b71549d46c.rlib,libproc_macro2-4d63e776de0310ba.rlib,libunicode_ident-d65c20c8ee6b92ff.rlib}" "/usr/local/lib/rustlib/i686-unknown-freebsd/lib/{libproc_macro-ad7e3e564d81ca58.rlib,libstd-c20998527f95aca8.rlib,libpanic_unwind-51417d414dbe90d2.rlib,libobject-d4628045f44879f0.rlib,libmemchr-85f7d2236c6e6c9a.rlib,libaddr2line-8536af282e8d4d29.rlib,libgimli-ff0859bc3c529608.rlib,librustc_demangle-fa727ddb2fd9253f.rlib,libstd_detect-6247a256d3197b66.rlib,libhashbrown-a78b54aa6859fc1c.rlib,librustc_std_workspace_alloc-229474f421ab02fe.rlib,libminiz_oxide-b99d2651890daead.rlib,libadler-ad37adaf2cdf1415.rlib,libunwind-6ea880cd92c52dce.rlib,libcfg_if-99ec84d906cfe4c9.rlib,liblibc-d3a113a37e76fbc3.rlib,liballoc-7a3bbd0f3838bd01.rlib,librustc_std_workspace_core-20a724e3c2b625bc.rlib,libcore-4cce86e93f9541bc.rlib,libcompiler_builtins-d1b3c23bdae48c74.rlib}" "-Wl,-Bdynamic" "-lrt" "-lutil" "-lexecinfo" "-lkvm" "-lmemstat" "-lkvm" "-lutil" "-lprocs
tat" "-lrt" "-ldevstat" "-lexecinfo" "-lpthread" "-lgcc_s" "-lc" "-lm" "-lrt" "-lpthread" "-lrt" "-lutil" "-lexecinfo" "-lkvm" "-lmemstat" "-lkvm" "-lutil" "-lprocstat" "-lrt" "-ldevstat" "-Wl,--eh-frame-hdr" "-Wl,-z,noexecstack" "-L" "/wrkdirs/usr/ports/net/findomain/work/target/release/build/ring-eb1bcc3279477a30/out" "-L" "/wrkdirs/usr/ports/net/findomain/work/target/release/build/openssl-sys-7b18dc1ab1847708/out/openssl-build/install/lib" "-o" "/wrkdirs/usr/ports/net/findomain/work/target/release/build/headless_chrome-df39076f8a563d06/build_script_build-df39076f8a563d06" "-Wl,--gc-sections" "-pie" "-Wl,-z,relro,-z,now" "-Wl,--strip-debug" "-nodefaultlibs" "-fstack-protector-strong"
  = note: some arguments are omitted. use `--verbose` to show all linker arguments
  = note: ld: error: undefined symbol: __atomic_is_lock_free
          >>> referenced by threads_pthread.c
          >>>               libcrypto-lib-threads_pthread.o:(CRYPTO_atomic_or) in archive /wrkdirs/usr/ports/net/findomain/work/target/release/deps/libopenssl_sys-5b1068e9d141603f.rlib
          >>> referenced by threads_pthread.c
          >>>               libcrypto-lib-threads_pthread.o:(CRYPTO_atomic_load) in archive /wrkdirs/usr/ports/net/findomain/work/target/release/deps/libopenssl_sys-5b1068e9d141603f.rlib
          
          ld: error: undefined symbol: __atomic_fetch_or_8
          >>> referenced by threads_pthread.c
          >>>               libcrypto-lib-threads_pthread.o:(CRYPTO_atomic_or) in archive /wrkdirs/usr/ports/net/findomain/work/target/release/deps/libopenssl_sys-5b1068e9d141603f.rlib
          
          ld: error: undefined symbol: __atomic_load
          >>> referenced by threads_pthread.c
          >>>               libcrypto-lib-threads_pthread.o:(CRYPTO_atomic_load) in archive /wrkdirs/usr/ports/net/findomain/work/target/release/deps/libopenssl_sys-5b1068e9d141603f.rlib
          cc: error: linker command failed with exit code 1 (use -v to see invocation)
          

error: could not compile `headless_chrome` (build script) due to 1 previous error

Caused by:
  process didn't exit successfully: `CARGO=/usr/local/bin/cargo CARGO_CRATE_NAME=build_script_build CARGO_MANIFEST_DIR=/wrkdirs/usr/ports/net/findomain/work/rust-headless-chrome-61ce783806e5d75a03f731330edae6156bb0a2e0 CARGO_MANIFEST_PATH=/wrkdirs/usr/ports/net/findomain/work/rust-headless-chrome-61ce783806e5d75a03f731330edae6156bb0a2e0/Cargo.toml CARGO_PKG_AUTHORS='Alistair Roche <alistair@sunburnt.country>' CARGO_PKG_DESCRIPTION='Control Chrome programatically' CARGO_PKG_HOMEPAGE='https://github.com/atroche/rust-headless-chrome' CARGO_PKG_LICENSE=MIT CARGO_PKG_LICENSE_FILE='' CARGO_PKG_NAME=headless_chrome CARGO_PKG_README=README.md CARGO_PKG_REPOSITORY='https://github.com/atroche/rust-headless-chrome' CARGO_PKG_RUST_VERSION='' CARGO_PKG_VERSION=0.9.0 CARGO_PKG_VERSION_MAJOR=0 CARGO_PKG_VERSION_MINOR=9 CARGO_PKG_VERSION_PATCH=0 CARGO_PKG_VERSION_PRE='' LD_LIBRARY_PATH=/wrkdirs/usr/ports/net/findomain/work/target/release/deps /usr/local/bin/rustc --crate-name build_script_b
uild --edition=2018 /wrkdirs/usr/ports/net/findomain/work/rust-headless-chrome-61ce783806e5d75a03f731330edae6156bb0a2e0/build.rs --error-format=json --json=diagnostic-rendered-ansi,artifacts,future-incompat --crate-type bin --emit=dep-info,link -C embed-bitcode=no -C debug-assertions=off --cfg 'feature="default"' --check-cfg 'cfg(docsrs,test)' --check-cfg 'cfg(feature, values("default", "directories", "fetch", "nightly", "ureq", "walkdir", "zip"))' -C metadata=f243fb9bf0afc7d8 -C extra-filename=-df39076f8a563d06 --out-dir /wrkdirs/usr/ports/net/findomain/work/target/release/build/headless_chrome-df39076f8a563d06 -C strip=debuginfo -L dependency=/wrkdirs/usr/ports/net/findomain/work/target/release/deps --extern auto_generate_cdp=/wrkdirs/usr/ports/net/findomain/work/target/release/deps/libauto_generate_cdp-28bd3947b96c2309.rlib -C link-arg=-fstack-protector-strong -L native=/wrkdirs/usr/ports/net/findomain/work/target/release/build/ring-eb1bcc3279477a30/out -L native=/wrkdirs
/usr/ports/net/findomain/work/target/release/build/openssl-sys-7b18dc1ab1847708/out/openssl-build/install/lib` (exit status: 1)
*** Error code 101

Stop.
make: stopped in /usr/ports/net/findomain