[package - main-amd64-default][science/cantera] Failed for cantera-3.1.0_1 in build

From: <pkg-fallout_at_FreeBSD.org>
Date: Fri, 14 Mar 2025 16:53:15 UTC
You are receiving this mail as a port that you maintain
is failing to build on the FreeBSD package build server.
Please investigate the failure and submit a PR to fix
build.

Maintainer:     yuri@FreeBSD.org
Log URL:        https://pkg-status.freebsd.org/beefy18/data/main-amd64-default/p90289c6eaa01_s0588444700f/logs/cantera-3.1.0_1.log
Build URL:      https://pkg-status.freebsd.org/beefy18/build.html?mastername=main-amd64-default&build=p90289c6eaa01_s0588444700f
Log:

=>> Building science/cantera
build started at Fri Mar 14 16:45:57 UTC 2025
port directory: /usr/ports/science/cantera
package name: cantera-3.1.0_1
building for: FreeBSD main-amd64-default-job-10 15.0-CURRENT FreeBSD 15.0-CURRENT 1500034 amd64
maintained by: yuri@FreeBSD.org
Makefile datestamp: -rw-r--r--  1 root wheel 3907 Jan 30 01:01 /usr/ports/science/cantera/Makefile
Ports top last git commit: 90289c6eaa0
Ports top unclean checkout: no
Port dir last git commit: e54e2c695bb
Port dir unclean checkout: no
Poudriere version: poudriere-git-3.4.2-7-gf78625a5
Host OSVERSION: 1500028
Jail OSVERSION: 1500034
Job Id: 10




!!! Jail is newer than host. (Jail: 1500034, Host: 1500028) !!!
!!! This is not supported. !!!
!!! Host kernel must be same or newer than jail. !!!
!!! Expect build failures. !!!



---Begin Environment---
SHELL=/bin/sh
OSVERSION=1500034
UNAME_v=FreeBSD 15.0-CURRENT 1500034
UNAME_r=15.0-CURRENT
BLOCKSIZE=K
MAIL=/var/mail/root
MM_CHARSET=UTF-8
LANG=C.UTF-8
STATUS=1
HOME=/root
PATH=/sbin:/bin:/usr/sbin:/usr/bin:/usr/local/sbin:/usr/local/bin:/root/bin
MAKE_OBJDIR_CHECK_WRITABLE=0
LOCALBASE=/usr/local
USER=root
POUDRIERE_NAME=poudriere-git
LIBEXECPREFIX=/usr/local/libexec/poudriere
POUDRIERE_VERSION=3.4.2-7-gf78625a5
MASTERMNT=/usr/local/poudriere/data/.m/main-amd64-default/ref
LC_COLLATE=C
POUDRIERE_BUILD_TYPE=bulk
PACKAGE_BUILDING=yes
SAVED_TERM=
OUTPUT_REDIRECTED_STDERR=4
OUTPUT_REDIRECTED=1
PWD=/usr/local/poudriere/data/.m/main-amd64-default/10/.p
OUTPUT_REDIRECTED_STDOUT=3
P_PORTS_FEATURES=FLAVORS SUBPACKAGES SELECTED_OPTIONS
MASTERNAME=main-amd64-default
SCRIPTPREFIX=/usr/local/share/poudriere
SCRIPTNAME=bulk.sh
OLDPWD=/usr/local/poudriere/data/.m/main-amd64-default/ref/.p/pool
POUDRIERE_PKGNAME=poudriere-git-3.4.2-7-gf78625a5
SCRIPTPATH=/usr/local/share/poudriere/bulk.sh
POUDRIEREPATH=/usr/local/bin/poudriere
---End Environment---

---Begin Poudriere Port Flags/Env---
PORT_FLAGS=
PKGENV=
FLAVOR=
MAKE_ARGS=
---End Poudriere Port Flags/Env---

---Begin OPTIONS List---
===> The following configuration options are available for cantera-3.1.0_1:
     OCTAVE=off: Octave support
     PYTHON=on: Python bindings or support
===> Use 'make config' to modify these settings
---End OPTIONS List---

--MAINTAINER--
yuri@FreeBSD.org
--End MAINTAINER--

--CONFIGURE_ARGS--

--End CONFIGURE_ARGS--

--CONFIGURE_ENV--
PYTHON="/usr/local/bin/python3.11" XDG_DATA_HOME=/wrkdirs/usr/ports/science/cantera/work  XDG_CONFIG_HOME=/wrkdirs/usr/ports/science/cantera/work  XDG_CACHE_HOME=/wrkdirs/usr/ports/science/cantera/work/.cache  HOME=/wrkdirs/usr/ports/science/cantera/work TMPDIR="/tmp" PATH=/wrkdirs/usr/ports/science/cantera/work/.bin:/sbin:/bin:/usr/sbin:/usr/bin:/usr/local/sbin:/usr/local/bin:/root/bin PKG_CONFIG_LIBDIR=/wrkdirs/usr/ports/science/cantera/work/.pkgconfig:/usr/local/libdata/pkgconfig:/usr/local/share/pkgconfig:/usr/libdata/pkgconfig SHELL=/bin/sh CONFIG_SHELL=/bin/sh CMAKE_PREFIX_PATH="/usr/local"
--End CONFIGURE_ENV--

--MAKE_ENV--
INSTALL_MANPAGES=y XDG_DATA_HOME=/wrkdirs/usr/ports/science/cantera/work  XDG_CONFIG_HOME=/wrkdirs/usr/ports/science/cantera/work  XDG_CACHE_HOME=/wrkdirs/usr/ports/science/cantera/work/.cache  HOME=/wrkdirs/usr/ports/science/cantera/work TMPDIR="/tmp" PATH=/wrkdirs/usr/ports/science/cantera/work/.bin:/sbin:/bin:/usr/sbin:/usr/bin:/usr/local/sbin:/usr/local/bin:/root/bin PKG_CONFIG_LIBDIR=/wrkdirs/usr/ports/science/cantera/work/.pkgconfig:/usr/local/libdata/pkgconfig:/usr/local/share/pkgconfig:/usr/libdata/pkgconfig MK_DEBUG_FILES=no MK_KERNEL_SYMBOLS=no SHELL=/bin/sh NO_LINT=YES PREFIX=/usr/local  LOCALBASE=/usr/local  CC="cc" CFLAGS="-O2 -pipe  -fstack-protector-strong -isystem /usr/local/include -fno-strict-aliasing "  CPP="cpp" CPPFLAGS="-isystem /usr/local/include"  LDFLAGS=" -fstack-protector-strong " LIBS="-L/usr/local/lib"  CXX="c++" CXXFLAGS="-O2 -pipe -fstack-protector-strong -isystem /usr/local/include -fno-strict-aliasing   -isystem /usr/local/include " BSD_INSTA
LL_PROGRAM="install  -s -m 555"  BSD_INSTALL_LIB="install  -s -m 0644"  BSD_INSTALL_SCRIPT="install  -m 555"  BSD_INSTALL_DATA="install  -m 0644"  BSD_INSTALL_MAN="install  -m 444"
--End MAKE_ENV--

--PLIST_SUB--
 OCTAVE="@comment " NO_OCTAVE="" PYTHON="" NO_PYTHON="@comment " PYTHON_INCLUDEDIR=include/python3.11  PYTHON_LIBDIR=lib/python3.11  PYTHON_PLATFORM=freebsd15  PYTHON_SITELIBDIR=lib/python3.11/site-packages  PYTHON_SUFFIX=311  PYTHON_EXT_SUFFIX=.cpython-311  PYTHON_VER=3.11  PYTHON_VERSION=python3.11 PYTHON2="@comment " PYTHON3="" OSREL=15.0 PREFIX=%D LOCALBASE=/usr/local  RESETPREFIX=/usr/local LIB32DIR=lib DOCSDIR="share/doc/cantera"  EXAMPLESDIR="share/examples/cantera"  DATADIR="share/cantera"  WWWDIR="www/cantera"  ETCDIR="etc/cantera"
--End PLIST_SUB--

--SUB_LIST--
 OCTAVE="@comment " NO_OCTAVE="" PYTHON="" NO_PYTHON="@comment " PYTHON_INCLUDEDIR=/usr/local/include/python3.11  PYTHON_LIBDIR=/usr/local/lib/python3.11  PYTHON_PLATFORM=freebsd15  PYTHON_SITELIBDIR=/usr/local/lib/python3.11/site-packages  PYTHON_SUFFIX=311  PYTHON_EXT_SUFFIX=.cpython-311  PYTHON_VER=3.11  PYTHON_VERSION=python3.11 PYTHON2="@comment " PYTHON3="" PREFIX=/usr/local LOCALBASE=/usr/local  DATADIR=/usr/local/share/cantera DOCSDIR=/usr/local/share/doc/cantera EXAMPLESDIR=/usr/local/share/examples/cantera  WWWDIR=/usr/local/www/cantera ETCDIR=/usr/local/etc/cantera
--End SUB_LIST--

---Begin make.conf---
# XXX: We really need this but cannot use it while 'make checksum' does not
# try the next mirror on checksum failure.  It currently retries the same
# failed mirror and then fails rather then trying another.  It *does*
# try the next if the size is mismatched though.
#MASTER_SITE_FREEBSD=yes
# Build ALLOW_MAKE_JOBS_PACKAGES with 3 jobs
MAKE_JOBS_NUMBER=3
USE_PACKAGE_DEPENDS=yes
BATCH=yes
WRKDIRPREFIX=/wrkdirs
PORTSDIR=/usr/ports
PACKAGES=/packages
DISTDIR=/distfiles
PACKAGE_BUILDING=yes
PACKAGE_BUILDING_FLAVORS=yes
####  ####
# XXX: We really need this but cannot use it while 'make checksum' does not
# try the next mirror on checksum failure.  It currently retries the same
# failed mirror and then fails rather then trying another.  It *does*
# try the next if the size is mismatched though.
#MASTER_SITE_FREEBSD=yes
# Build ALLOW_MAKE_JOBS_PACKAGES with 3 jobs
MAKE_JOBS_NUMBER=3
#### Misc Poudriere ####
.include "/etc/make.conf.ports_env"
GID=0
UID=0
---End make.conf---
--Resource limits--
cpu time               (seconds, -t)  unlimited
file size           (512-blocks, -f)  unlimited
data seg size           (kbytes, -d)  33554432
stack size              (kbytes, -s)  524288
core file size      (512-blocks, -c)  unlimited
max memory size         (kbytes, -m)  unlimited
locked memory           (kbytes, -l)  unlimited
max user processes              (-u)  89999
open files                      (-n)  8192
virtual mem size        (kbytes, -v)  unlimited
swap limit              (kbytes, -w)  unlimited
socket buffer size       (bytes, -b)  unlimited
pseudo-terminals                (-p)  unlimited
kqueues                         (-k)  unlimited
umtx shared locks               (-o)  unlimited
pipebuf                         (-y)  unlimited
--End resource limits--
=======================<phase: check-sanity   >============================
===== env: NO_DEPENDS=yes USER=root UID=0 GID=0
===>  License BSD3CLAUSE accepted by the user
===========================================================================
=======================<phase: pkg-depends    >============================
===== env: USE_PACKAGE_DEPENDS_ONLY=1 USER=root UID=0 GID=0
===>   cantera-3.1.0_1 depends on file: /usr/local/sbin/pkg - not found
===>   Installing existing package /packages/All/pkg-2.0.6.pkg
[main-amd64-default-job-10] Installing pkg-2.0.6...
[main-amd64-default-job-10] Extracting pkg-2.0.6: .......... done
===>   cantera-3.1.0_1 depends on file: /usr/local/sbin/pkg - found
===>   Returning to build of cantera-3.1.0_1
===========================================================================
=======================<phase: fetch-depends  >============================
===== env: USE_PACKAGE_DEPENDS_ONLY=1 USER=root UID=0 GID=0
===========================================================================
=======================<phase: fetch          >============================
===== env: NO_DEPENDS=yes USER=root UID=0 GID=0
===>  License BSD3CLAUSE accepted by the user
===> Fetching all distfiles required by cantera-3.1.0_1 for building
===========================================================================
=======================<phase: checksum       >============================
===== env: NO_DEPENDS=yes USER=root UID=0 GID=0
===>  License BSD3CLAUSE accepted by the user
===> Fetching all distfiles required by cantera-3.1.0_1 for building
=> SHA256 Checksum OK for Cantera-cantera-v3.1.0_GH0.tar.gz.
=> SHA256 Checksum OK for LLNL-sundials-887af43_GH0.tar.gz.
=> SHA256 Checksum OK for cantera-cantera-example-data-1a5d27e_GH0.tar.gz.
===========================================================================
=======================<phase: extract-depends>============================
===== env: USE_PACKAGE_DEPENDS_ONLY=1 USER=root UID=0 GID=0
===========================================================================
=======================<phase: extract        >============================
===== env: NO_DEPENDS=yes USER=root UID=0 GID=0
===>  License BSD3CLAUSE accepted by the user
===> Fetching all distfiles required by cantera-3.1.0_1 for building
===>  Extracting for cantera-3.1.0_1
=> SHA256 Checksum OK for Cantera-cantera-v3.1.0_GH0.tar.gz.
=> SHA256 Checksum OK for LLNL-sundials-887af43_GH0.tar.gz.
=> SHA256 Checksum OK for cantera-cantera-example-data-1a5d27e_GH0.tar.gz.
===========================================================================
=======================<phase: patch-depends  >============================
===== env: USE_PACKAGE_DEPENDS_ONLY=1 USER=root UID=0 GID=0
===========================================================================
=======================<phase: patch          >============================
===== env: NO_DEPENDS=yes USER=root UID=0 GID=0
===>  Patching for cantera-3.1.0_1
===>  Applying FreeBSD patches for cantera-3.1.0_1 from /usr/ports/science/cantera/files
===========================================================================
=======================<phase: build-depends  >============================
===== env: USE_PACKAGE_DEPENDS_ONLY=1 USER=root UID=0 GID=0
<snip>
In file included from /usr/local/lib/python3.11/site-packages/numpy/core/include/numpy/arrayobject.h:5:
In file included from /usr/local/lib/python3.11/site-packages/numpy/core/include/numpy/ndarrayobject.h:12:
In file included from /usr/local/lib/python3.11/site-packages/numpy/core/include/numpy/ndarraytypes.h:1929:
/usr/local/lib/python3.11/site-packages/numpy/core/include/numpy/npy_1_7_deprecated_api.h:17:2: warning: "Using deprecated NumPy API, disable it with "          "#define NPY_NO_DEPRECATED_API NPY_1_7_API_VERSION" [-W#warnings]
   17 | #warning "Using deprecated NumPy API, disable it with " \
      |  ^
1 warning generated.
/usr/local/bin/python3.11 -c "import Cython.Build; Cython.Build.cythonize(r'build/python/cantera/reactionpath.pyx', compiler_directives={'binding': True})"
1 warning generated.
/usr/local/bin/python3.11 -c "import Cython.Build; Cython.Build.cythonize(r'build/python/cantera/reactor.pyx', compiler_directives={'binding': True})"
Compiling build/python/cantera/reactionpath.pyx because it changed.
[1/1] Cythonizing build/python/cantera/reactionpath.pyx
c++ -o build/temp-py/reactionpath.os -c -isystem /usr/local/lib/python3.11/site-packages/numpy/core/include -isystem /usr/local/include/python3.11 -isystem /usr/local/include -isystem /usr/local/include/eigen3 -std=c++17 -O2 -pipe -fstack-protector-strong -isystem /usr/local/include -fno-strict-aliasing -isystem /usr/local/include -pthread -O3 -fPIC -DNDEBUG -Iinclude/cantera/ext -Iinclude build/python/cantera/reactionpath.cpp
Compiling build/python/cantera/reactor.pyx because it changed.
[1/1] Cythonizing build/python/cantera/reactor.pyx
c++ -o build/temp-py/reactor.os -c -isystem /usr/local/lib/python3.11/site-packages/numpy/core/include -isystem /usr/local/include/python3.11 -isystem /usr/local/include -isystem /usr/local/include/eigen3 -std=c++17 -O2 -pipe -fstack-protector-strong -isystem /usr/local/include -fno-strict-aliasing -isystem /usr/local/include -pthread -O3 -fPIC -DNDEBUG -Iinclude/cantera/ext -Iinclude build/python/cantera/reactor.cpp
In file included from build/python/cantera/reactionpath.cpp:803:
In file included from /usr/local/lib/python3.11/site-packages/numpy/core/include/numpy/arrayobject.h:5:
In file included from /usr/local/lib/python3.11/site-packages/numpy/core/include/numpy/ndarrayobject.h:12:
In file included from /usr/local/lib/python3.11/site-packages/numpy/core/include/numpy/ndarraytypes.h:1929:
/usr/local/lib/python3.11/site-packages/numpy/core/include/numpy/npy_1_7_deprecated_api.h:17:2: warning: "Using deprecated NumPy API, disable it with "          "#define NPY_NO_DEPRECATED_API NPY_1_7_API_VERSION" [-W#warnings]
   17 | #warning "Using deprecated NumPy API, disable it with " \
      |  ^
In file included from build/python/cantera/reactor.cpp:803:
In file included from /usr/local/lib/python3.11/site-packages/numpy/core/include/numpy/arrayobject.h:5:
In file included from /usr/local/lib/python3.11/site-packages/numpy/core/include/numpy/ndarrayobject.h:12:
In file included from /usr/local/lib/python3.11/site-packages/numpy/core/include/numpy/ndarraytypes.h:1929:
/usr/local/lib/python3.11/site-packages/numpy/core/include/numpy/npy_1_7_deprecated_api.h:17:2: warning: "Using deprecated NumPy API, disable it with "          "#define NPY_NO_DEPRECATED_API NPY_1_7_API_VERSION" [-W#warnings]
   17 | #warning "Using deprecated NumPy API, disable it with " \
      |  ^
1 warning generated.
/usr/local/bin/python3.11 -c "import Cython.Build; Cython.Build.cythonize(r'build/python/cantera/solutionbase.pyx', compiler_directives={'binding': True})"
Compiling build/python/cantera/solutionbase.pyx because it changed.
[1/1] Cythonizing build/python/cantera/solutionbase.pyx
c++ -o build/temp-py/solutionbase.os -c -isystem /usr/local/lib/python3.11/site-packages/numpy/core/include -isystem /usr/local/include/python3.11 -isystem /usr/local/include -isystem /usr/local/include/eigen3 -std=c++17 -O2 -pipe -fstack-protector-strong -isystem /usr/local/include -fno-strict-aliasing -isystem /usr/local/include -pthread -O3 -fPIC -DNDEBUG -Iinclude/cantera/ext -Iinclude build/python/cantera/solutionbase.cpp
In file included from build/python/cantera/solutionbase.cpp:780:
In file included from /usr/local/lib/python3.11/site-packages/numpy/core/include/numpy/arrayobject.h:5:
In file included from /usr/local/lib/python3.11/site-packages/numpy/core/include/numpy/ndarrayobject.h:12:
In file included from /usr/local/lib/python3.11/site-packages/numpy/core/include/numpy/ndarraytypes.h:1929:
/usr/local/lib/python3.11/site-packages/numpy/core/include/numpy/npy_1_7_deprecated_api.h:17:2: warning: "Using deprecated NumPy API, disable it with "          "#define NPY_NO_DEPRECATED_API NPY_1_7_API_VERSION" [-W#warnings]
   17 | #warning "Using deprecated NumPy API, disable it with " \
      |  ^
1 warning generated.
/usr/local/bin/python3.11 -c "import Cython.Build; Cython.Build.cythonize(r'build/python/cantera/speciesthermo.pyx', compiler_directives={'binding': True})"
Compiling build/python/cantera/speciesthermo.pyx because it changed.
[1/1] Cythonizing build/python/cantera/speciesthermo.pyx
c++ -o build/temp-py/speciesthermo.os -c -isystem /usr/local/lib/python3.11/site-packages/numpy/core/include -isystem /usr/local/include/python3.11 -isystem /usr/local/include -isystem /usr/local/include/eigen3 -std=c++17 -O2 -pipe -fstack-protector-strong -isystem /usr/local/include -fno-strict-aliasing -isystem /usr/local/include -pthread -O3 -fPIC -DNDEBUG -Iinclude/cantera/ext -Iinclude build/python/cantera/speciesthermo.cpp
In file included from build/python/cantera/speciesthermo.cpp:803:
In file included from /usr/local/lib/python3.11/site-packages/numpy/core/include/numpy/arrayobject.h:5:
In file included from /usr/local/lib/python3.11/site-packages/numpy/core/include/numpy/ndarrayobject.h:12:
In file included from /usr/local/lib/python3.11/site-packages/numpy/core/include/numpy/ndarraytypes.h:1929:
/usr/local/lib/python3.11/site-packages/numpy/core/include/numpy/npy_1_7_deprecated_api.h:17:2: warning: "Using deprecated NumPy API, disable it with "          "#define NPY_NO_DEPRECATED_API NPY_1_7_API_VERSION" [-W#warnings]
   17 | #warning "Using deprecated NumPy API, disable it with " \
      |  ^
1 warning generated.
/usr/local/bin/python3.11 -c "import Cython.Build; Cython.Build.cythonize(r'build/python/cantera/thermo.pyx', compiler_directives={'binding': True})"
1 warning generated.
/usr/local/bin/python3.11 -c "import Cython.Build; Cython.Build.cythonize(r'build/python/cantera/transport.pyx', compiler_directives={'binding': True})"
Compiling build/python/cantera/transport.pyx because it changed.
[1/1] Cythonizing build/python/cantera/transport.pyx
c++ -o build/temp-py/transport.os -c -isystem /usr/local/lib/python3.11/site-packages/numpy/core/include -isystem /usr/local/include/python3.11 -isystem /usr/local/include -isystem /usr/local/include/eigen3 -std=c++17 -O2 -pipe -fstack-protector-strong -isystem /usr/local/include -fno-strict-aliasing -isystem /usr/local/include -pthread -O3 -fPIC -DNDEBUG -Iinclude/cantera/ext -Iinclude build/python/cantera/transport.cpp
Compiling build/python/cantera/thermo.pyx because it changed.
[1/1] Cythonizing build/python/cantera/thermo.pyx
c++ -o build/temp-py/thermo.os -c -isystem /usr/local/lib/python3.11/site-packages/numpy/core/include -isystem /usr/local/include/python3.11 -isystem /usr/local/include -isystem /usr/local/include/eigen3 -std=c++17 -O2 -pipe -fstack-protector-strong -isystem /usr/local/include -fno-strict-aliasing -isystem /usr/local/include -pthread -O3 -fPIC -DNDEBUG -Iinclude/cantera/ext -Iinclude build/python/cantera/thermo.cpp
In file included from build/python/cantera/transport.cpp:803:
In file included from /usr/local/lib/python3.11/site-packages/numpy/core/include/numpy/arrayobject.h:5:
In file included from /usr/local/lib/python3.11/site-packages/numpy/core/include/numpy/ndarrayobject.h:12:
In file included from /usr/local/lib/python3.11/site-packages/numpy/core/include/numpy/ndarraytypes.h:1929:
/usr/local/lib/python3.11/site-packages/numpy/core/include/numpy/npy_1_7_deprecated_api.h:17:2: warning: "Using deprecated NumPy API, disable it with "          "#define NPY_NO_DEPRECATED_API NPY_1_7_API_VERSION" [-W#warnings]
   17 | #warning "Using deprecated NumPy API, disable it with " \
      |  ^
In file included from build/python/cantera/thermo.cpp:803:
In file included from /usr/local/lib/python3.11/site-packages/numpy/core/include/numpy/arrayobject.h:5:
In file included from /usr/local/lib/python3.11/site-packages/numpy/core/include/numpy/ndarrayobject.h:12:
In file included from /usr/local/lib/python3.11/site-packages/numpy/core/include/numpy/ndarraytypes.h:1929:
/usr/local/lib/python3.11/site-packages/numpy/core/include/numpy/npy_1_7_deprecated_api.h:17:2: warning: "Using deprecated NumPy API, disable it with "          "#define NPY_NO_DEPRECATED_API NPY_1_7_API_VERSION" [-W#warnings]
   17 | #warning "Using deprecated NumPy API, disable it with " \
      |  ^
1 warning generated.
/usr/local/bin/python3.11 -c "import Cython.Build; Cython.Build.cythonize(r'build/python/cantera/units.pyx', compiler_directives={'binding': True})"
Compiling build/python/cantera/units.pyx because it changed.
[1/1] Cythonizing build/python/cantera/units.pyx
c++ -o build/temp-py/units.os -c -isystem /usr/local/lib/python3.11/site-packages/numpy/core/include -isystem /usr/local/include/python3.11 -isystem /usr/local/include -isystem /usr/local/include/eigen3 -std=c++17 -O2 -pipe -fstack-protector-strong -isystem /usr/local/include -fno-strict-aliasing -isystem /usr/local/include -pthread -O3 -fPIC -DNDEBUG -Iinclude/cantera/ext -Iinclude build/python/cantera/units.cpp
In file included from build/python/cantera/units.cpp:803:
In file included from /usr/local/lib/python3.11/site-packages/numpy/core/include/numpy/arrayobject.h:5:
In file included from /usr/local/lib/python3.11/site-packages/numpy/core/include/numpy/ndarrayobject.h:12:
In file included from /usr/local/lib/python3.11/site-packages/numpy/core/include/numpy/ndarraytypes.h:1929:
/usr/local/lib/python3.11/site-packages/numpy/core/include/numpy/npy_1_7_deprecated_api.h:17:2: warning: "Using deprecated NumPy API, disable it with "          "#define NPY_NO_DEPRECATED_API NPY_1_7_API_VERSION" [-W#warnings]
   17 | #warning "Using deprecated NumPy API, disable it with " \
      |  ^
1 warning generated.
/usr/local/bin/python3.11 -c "import Cython.Build; Cython.Build.cythonize(r'build/python/cantera/yamlwriter.pyx', compiler_directives={'binding': True})"
Compiling build/python/cantera/yamlwriter.pyx because it changed.
[1/1] Cythonizing build/python/cantera/yamlwriter.pyx
c++ -o build/temp-py/yamlwriter.os -c -isystem /usr/local/lib/python3.11/site-packages/numpy/core/include -isystem /usr/local/include/python3.11 -isystem /usr/local/include -isystem /usr/local/include/eigen3 -std=c++17 -O2 -pipe -fstack-protector-strong -isystem /usr/local/include -fno-strict-aliasing -isystem /usr/local/include -pthread -O3 -fPIC -DNDEBUG -Iinclude/cantera/ext -Iinclude build/python/cantera/yamlwriter.cpp
In file included from build/python/cantera/yamlwriter.cpp:803:
In file included from /usr/local/lib/python3.11/site-packages/numpy/core/include/numpy/arrayobject.h:5:
In file included from /usr/local/lib/python3.11/site-packages/numpy/core/include/numpy/ndarrayobject.h:12:
In file included from /usr/local/lib/python3.11/site-packages/numpy/core/include/numpy/ndarraytypes.h:1929:
/usr/local/lib/python3.11/site-packages/numpy/core/include/numpy/npy_1_7_deprecated_api.h:17:2: warning: "Using deprecated NumPy API, disable it with "          "#define NPY_NO_DEPRECATED_API NPY_1_7_API_VERSION" [-W#warnings]
   17 | #warning "Using deprecated NumPy API, disable it with " \
      |  ^
1 warning generated.
Copy("src/extensions/delegator.h", "build/python/cantera/delegator.h")
c++ -o src/extensions/PythonExtensionManager.os -c -isystem /usr/local/lib/python3.11/site-packages/numpy/core/include -isystem /usr/local/include/python3.11 -isystem /usr/local/include -isystem /usr/local/include/eigen3 -std=c++17 -O2 -pipe -fstack-protector-strong -isystem /usr/local/include -fno-strict-aliasing -isystem /usr/local/include -pthread -O3 -fPIC -DNDEBUG -Iinclude/cantera/ext -Iinclude src/extensions/PythonExtensionManager.cpp
Copy("build/python/README.rst", "README.rst")
Copy("build/python/LICENSE.txt", "build/ext/LICENSE.txt")
Substituting vars from build/python/cantera/with_units/solution.py.in to build/python/cantera/with_units/solution.py
Substituting vars from platform/posix/cantera.pc.in to build/platform/cantera.pc
1 warning generated.
1 warning generated.
c++ -o build/python/cantera/_cantera.cpython-311.so -pthread -shared -Wl,-rpath,/usr/local/lib -Wl,-rpath,/usr/local/lib build/temp-py/_cantera.os build/temp-py/_onedim.os build/temp-py/_utils.os build/temp-py/constants.os build/temp-py/delegator.os build/temp-py/func1.os build/temp-py/kinetics.os build/temp-py/mixture.os build/temp-py/preconditioners.os build/temp-py/reaction.os build/temp-py/reactionpath.os build/temp-py/reactor.os build/temp-py/solutionbase.os build/temp-py/speciesthermo.os build/temp-py/thermo.os build/temp-py/transport.os build/temp-py/units.os build/temp-py/yamlwriter.os src/extensions/PythonExtensionManager.os -Lbuild/lib -L/usr/local/lib -lcantera_shared -lfmt -lomp
"/usr/local/bin/python3.11" -m pip wheel -v --no-build-isolation --no-deps --wheel-dir=build/python/dist build/python
Processing ./build/python
  Preparing metadata (pyproject.toml): started
  Running command Preparing metadata (pyproject.toml)
  Preparing metadata (pyproject.toml): finished with status 'done'
ERROR: Exception:
Traceback (most recent call last):
  File "/usr/local/lib/python3.11/site-packages/pip/_internal/cli/base_command.py", line 180, in exc_logging_wrapper
    status = run_func(*args)
             ^^^^^^^^^^^^^^^
  File "/usr/local/lib/python3.11/site-packages/pip/_internal/cli/req_command.py", line 245, in wrapper
    return func(self, options, args)
           ^^^^^^^^^^^^^^^^^^^^^^^^^
  File "/usr/local/lib/python3.11/site-packages/pip/_internal/commands/wheel.py", line 147, in run
    requirement_set = resolver.resolve(reqs, check_supported_wheels=True)
                      ^^^^^^^^^^^^^^^^^^^^^^^^^^^^^^^^^^^^^^^^^^^^^^^^^^^
  File "/usr/local/lib/python3.11/site-packages/pip/_internal/resolution/resolvelib/resolver.py", line 76, in resolve
    collected = self.factory.collect_root_requirements(root_reqs)
                ^^^^^^^^^^^^^^^^^^^^^^^^^^^^^^^^^^^^^^^^^^^^^^^^^
  File "/usr/local/lib/python3.11/site-packages/pip/_internal/resolution/resolvelib/factory.py", line 534, in collect_root_requirements
    reqs = list(
           ^^^^^
  File "/usr/local/lib/python3.11/site-packages/pip/_internal/resolution/resolvelib/factory.py", line 490, in _make_requirements_from_install_req
    cand = self._make_base_candidate_from_link(
           ^^^^^^^^^^^^^^^^^^^^^^^^^^^^^^^^^^^^
  File "/usr/local/lib/python3.11/site-packages/pip/_internal/resolution/resolvelib/factory.py", line 228, in _make_base_candidate_from_link
    self._link_candidate_cache[link] = LinkCandidate(
                                       ^^^^^^^^^^^^^^
  File "/usr/local/lib/python3.11/site-packages/pip/_internal/resolution/resolvelib/candidates.py", line 293, in __init__
    super().__init__(
  File "/usr/local/lib/python3.11/site-packages/pip/_internal/resolution/resolvelib/candidates.py", line 156, in __init__
    self.dist = self._prepare()
                ^^^^^^^^^^^^^^^
  File "/usr/local/lib/python3.11/site-packages/pip/_internal/resolution/resolvelib/candidates.py", line 225, in _prepare
    dist = self._prepare_distribution()
           ^^^^^^^^^^^^^^^^^^^^^^^^^^^^
  File "/usr/local/lib/python3.11/site-packages/pip/_internal/resolution/resolvelib/candidates.py", line 304, in _prepare_distribution
    return preparer.prepare_linked_requirement(self._ireq, parallel_builds=True)
           ^^^^^^^^^^^^^^^^^^^^^^^^^^^^^^^^^^^^^^^^^^^^^^^^^^^^^^^^^^^^^^^^^^^^^
  File "/usr/local/lib/python3.11/site-packages/pip/_internal/operations/prepare.py", line 525, in prepare_linked_requirement
    return self._prepare_linked_requirement(req, parallel_builds)
           ^^^^^^^^^^^^^^^^^^^^^^^^^^^^^^^^^^^^^^^^^^^^^^^^^^^^^^
  File "/usr/local/lib/python3.11/site-packages/pip/_internal/operations/prepare.py", line 640, in _prepare_linked_requirement
    dist = _get_prepared_distribution(
           ^^^^^^^^^^^^^^^^^^^^^^^^^^^
  File "/usr/local/lib/python3.11/site-packages/pip/_internal/operations/prepare.py", line 71, in _get_prepared_distribution
    abstract_dist.prepare_distribution_metadata(
  File "/usr/local/lib/python3.11/site-packages/pip/_internal/distributions/sdist.py", line 67, in prepare_distribution_metadata
    self.req.prepare_metadata()
  File "/usr/local/lib/python3.11/site-packages/pip/_internal/req/req_install.py", line 577, in prepare_metadata
    self.metadata_directory = generate_metadata(
                              ^^^^^^^^^^^^^^^^^^
  File "/usr/local/lib/python3.11/site-packages/pip/_internal/operations/build/metadata.py", line 35, in generate_metadata
    distinfo_dir = backend.prepare_metadata_for_build_wheel(metadata_dir)
                   ^^^^^^^^^^^^^^^^^^^^^^^^^^^^^^^^^^^^^^^^^^^^^^^^^^^^^^
  File "/usr/local/lib/python3.11/site-packages/pip/_internal/utils/misc.py", line 772, in prepare_metadata_for_build_wheel
    return super().prepare_metadata_for_build_wheel(
           ^^^^^^^^^^^^^^^^^^^^^^^^^^^^^^^^^^^^^^^^^
  File "/usr/local/lib/python3.11/site-packages/pip/_vendor/pyproject_hooks/_impl.py", line 186, in prepare_metadata_for_build_wheel
    return self._call_hook('prepare_metadata_for_build_wheel', {
           ^^^^^^^^^^^^^^^^^^^^^^^^^^^^^^^^^^^^^^^^^^^^^^^^^^^^^
  File "/usr/local/lib/python3.11/site-packages/pip/_vendor/pyproject_hooks/_impl.py", line 321, in _call_hook
    raise BackendUnavailable(data.get('traceback', ''))
pip._vendor.pyproject_hooks._impl.BackendUnavailable: Traceback (most recent call last):
  File "/usr/local/lib/python3.11/site-packages/pip/_vendor/pyproject_hooks/_in_process/_in_process.py", line 77, in _build_backend
    obj = import_module(mod_path)
          ^^^^^^^^^^^^^^^^^^^^^^^
  File "/usr/local/lib/python3.11/importlib/__init__.py", line 126, in import_module
    return _bootstrap._gcd_import(name[level:], package, level)
           ^^^^^^^^^^^^^^^^^^^^^^^^^^^^^^^^^^^^^^^^^^^^^^^^^^^^
  File "<frozen importlib._bootstrap>", line 1204, in _gcd_import
  File "<frozen importlib._bootstrap>", line 1176, in _find_and_load
  File "<frozen importlib._bootstrap>", line 1126, in _find_and_load_unlocked
  File "<frozen importlib._bootstrap>", line 241, in _call_with_frames_removed
  File "<frozen importlib._bootstrap>", line 1204, in _gcd_import
  File "<frozen importlib._bootstrap>", line 1176, in _find_and_load
  File "<frozen importlib._bootstrap>", line 1140, in _find_and_load_unlocked
ModuleNotFoundError: No module named 'setuptools'

scons: *** [build/python/dist/Cantera-3.1.0-cp311-cp311-freebsd_15_0_CURRENT_amd64.whl] Error 2
scons: building terminated because of errors.
===> Compilation failed unexpectedly.
Try to set MAKE_JOBS_UNSAFE=yes and rebuild before reporting the failure to
the maintainer.
*** Error code 1

Stop.
make: stopped making "build" in /usr/ports/science/cantera