[exp - 142amd64-default-build-as-user][lang/dotnet] Failed for dotnet-9.0.5 in build

From: <pkg-fallout_at_FreeBSD.org>
Date: Sun, 01 Jun 2025 23:55:18 UTC
You are receiving this mail as a port that you maintain
is failing to build on the FreeBSD package build server.
Please investigate the failure and submit a PR to fix
build.

Maintainer:     arrowd@FreeBSD.org
Log URL:        https://pkg-status.freebsd.org/package19/data/142amd64-default-build-as-user/9d686b9ed6c0/logs/dotnet-9.0.5.log
Build URL:      https://pkg-status.freebsd.org/package19/build.html?mastername=142amd64-default-build-as-user&build=9d686b9ed6c0
Log:

=>> Building lang/dotnet
build started at Sun Jun  1 23:04:56 UTC 2025
port directory: /usr/ports/lang/dotnet
package name: dotnet-9.0.5
building for: FreeBSD 142amd64-default-build-as-user-job-05 14.2-RELEASE-p3 FreeBSD 14.2-RELEASE-p3 amd64
maintained by: arrowd@FreeBSD.org
Makefile datestamp: -rw-r--r--  1 root wheel 4844 May 31 00:03 /usr/ports/lang/dotnet/Makefile
Ports top last git commit: 9d686b9ed6
Ports top unclean checkout: no
Port dir last git commit: 3778387441
Port dir unclean checkout: no
Poudriere version: poudriere-git-3.4.2-12-g74a54a88
Host OSVERSION: 1500035
Jail OSVERSION: 1402000
Job Id: 05

---Begin Environment---
SHELL=/bin/sh
OSVERSION=1402000
UNAME_v=FreeBSD 14.2-RELEASE-p3
UNAME_r=14.2-RELEASE-p3
BLOCKSIZE=K
MAIL=/var/mail/root
MM_CHARSET=UTF-8
LANG=C.UTF-8
STATUS=1
HOME=/root
PATH=/sbin:/bin:/usr/sbin:/usr/bin:/usr/local/sbin:/usr/local/bin:/root/bin
MAKE_OBJDIR_CHECK_WRITABLE=0
LOCALBASE=/usr/local
USER=root
POUDRIERE_NAME=poudriere-git
LIBEXECPREFIX=/usr/local/libexec/poudriere
POUDRIERE_VERSION=3.4.2-12-g74a54a88
MASTERMNT=/poudriere/data/.m/142amd64-default-build-as-user/ref
LC_COLLATE=C
POUDRIERE_BUILD_TYPE=bulk
PACKAGE_BUILDING=yes
SAVED_TERM=
GID=0
OUTPUT_REDIRECTED_STDERR=4
OUTPUT_REDIRECTED=1
UID=0
PWD=/poudriere/data/.m/142amd64-default-build-as-user/05/.p
OUTPUT_REDIRECTED_STDOUT=3
P_PORTS_FEATURES=FLAVORS SUBPACKAGES SELECTED_OPTIONS
MASTERNAME=142amd64-default-build-as-user
SCRIPTPREFIX=/usr/local/share/poudriere
SCRIPTNAME=bulk.sh
OLDPWD=/poudriere/data/.m/142amd64-default-build-as-user/ref/.p/pool
POUDRIERE_PKGNAME=poudriere-git-3.4.2-12-g74a54a88
SCRIPTPATH=/usr/local/share/poudriere/bulk.sh
POUDRIEREPATH=/usr/local/bin/poudriere
---End Environment---

---Begin Poudriere Port Flags/Env---
PORT_FLAGS=
PKGENV=
FLAVOR=
MAKE_ARGS=
---End Poudriere Port Flags/Env---

---Begin OPTIONS List---
---End OPTIONS List---

--MAINTAINER--
arrowd@FreeBSD.org
--End MAINTAINER--

--CONFIGURE_ARGS--

--End CONFIGURE_ARGS--

--CONFIGURE_ENV--
PKG_CONFIG=pkgconf PYTHON="/usr/local/bin/python3.11" XDG_DATA_HOME=/wrkdirs/usr/ports/lang/dotnet/work  XDG_CONFIG_HOME=/wrkdirs/usr/ports/lang/dotnet/work  XDG_CACHE_HOME=/wrkdirs/usr/ports/lang/dotnet/work/.cache  HOME=/wrkdirs/usr/ports/lang/dotnet/work TMPDIR="/tmp" PATH=/wrkdirs/usr/ports/lang/dotnet/work/.bin:/sbin:/bin:/usr/sbin:/usr/bin:/usr/local/sbin:/usr/local/bin:/root/bin PKG_CONFIG_LIBDIR=/wrkdirs/usr/ports/lang/dotnet/work/.pkgconfig:/usr/local/libdata/pkgconfig:/usr/local/share/pkgconfig:/usr/libdata/pkgconfig SHELL=/bin/sh CONFIG_SHELL=/bin/sh DEFAULT_AUTOCONF=2.72
--End CONFIGURE_ENV--

--MAKE_ENV--
OPENSSLBASE=/usr OPENSSLDIR=/etc/ssl OPENSSLINC=/usr/include OPENSSLLIB=/usr/lib XDG_DATA_HOME=/wrkdirs/usr/ports/lang/dotnet/work  XDG_CONFIG_HOME=/wrkdirs/usr/ports/lang/dotnet/work  XDG_CACHE_HOME=/wrkdirs/usr/ports/lang/dotnet/work/.cache  HOME=/wrkdirs/usr/ports/lang/dotnet/work TMPDIR="/tmp" PATH=/wrkdirs/usr/ports/lang/dotnet/work/.bin:/sbin:/bin:/usr/sbin:/usr/bin:/usr/local/sbin:/usr/local/bin:/root/bin PKG_CONFIG_LIBDIR=/wrkdirs/usr/ports/lang/dotnet/work/.pkgconfig:/usr/local/libdata/pkgconfig:/usr/local/share/pkgconfig:/usr/libdata/pkgconfig MK_DEBUG_FILES=no MK_KERNEL_SYMBOLS=no SHELL=/bin/sh NO_LINT=YES DEFAULT_AUTOCONF=2.72 PREFIX=/usr/local  LOCALBASE=/usr/local  CC="cc" CFLAGS="-O2 -pipe  -fstack-protector-strong -fno-strict-aliasing "  CPP="cpp" CPPFLAGS=""  LDFLAGS=" -Wl,-rpath,/usr/local/lib:/usr/lib  -fstack-protector-strong " LIBS=""  CXX="c++" CXXFLAGS="-O2 -pipe -fstack-protector-strong -fno-strict-aliasing  " BSD_INSTALL_PROGRAM="install  -s -m 555" 
 BSD_INSTALL_LIB="install  -s -m 0644"  BSD_INSTALL_SCRIPT="install  -m 555"  BSD_INSTALL_DATA="install  -m 0644"  BSD_INSTALL_MAN="install  -m 444"
--End MAKE_ENV--

--PLIST_SUB--
DOTNET_ARCH=x64 FULL_DOTNETVERSION=9.0.5  DOTNETVERSION=9.0 SDKVERSION=9.0.106  SDK_RID=freebsd.14-x64 SDKVERSIONSUFFIX=-servicing.25229.4  SDKSERVICESUFFIX=-servicing.25230.1 MANIFESTSUFFIX=9.0.100  LIBPACKSUFFIX=-servicing.25215.9 NONPORTABLE= PYTHON_INCLUDEDIR=include/python3.11  PYTHON_LIBDIR=lib/python3.11  PYTHON_PLATFORM=freebsd14  PYTHON_SITELIBDIR=lib/python3.11/site-packages  PYTHON_SUFFIX=311  PYTHON_EXT_SUFFIX=.cpython-311  PYTHON_VER=3.11  PYTHON_VERSION=python3.11 PYTHON2="@comment " PYTHON3="" VXSORT= OSREL=14.2 PREFIX=%D LOCALBASE=/usr/local  RESETPREFIX=/usr/local LIB32DIR=lib DOCSDIR="share/doc/dotnet"  EXAMPLESDIR="share/examples/dotnet"  DATADIR="share/dotnet"  WWWDIR="www/dotnet"  ETCDIR="etc/dotnet"
--End PLIST_SUB--

--SUB_LIST--
PYTHON_INCLUDEDIR=/usr/local/include/python3.11  PYTHON_LIBDIR=/usr/local/lib/python3.11  PYTHON_PLATFORM=freebsd14  PYTHON_SITELIBDIR=/usr/local/lib/python3.11/site-packages  PYTHON_SUFFIX=311  PYTHON_EXT_SUFFIX=.cpython-311  PYTHON_VER=3.11  PYTHON_VERSION=python3.11 PYTHON2="@comment " PYTHON3="" PREFIX=/usr/local LOCALBASE=/usr/local  DATADIR=/usr/local/share/dotnet DOCSDIR=/usr/local/share/doc/dotnet EXAMPLESDIR=/usr/local/share/examples/dotnet  WWWDIR=/usr/local/www/dotnet ETCDIR=/usr/local/etc/dotnet
--End SUB_LIST--

---Begin make.conf---
USE_PACKAGE_DEPENDS=yes
BATCH=yes
WRKDIRPREFIX=/wrkdirs
PORTSDIR=/usr/ports
PACKAGES=/packages
DISTDIR=/distfiles
FORCE_PACKAGE=yes
PACKAGE_BUILDING=yes
PACKAGE_BUILDING_FLAVORS=yes
####  ####
# Build ALLOW_MAKE_JOBS_PACKAGES with 3 jobs
MAKE_JOBS_NUMBER=3
#### Misc Poudriere ####
.include "/etc/make.conf.ports_env"
---End make.conf---
--Resource limits--
cpu time               (seconds, -t)  unlimited
file size           (512-blocks, -f)  unlimited
data seg size           (kbytes, -d)  33554432
stack size              (kbytes, -s)  524288
core file size      (512-blocks, -c)  unlimited
max memory size         (kbytes, -m)  unlimited
locked memory           (kbytes, -l)  unlimited
max user processes              (-u)  89999
open files                      (-n)  8192
virtual mem size        (kbytes, -v)  unlimited
swap limit              (kbytes, -w)  unlimited
socket buffer size       (bytes, -b)  unlimited
pseudo-terminals                (-p)  unlimited
kqueues                         (-k)  unlimited
umtx shared locks               (-o)  unlimited
pipebuf                         (-y)  unlimited
--End resource limits--
=======================<phase: check-sanity   >============================
===== env: NO_DEPENDS=yes USER=nobody UID=65534 GID=65534
===>  License MIT accepted by the user
===========================================================================
=======================<phase: pkg-depends    >============================
===== env: USE_PACKAGE_DEPENDS_ONLY=1 USER=root UID=0 GID=0
===>   dotnet-9.0.5 depends on file: /usr/local/sbin/pkg - not found
===>   Installing existing package /packages/All/pkg-2.1.4.pkg
[142amd64-default-build-as-user-job-05] Installing pkg-2.1.4...
[142amd64-default-build-as-user-job-05] Extracting pkg-2.1.4: .......... done
===>   dotnet-9.0.5 depends on file: /usr/local/sbin/pkg - found
===>   Returning to build of dotnet-9.0.5
===========================================================================
=======================<phase: fetch-depends  >============================
===== env: USE_PACKAGE_DEPENDS_ONLY=1 USER=root UID=0 GID=0
===========================================================================
=======================<phase: fetch          >============================
===== env: NO_DEPENDS=yes USER=root UID=0 GID=0
===>  License MIT accepted by the user
=> release.json-9.0.5 doesn't seem to exist in /portdistfiles/dotnet.
=> Attempting to fetch https://github.com/dotnet/dotnet/releases/download/v9.0.5/release.json?dummy=/release.json-9.0.5
release.json-9.0.5                                     273  B 2446 kBps    00s
=> dotnet-dotnet-v9.0.5_GH0.tar.gz doesn't seem to exist in /portdistfiles/dotnet.
=> Attempting to fetch https://codeload.github.com/dotnet/dotnet/tar.gz/v9.0.5?dummy=/dotnet-dotnet-v9.0.5_GH0.tar.gz
fetch: https://codeload.github.com/dotnet/dotnet/tar.gz/v9.0.5?dummy=/dotnet-dotnet-v9.0.5_GH0.tar.gz: size unknown
fetch: https://codeload.github.com/dotnet/dotnet/tar.gz/v9.0.5?dummy=/dotnet-dotnet-v9.0.5_GH0.tar.gz: size of remote file is not known
dotnet-dotnet-v9.0.5_GH0.tar.gz                        471 MB 7231 kBps 01m07s
===> Fetching all distfiles required by dotnet-9.0.5 for building
===========================================================================
=======================<phase: checksum       >============================
===== env: NO_DEPENDS=yes USER=root UID=0 GID=0
===>  License MIT accepted by the user
===> Fetching all distfiles required by dotnet-9.0.5 for building
=> SHA256 Checksum OK for dotnet/release.json-9.0.5.
=> SHA256 Checksum OK for dotnet/Private.SourceBuilt.Artifacts.9.0.103-servicing.25071.1.freebsd-x64.tar.gz.
=> SHA256 Checksum OK for dotnet/dotnet-sdk-9.0.103-freebsd-x64.tar.gz.
=> SHA256 Checksum OK for dotnet/dotnet-dotnet-v9.0.5_GH0.tar.gz.
===========================================================================
=======================<phase: extract-depends>============================
===== env: USE_PACKAGE_DEPENDS_ONLY=1 USER=root UID=0 GID=0
===========================================================================
=======================<phase: extract        >============================
===== env: NO_DEPENDS=yes USER=nobody UID=65534 GID=65534
===>  License MIT accepted by the user
===> Fetching all distfiles required by dotnet-9.0.5 for building
===>  Extracting for dotnet-9.0.5
=> SHA256 Checksum OK for dotnet/release.json-9.0.5.
=> SHA256 Checksum OK for dotnet/Private.SourceBuilt.Artifacts.9.0.103-servicing.25071.1.freebsd-x64.tar.gz.
=> SHA256 Checksum OK for dotnet/dotnet-sdk-9.0.103-freebsd-x64.tar.gz.
=> SHA256 Checksum OK for dotnet/dotnet-dotnet-v9.0.5_GH0.tar.gz.
cp -f /portdistfiles/dotnet/release.json-9.0.5 /wrkdirs/usr/ports/lang/dotnet/work/dotnet-9.0.5/release.json
/usr/bin/tar -xf  /portdistfiles/dotnet/Private.SourceBuilt.Artifacts.9.0.103-servicing.25071.1.freebsd-x64.tar.gz  -C /wrkdirs/usr/ports/lang/dotnet/work/packages  --no-same-owner --no-same-permissions
/usr/bin/tar -xf  /portdistfiles/dotnet/dotnet-sdk-9.0.103-freebsd-x64.tar.gz  -C /wrkdirs/usr/ports/lang/dotnet/work/bootstrap_sdk  --no-same-owner --no-same-permissions
elfctl -e +noaslr /wrkdirs/usr/ports/lang/dotnet/work/bootstrap_sdk/dotnet
===========================================================================
=======================<phase: patch-depends  >============================
===== env: USE_PACKAGE_DEPENDS_ONLY=1 USER=root UID=0 GID=0
===========================================================================
=======================<phase: patch          >============================
===== env: NO_DEPENDS=yes USER=nobody UID=65534 GID=65534
===>  Patching for dotnet-9.0.5
===>  Applying extra patch /usr/ports/lang/dotnet/files/extra-patch-base-openssl
===>  Applying FreeBSD patches for dotnet-9.0.5 from /usr/ports/lang/dotnet/files
===========================================================================
=======================<phase: build-depends  >============================
===== env: USE_PACKAGE_DEPENDS_ONLY=1 USER=root UID=0 GID=0
===>   dotnet-9.0.5 depends on executable: bash - not found
===>   Installing existing package /packages/All/bash-5.2.37.pkg
[142amd64-default-build-as-user-job-05] Installing bash-5.2.37...
[142amd64-default-build-as-user-job-05] `-- Installing gettext-runtime-0.23.1...
[142amd64-default-build-as-user-job-05] |   `-- Installing indexinfo-0.3.1_1...
[142amd64-default-build-as-user-job-05] |   `-- Extracting indexinfo-0.3.1_1: .... done
[142amd64-default-build-as-user-job-05] `-- Extracting gettext-runtime-0.23.1: .......... done
[142amd64-default-build-as-user-job-05] `-- Installing readline-8.2.13_2...
[142amd64-default-build-as-user-job-05] `-- Extracting readline-8.2.13_2: .......... done
[142amd64-default-build-as-user-job-05] Extracting bash-5.2.37: .......... done
<snip>
      -- Looking for stat64
      -- Looking for stat64 - not found
      -- Looking for vfork
      -- Looking for vfork - found
      -- Looking for pipe
      -- Looking for pipe - found
      -- Looking for pipe2
      -- Looking for pipe2 - found
      -- Looking for getmntinfo
      -- Looking for getmntinfo - found
      -- Looking for strcpy_s
      -- Looking for strcpy_s - not found
      -- Looking for strlcat
      -- Looking for strlcat - found
      -- Looking for posix_fadvise
      -- Looking for posix_fadvise - found
      -- Looking for fallocate
      -- Looking for fallocate - not found
      -- Looking for preadv
      -- Looking for preadv - found
      -- Looking for pwritev
      -- Looking for pwritev - found
      -- Looking for ioctl
      -- Looking for ioctl - found
      -- Looking for sched_getaffinity
      -- Looking for sched_getaffinity - found
      -- Looking for sched_setaffinity
      -- Looking for sched_setaffinity - found
      -- Looking for sched_getcpu
      -- Looking for sched_getcpu - found
      -- Looking for pthread_setcancelstate
      -- Looking for pthread_setcancelstate - found
      -- Looking for include file gnu/lib-names.h
      -- Looking for include file gnu/lib-names.h - not found
      -- Looking for TIOCGWINSZ
      -- Looking for TIOCGWINSZ - found
      -- Looking for cfsetspeed
      -- Looking for cfsetspeed - found
      -- Looking for cfmakeraw
      -- Looking for cfmakeraw - found
      -- Performing Test HAVE_UTSNAME_DOMAINNAME
      -- Performing Test HAVE_UTSNAME_DOMAINNAME - Failed
      -- Performing Test HAVE_STAT_BIRTHTIME
      -- Performing Test HAVE_STAT_BIRTHTIME - Success
      -- Performing Test HAVE_STAT_FLAGS
      -- Performing Test HAVE_STAT_FLAGS - Success
      -- Looking for lchflags
      -- Looking for lchflags - found
      -- Performing Test HAVE_STAT_TIMESPEC
      -- Performing Test HAVE_STAT_TIMESPEC - Success
      -- Performing Test HAVE_STAT_TIM
      -- Performing Test HAVE_STAT_TIM - Success
      -- Performing Test HAVE_STAT_NSEC
      -- Performing Test HAVE_STAT_NSEC - Success
      -- Performing Test HAVE_DIRENT_NAME_LEN
      -- Performing Test HAVE_DIRENT_NAME_LEN - Success
      -- Performing Test HAVE_STATFS_FSTYPENAME
      -- Performing Test HAVE_STATFS_FSTYPENAME - Success
      -- Performing Test HAVE_STATVFS_FSTYPENAME
      -- Performing Test HAVE_STATVFS_FSTYPENAME - Failed
      -- Looking for statfs
      -- Looking for statfs - found
      -- Looking for getrlimit
      -- Looking for getrlimit - found
      -- Looking for setrlimit
      -- Looking for setrlimit - found
      -- Check size of struct statfs
      -- Check size of struct statfs - done
      -- Performing Test HAVE_GNU_STRERROR_R
      -- Performing Test HAVE_GNU_STRERROR_R - Failed
      -- Performing Test HAVE_READDIR_R
      -- Performing Test HAVE_READDIR_R - Success
      -- Performing Test KEVENT_HAS_VOID_UDATA
      -- Performing Test KEVENT_HAS_VOID_UDATA - Success
      -- Performing Test HAVE_SENDFILE_4
      -- Performing Test HAVE_SENDFILE_4 - Failed
      -- Performing Test HAVE_SENDFILE_6
      -- Performing Test HAVE_SENDFILE_6 - Failed
      -- Performing Test HAVE_SENDFILE_7
      -- Performing Test HAVE_SENDFILE_7 - Success
      -- Looking for fcopyfile
      -- Looking for fcopyfile - not found
      -- Looking for include file sys/sockio.h
      -- Looking for include file sys/sockio.h - found
      -- Looking for include file linux/ethtool.h
      -- Looking for include file linux/ethtool.h - not found
      -- Looking for include file sys/poll.h
      -- Looking for include file sys/poll.h - found
      -- Looking for include file sys/proc_info.h
      -- Looking for include file sys/proc_info.h - not found
      -- Looking for include files time.h, linux/errqueue.h
      -- Looking for include files time.h, linux/errqueue.h - not found
      -- Looking for epoll_create1
      -- Looking for epoll_create1 - not found
      -- Looking for accept4
      -- Looking for accept4 - found
      -- Looking for kqueue
      -- Looking for kqueue - found
      -- Looking for disconnectx
      -- Looking for disconnectx - not found
      -- Looking for connectx
      -- Looking for connectx - not found
      -- Performing Test HAVE_GETNAMEINFO_SIGNED_FLAGS
      -- Performing Test HAVE_GETNAMEINFO_SIGNED_FLAGS - Success
      -- Looking for malloc_size
      -- Looking for malloc_size - not found
      -- Looking for malloc_usable_size
      -- Looking for malloc_usable_size - found
      -- Looking for malloc_usable_size
      -- Looking for malloc_usable_size - found
      -- Performing Test HAVE_SHM_OPEN_THAT_WORKS_WELL_ENOUGH_WITH_MMAP
      -- Performing Test HAVE_SHM_OPEN_THAT_WORKS_WELL_ENOUGH_WITH_MMAP - Success
      -- Performing Test HAVE_CLOCK_MONOTONIC
      -- Performing Test HAVE_CLOCK_MONOTONIC - Success
      -- Performing Test HAVE_CLOCK_REALTIME
      -- Performing Test HAVE_CLOCK_REALTIME - Success
      -- Looking for clock_gettime_nsec_np
      -- Looking for clock_gettime_nsec_np - not found
      -- Looking for pthread_create in pthread
      -- Looking for pthread_create in pthread - found
      -- Looking for pthread_create in c
      -- Looking for pthread_create in c - not found
      -- Looking for pthread_condattr_setclock in pthread
      -- Looking for pthread_condattr_setclock in pthread - found
      -- Looking for futimes
      -- Looking for futimes - found
      -- Looking for futimens
    MSBUILD : error MSB4166: Child node "2" exited prematurely. Shutting down. Diagnostic information may be found in files in "/tmp/MSBuildTempnobody/" and will be named MSBuild_*.failure.txt. This location can be changed by setting the MSBUILDDEBUGPATH environment variable to a different directory.
    /wrkdirs/usr/ports/lang/dotnet/work/dotnet-9.0.5/src/runtime/src/native/libs/build-native.proj(73,5): warning MSB5021: Terminating the task executable "sh" and its child processes because the build was canceled.
    
    Build FAILED.
    
    /wrkdirs/usr/ports/lang/dotnet/work/dotnet-9.0.5/src/runtime/src/native/libs/build-native.proj(73,5): warning MSB5021: Terminating the task executable "sh" and its child processes because the build was canceled.
    MSBUILD : error MSB4166: Child node "2" exited prematurely. Shutting down. Diagnostic information may be found in files in "/tmp/MSBuildTempnobody/" and will be named MSBuild_*.failure.txt. This location can be changed by setting the MSBUILDDEBUGPATH environment variable to a different directory.
        1 Warning(s)
        1 Error(s)
    
    Time Elapsed 00:17:39.95
    Build failed with exit code 1. Check errors above.
  /wrkdirs/usr/ports/lang/dotnet/work/dotnet-9.0.5/artifacts/source-built-sdks/Microsoft.DotNet.Arcade.Sdk/tools/SourceBuild/SourceBuildArcadeBuild.targets(130,5): error MSB3073: The command "./build.sh  --restore --build --publish --arch x64 --configuration Release --allconfigurations --verbosity minimal --nodereuse false --warnAsError false --outputrid freebsd.14-x64 /p:PackageOS=freebsd /p:ToolsOS=freebsd /p:AdditionalRuntimeIdentifierParent=freebsd-x64 /p:DotNetBuildRepo=true /p:DotNetBuildOrchestrator=true /p:OfficialBuildId=20250415.9 /p:ContinuousIntegrationBuild=true /p:PortableBuild=false /p:RestoreConfigFile=/wrkdirs/usr/ports/lang/dotnet/work/dotnet-9.0.5/artifacts/obj/runtime/NuGet.config /p:SourceBuiltAssetsDir=/wrkdirs/usr/ports/lang/dotnet/work/dotnet-9.0.5/artifacts/assets/Release/ /p:SourceBuiltShippingPackagesDir=/wrkdirs/usr/ports/lang/dotnet/work/dotnet-9.0.5/artifacts/packages/Release/Shipping/runtime/ /p:SourceBuiltNonShippingPackagesDir=/wrkdirs/usr/po
rts/lang/dotnet/work/dotnet-9.0.5/artifacts/packages/Release/NonShipping/runtime/ /p:SourceBuiltAssetManifestsDir=/wrkdirs/usr/ports/lang/dotnet/work/dotnet-9.0.5/artifacts/obj/AssetManifests/runtime/ /p:SourceBuiltSymbolsDir=/wrkdirs/usr/ports/lang/dotnet/work/dotnet-9.0.5/artifacts/obj/Symbols/runtime/ /p:GitHubRepositoryName=runtime --cmakeargs -DCLR_CMAKE_USE_SYSTEM_BROTLI=true /p:DotNetBuildInnerRepo=true /p:DotNetBuildSourceOnly=true /p:ArcadeInnerBuildFromSource=true /p:DotNetBuildFromSource=true /p:RepoRoot="/wrkdirs/usr/ports/lang/dotnet/work/dotnet-9.0.5/src/runtime/" /p:ArtifactsDir="/wrkdirs/usr/ports/lang/dotnet/work/dotnet-9.0.5/src/runtime/artifacts/" /bl:"/wrkdirs/usr/ports/lang/dotnet/work/dotnet-9.0.5/src/runtime/artifacts/log/Release/source-inner-build.binlog" /p:ContinuousIntegrationBuild=true /p:SourceBuildOutputDir="/wrkdirs/usr/ports/lang/dotnet/work/dotnet-9.0.5/src/runtime/artifacts/sb/" /p:DotNetPackageVersionPropsPath="/wrkdirs/usr/ports/lang/dotne
t/work/dotnet-9.0.5/artifacts/obj/PackageVersions/PackageVersions.runtime.props" /p:FullAssemblySigningSupported=false /p:DotNetPublishUsingPipelines=true /p:GitHubRepositoryName=runtime" exited with code 1. [/wrkdirs/usr/ports/lang/dotnet/work/dotnet-9.0.5/artifacts/source-built-sdks/Microsoft.DotNet.Arcade.Sdk/tools/Build.proj]
  ##vso[task.logissue type=error;sourcepath=/wrkdirs/usr/ports/lang/dotnet/work/dotnet-9.0.5/artifacts/source-built-sdks/Microsoft.DotNet.Arcade.Sdk/tools/SourceBuild/SourceBuildArcadeBuild.targets;linenumber=130;columnnumber=5;code=MSB3073;]The command "./build.sh  --restore --build --publish --arch x64 --configuration Release --allconfigurations --verbosity minimal --nodereuse false --warnAsError false --outputrid freebsd.14-x64 /p:PackageOS=freebsd /p:ToolsOS=freebsd /p:AdditionalRuntimeIdentifierParent=freebsd-x64 /p:DotNetBuildRepo=true /p:DotNetBuildOrchestrator=true /p:OfficialBuildId=20250415.9 /p:ContinuousIntegrationBuild=true /p:PortableBuild=false /p:RestoreConfigFile=/wrkdirs/usr/ports/lang/dotnet/work/dotnet-9.0.5/artifacts/obj/runtime/NuGet.config /p:SourceBuiltAssetsDir=/wrkdirs/usr/ports/lang/dotnet/work/dotnet-9.0.5/artifacts/assets/Release/ /p:SourceBuiltShippingPackagesDir=/wrkdirs/usr/ports/lang/dotnet/work/dotnet-9.0.5/artifacts/packages/Release/Shippin
g/runtime/ /p:SourceBuiltNonShippingPackagesDir=/wrkdirs/usr/ports/lang/dotnet/work/dotnet-9.0.5/artifacts/packages/Release/NonShipping/runtime/ /p:SourceBuiltAssetManifestsDir=/wrkdirs/usr/ports/lang/dotnet/work/dotnet-9.0.5/artifacts/obj/AssetManifests/runtime/ /p:SourceBuiltSymbolsDir=/wrkdirs/usr/ports/lang/dotnet/work/dotnet-9.0.5/artifacts/obj/Symbols/runtime/ /p:GitHubRepositoryName=runtime --cmakeargs -DCLR_CMAKE_USE_SYSTEM_BROTLI=true /p:DotNetBuildInnerRepo=true /p:DotNetBuildSourceOnly=true /p:ArcadeInnerBuildFromSource=true /p:DotNetBuildFromSource=true /p:RepoRoot="/wrkdirs/usr/ports/lang/dotnet/work/dotnet-9.0.5/src/runtime/" /p:ArtifactsDir="/wrkdirs/usr/ports/lang/dotnet/work/dotnet-9.0.5/src/runtime/artifacts/" /bl:"/wrkdirs/usr/ports/lang/dotnet/work/dotnet-9.0.5/src/runtime/artifacts/log/Release/source-inner-build.binlog" /p:ContinuousIntegrationBuild=true /p:SourceBuildOutputDir="/wrkdirs/usr/ports/lang/dotnet/work/dotnet-9.0.5/src/runtime/artifacts/sb/" 
/p:DotNetPackageVersionPropsPath="/wrkdirs/usr/ports/lang/dotnet/work/dotnet-9.0.5/artifacts/obj/PackageVersions/PackageVersions.runtime.props" /p:FullAssemblySigningSupported=false /p:DotNetPublishUsingPipelines=true /p:GitHubRepositoryName=runtime" exited with code 1.
  
  Build FAILED.
  
  /wrkdirs/usr/ports/lang/dotnet/work/dotnet-9.0.5/artifacts/source-built-sdks/Microsoft.DotNet.Arcade.Sdk/tools/SourceBuild/SourceBuildArcadeBuild.targets(130,5): error MSB3073: The command "./build.sh  --restore --build --publish --arch x64 --configuration Release --allconfigurations --verbosity minimal --nodereuse false --warnAsError false --outputrid freebsd.14-x64 /p:PackageOS=freebsd /p:ToolsOS=freebsd /p:AdditionalRuntimeIdentifierParent=freebsd-x64 /p:DotNetBuildRepo=true /p:DotNetBuildOrchestrator=true /p:OfficialBuildId=20250415.9 /p:ContinuousIntegrationBuild=true /p:PortableBuild=false /p:RestoreConfigFile=/wrkdirs/usr/ports/lang/dotnet/work/dotnet-9.0.5/artifacts/obj/runtime/NuGet.config /p:SourceBuiltAssetsDir=/wrkdirs/usr/ports/lang/dotnet/work/dotnet-9.0.5/artifacts/assets/Release/ /p:SourceBuiltShippingPackagesDir=/wrkdirs/usr/ports/lang/dotnet/work/dotnet-9.0.5/artifacts/packages/Release/Shipping/runtime/ /p:SourceBuiltNonShippingPackagesDir=/wrkdirs/usr/po
rts/lang/dotnet/work/dotnet-9.0.5/artifacts/packages/Release/NonShipping/runtime/ /p:SourceBuiltAssetManifestsDir=/wrkdirs/usr/ports/lang/dotnet/work/dotnet-9.0.5/artifacts/obj/AssetManifests/runtime/ /p:SourceBuiltSymbolsDir=/wrkdirs/usr/ports/lang/dotnet/work/dotnet-9.0.5/artifacts/obj/Symbols/runtime/ /p:GitHubRepositoryName=runtime --cmakeargs -DCLR_CMAKE_USE_SYSTEM_BROTLI=true /p:DotNetBuildInnerRepo=true /p:DotNetBuildSourceOnly=true /p:ArcadeInnerBuildFromSource=true /p:DotNetBuildFromSource=true /p:RepoRoot="/wrkdirs/usr/ports/lang/dotnet/work/dotnet-9.0.5/src/runtime/" /p:ArtifactsDir="/wrkdirs/usr/ports/lang/dotnet/work/dotnet-9.0.5/src/runtime/artifacts/" /bl:"/wrkdirs/usr/ports/lang/dotnet/work/dotnet-9.0.5/src/runtime/artifacts/log/Release/source-inner-build.binlog" /p:ContinuousIntegrationBuild=true /p:SourceBuildOutputDir="/wrkdirs/usr/ports/lang/dotnet/work/dotnet-9.0.5/src/runtime/artifacts/sb/" /p:DotNetPackageVersionPropsPath="/wrkdirs/usr/ports/lang/dotne
t/work/dotnet-9.0.5/artifacts/obj/PackageVersions/PackageVersions.runtime.props" /p:FullAssemblySigningSupported=false /p:DotNetPublishUsingPipelines=true /p:GitHubRepositoryName=runtime" exited with code 1. [/wrkdirs/usr/ports/lang/dotnet/work/dotnet-9.0.5/artifacts/source-built-sdks/Microsoft.DotNet.Arcade.Sdk/tools/Build.proj]
      0 Warning(s)
      1 Error(s)
  
  Time Elapsed 00:17:41.80
  Build failed with exit code 1. Check errors above.
  
  'runtime' failed during build.
  See '/wrkdirs/usr/ports/lang/dotnet/work/dotnet-9.0.5/artifacts/log/Release/runtime.log' for more information.
  scenario-tests using package version properties saved at /wrkdirs/usr/ports/lang/dotnet/work/dotnet-9.0.5/artifacts/obj/PackageVersions/PackageVersions.scenario-tests.Current.props and /wrkdirs/usr/ports/lang/dotnet/work/dotnet-9.0.5/artifacts/obj/PackageVersions/PackageVersions.scenario-tests.Previous.props
  [23:54:59.58] Building scenario-tests
  Running command:
    /wrkdirs/usr/ports/lang/dotnet/work/dotnet-9.0.5/src/scenario-tests/eng/common/build.sh --restore --build --pack --publish --ci --configuration Release -bl /p:DotNetBuildRepo=true /p:DotNetBuildOrchestrator=true /p:RestoreConfigFile=/wrkdirs/usr/ports/lang/dotnet/work/dotnet-9.0.5/artifacts/obj/scenario-tests/NuGet.config /p:SourceBuiltAssetsDir=/wrkdirs/usr/ports/lang/dotnet/work/dotnet-9.0.5/artifacts/assets/Release/ /p:SourceBuiltAssetManifestsDir=/wrkdirs/usr/ports/lang/dotnet/work/dotnet-9.0.5/artifacts/obj/AssetManifests/scenario-tests/ /p:SourceBuiltSymbolsDir=/wrkdirs/usr/ports/lang/dotnet/work/dotnet-9.0.5/artifacts/obj/Symbols/scenario-tests/ /p:ArcadeBuildFromSource=true /p:DotNetBuildSourceOnly=true /p:PreviouslySourceBuiltNupkgCacheDir="/wrkdirs/usr/ports/lang/dotnet/work/packages/" /p:ReferencePackageNupkgCacheDir="/wrkdirs/usr/ports/lang/dotnet/work/dotnet-9.0.5/prereqs/packages/reference/" /p:SourceBuiltShippingPackagesDir=/wrkdirs/usr/ports/lang/dotnet/w
ork/dotnet-9.0.5/artifacts/packages/Release/Shipping/scenario-tests/ /p:SourceBuiltNonShippingPackagesDir=/wrkdirs/usr/ports/lang/dotnet/work/dotnet-9.0.5/artifacts/packages/Release/NonShipping/scenario-tests/
    Log: /wrkdirs/usr/ports/lang/dotnet/work/dotnet-9.0.5/artifacts/log/Release/scenario-tests.log
    With Environment Variables:
      DOTNET_INSTALL_DIR=/wrkdirs/usr/ports/lang/dotnet/work/bootstrap_sdk/
      DOTNET_PATH=/wrkdirs/usr/ports/lang/dotnet/work/bootstrap_sdk/
      DOTNET_HOST_PATH=/wrkdirs/usr/ports/lang/dotnet/work/bootstrap_sdk/dotnet
      _InitializeDotNetCli=/wrkdirs/usr/ports/lang/dotnet/work/bootstrap_sdk/
      _DotNetInstallDir=/wrkdirs/usr/ports/lang/dotnet/work/bootstrap_sdk/
      _InitializeToolset=/wrkdirs/usr/ports/lang/dotnet/work/dotnet-9.0.5/artifacts/source-built-sdks/Microsoft.DotNet.Arcade.Sdk/tools/Build.proj
      _OverrideArcadeInitializeBuildToolFramework=net9.0
      ContinuousIntegrationBuild=true
      MSBUILDDISABLENODEREUSE=1
      OfficialBuildId=20250313.1
      BUILD_BUILDNUMBER=20250313.1
      DotNetUseShippingVersions=true
      PreReleaseVersionLabel=preview
      PackageVersionStamp=preview
      DeterministicSourcePaths=true
      SourceRoot=/wrkdirs/usr/ports/lang/dotnet/work/dotnet-9.0.5/src/scenario-tests/
      DotNetBuildFromSourceFlavor=Product
      DotNetPackageVersionPropsPath=/wrkdirs/usr/ports/lang/dotnet/work/dotnet-9.0.5/artifacts/obj/PackageVersions/PackageVersions.scenario-tests.props
      RestoreConfigFile=/wrkdirs/usr/ports/lang/dotnet/work/dotnet-9.0.5/artifacts/obj/scenario-tests/NuGet.config
      DotNetBuildFromSource=true
      MSBUILDADDITIONALSDKRESOLVERSFOLDER=/wrkdirs/usr/ports/lang/dotnet/work/dotnet-9.0.5/artifacts/toolset/VSSdkResolvers/
      SOURCE_BUILT_SDK_ID_ARCADE=Microsoft.DotNet.Arcade.Sdk
      SOURCE_BUILT_SDK_ID_ARCADE_SHARED_FX_SDK=Microsoft.DotNet.SharedFramework.Sdk
      SOURCE_BUILT_SDK_ID_ARCADE_CMAKE_SDK=Microsoft.DotNet.CMake.Sdk
      SOURCE_BUILT_SDK_ID_TRAVERSAL=Microsoft.Build.Traversal
      SOURCE_BUILT_SDK_ID_NOTARGETS=Microsoft.Build.NoTargets
      SOURCE_BUILT_SDK_VERSION_ARCADE=9.0.0-beta.25208.6
      SOURCE_BUILT_SDK_VERSION_ARCADE_SHARED_FX_SDK=9.0.0-beta.25208.6
      SOURCE_BUILT_SDK_VERSION_ARCADE_CMAKE_SDK=9.0.0-beta.25208.6
      SOURCE_BUILT_SDK_VERSION_TRAVERSAL=3.4.0
      SOURCE_BUILT_SDK_VERSION_NOTARGETS=3.7.0
      SOURCE_BUILT_SDK_DIR_ARCADE=/wrkdirs/usr/ports/lang/dotnet/work/dotnet-9.0.5/artifacts/source-built-sdks/Microsoft.DotNet.Arcade.Sdk/
      SOURCE_BUILT_SDK_DIR_ARCADE_SHARED_FX_SDK=/wrkdirs/usr/ports/lang/dotnet/work/dotnet-9.0.5/artifacts/source-built-sdks/Microsoft.DotNet.SharedFramework.Sdk/
      SOURCE_BUILT_SDK_DIR_ARCADE_CMAKE_SDK=/wrkdirs/usr/ports/lang/dotnet/work/dotnet-9.0.5/artifacts/source-built-sdks/Microsoft.DotNet.CMake.Sdk/
      SOURCE_BUILT_SDK_DIR_TRAVERSAL=/wrkdirs/usr/ports/lang/dotnet/work/dotnet-9.0.5/artifacts/source-built-sdks/Microsoft.Build.Traversal/
      SOURCE_BUILT_SDK_DIR_NOTARGETS=/wrkdirs/usr/ports/lang/dotnet/work/dotnet-9.0.5/artifacts/source-built-sdks/Microsoft.Build.NoTargets/
./build.sh: line 232: 73307 Killed                  "$CLI_ROOT/dotnet" msbuild --restore "$project" $bl $targets "${properties[@]}"
*** Error code 137

Stop.
make: stopped in /usr/ports/lang/dotnet