[package - 135amd64-quarterly][lang/dotnet] Failed for dotnet-9.0.4 in build
- Go to: [ bottom of page ] [ top of archives ] [ this month ]
Date: Wed, 02 Jul 2025 10:35:10 UTC
You are receiving this mail as a port that you maintain
is failing to build on the FreeBSD package build server.
Please investigate the failure and submit a PR to fix
build.
Maintainer: arrowd@FreeBSD.org
Log URL: https://pkg-status.freebsd.org/beefy14/data/135amd64-quarterly/cf18fab2d3b5/logs/dotnet-9.0.4.log
Build URL: https://pkg-status.freebsd.org/beefy14/build.html?mastername=135amd64-quarterly&build=cf18fab2d3b5
Log:
=>> Building lang/dotnet
build started at Wed Jul 2 10:03:44 UTC 2025
port directory: /usr/ports/lang/dotnet
package name: dotnet-9.0.4
building for: FreeBSD 135amd64-quarterly-job-07 13.5-RELEASE-p1 FreeBSD 13.5-RELEASE-p1 amd64
maintained by: arrowd@FreeBSD.org
Makefile datestamp: -rw-r--r-- 1 root wheel 5027 May 15 01:01 /usr/ports/lang/dotnet/Makefile
Ports top last git commit: cf18fab2d
Ports top unclean checkout: no
Port dir last git commit: 4d8cb5fd6
Port dir unclean checkout: no
Poudriere version: poudriere-git-3.4.2-12-g74a54a88
Host OSVERSION: 1500035
Jail OSVERSION: 1305000
Job Id: 07
---Begin Environment---
SHELL=/bin/csh
OSVERSION=1305000
UNAME_v=FreeBSD 13.5-RELEASE-p1
UNAME_r=13.5-RELEASE-p1
BLOCKSIZE=K
MAIL=/var/mail/root
MM_CHARSET=UTF-8
LANG=C.UTF-8
STATUS=1
HOME=/root
PATH=/sbin:/bin:/usr/sbin:/usr/bin:/usr/local/sbin:/usr/local/bin:/root/bin
MAKE_OBJDIR_CHECK_WRITABLE=0
LOCALBASE=/usr/local
USER=root
POUDRIERE_NAME=poudriere-git
LIBEXECPREFIX=/usr/local/libexec/poudriere
POUDRIERE_VERSION=3.4.2-12-g74a54a88
MASTERMNT=/usr/local/poudriere/data/.m/135amd64-quarterly/ref
LC_COLLATE=C
POUDRIERE_BUILD_TYPE=bulk
PACKAGE_BUILDING=yes
SAVED_TERM=
OUTPUT_REDIRECTED_STDERR=4
OUTPUT_REDIRECTED=1
PWD=/usr/local/poudriere/data/.m/135amd64-quarterly/07/.p
OUTPUT_REDIRECTED_STDOUT=3
P_PORTS_FEATURES=FLAVORS SUBPACKAGES SELECTED_OPTIONS
MASTERNAME=135amd64-quarterly
SCRIPTPREFIX=/usr/local/share/poudriere
SCRIPTNAME=bulk.sh
OLDPWD=/usr/local/poudriere/data/.m/135amd64-quarterly/ref/.p/pool
POUDRIERE_PKGNAME=poudriere-git-3.4.2-12-g74a54a88
SCRIPTPATH=/usr/local/share/poudriere/bulk.sh
POUDRIEREPATH=/usr/local/bin/poudriere
---End Environment---
---Begin Poudriere Port Flags/Env---
PORT_FLAGS=
PKGENV=
FLAVOR=
MAKE_ARGS=
---End Poudriere Port Flags/Env---
---Begin OPTIONS List---
---End OPTIONS List---
--MAINTAINER--
arrowd@FreeBSD.org
--End MAINTAINER--
--CONFIGURE_ARGS--
--End CONFIGURE_ARGS--
--CONFIGURE_ENV--
PKG_CONFIG=pkgconf PYTHON="/usr/local/bin/python3.11" XDG_DATA_HOME=/wrkdirs/usr/ports/lang/dotnet/work XDG_CONFIG_HOME=/wrkdirs/usr/ports/lang/dotnet/work XDG_CACHE_HOME=/wrkdirs/usr/ports/lang/dotnet/work/.cache HOME=/wrkdirs/usr/ports/lang/dotnet/work TMPDIR="/tmp" PATH=/wrkdirs/usr/ports/lang/dotnet/work/.bin:/sbin:/bin:/usr/sbin:/usr/bin:/usr/local/sbin:/usr/local/bin:/root/bin PKG_CONFIG_LIBDIR=/wrkdirs/usr/ports/lang/dotnet/work/.pkgconfig:/usr/local/libdata/pkgconfig:/usr/local/share/pkgconfig:/usr/libdata/pkgconfig SHELL=/bin/sh CONFIG_SHELL=/bin/sh DEFAULT_AUTOCONF=2.72
--End CONFIGURE_ENV--
--MAKE_ENV--
OPENSSLBASE=/usr OPENSSLDIR=/etc/ssl OPENSSLINC=/usr/include OPENSSLLIB=/usr/lib XDG_DATA_HOME=/wrkdirs/usr/ports/lang/dotnet/work XDG_CONFIG_HOME=/wrkdirs/usr/ports/lang/dotnet/work XDG_CACHE_HOME=/wrkdirs/usr/ports/lang/dotnet/work/.cache HOME=/wrkdirs/usr/ports/lang/dotnet/work TMPDIR="/tmp" PATH=/wrkdirs/usr/ports/lang/dotnet/work/.bin:/sbin:/bin:/usr/sbin:/usr/bin:/usr/local/sbin:/usr/local/bin:/root/bin PKG_CONFIG_LIBDIR=/wrkdirs/usr/ports/lang/dotnet/work/.pkgconfig:/usr/local/libdata/pkgconfig:/usr/local/share/pkgconfig:/usr/libdata/pkgconfig MK_DEBUG_FILES=no MK_KERNEL_SYMBOLS=no SHELL=/bin/sh NO_LINT=YES DEFAULT_AUTOCONF=2.72 PREFIX=/usr/local LOCALBASE=/usr/local CC="cc" CFLAGS="-O2 -pipe -fstack-protector-strong -fno-strict-aliasing " CPP="cpp" CPPFLAGS="" LDFLAGS=" -Wl,-rpath,/usr/local/lib:/usr/lib -fstack-protector-strong " LIBS="" CXX="c++" CXXFLAGS="-O2 -pipe -fstack-protector-strong -fno-strict-aliasing " BSD_INSTALL_PROGRAM="install -s -m 555"
BSD_INSTALL_LIB="install -s -m 0644" BSD_INSTALL_SCRIPT="install -m 555" BSD_INSTALL_DATA="install -m 0644" BSD_INSTALL_MAN="install -m 444"
--End MAKE_ENV--
--PLIST_SUB--
DOTNET_ARCH=x64 FULL_DOTNETVERSION=9.0.4 DOTNETVERSION=9.0 SDKVERSION=9.0.105 SDK_RID=freebsd.13-x64 SDKVERSIONSUFFIX=-servicing.25164.3 SDKSERVICESUFFIX=-servicing.25165.1 MANIFESTSUFFIX=9.0.100 LIBPACKSUFFIX=-servicing.25163.5 NONPORTABLE= PYTHON_INCLUDEDIR=include/python3.11 PYTHON_LIBDIR=lib/python3.11 PYTHON_PLATFORM=freebsd13 PYTHON_SITELIBDIR=lib/python3.11/site-packages PYTHON_SUFFIX=311 PYTHON_EXT_SUFFIX=.cpython-311 PYTHON_VER=3.11 PYTHON_VERSION=python3.11 PYTHON2="@comment " PYTHON3="" VXSORT= OSREL=13.5 PREFIX=%D LOCALBASE=/usr/local RESETPREFIX=/usr/local LIB32DIR=lib DOCSDIR="share/doc/dotnet" EXAMPLESDIR="share/examples/dotnet" DATADIR="share/dotnet" WWWDIR="www/dotnet" ETCDIR="etc/dotnet"
--End PLIST_SUB--
--SUB_LIST--
PYTHON_INCLUDEDIR=/usr/local/include/python3.11 PYTHON_LIBDIR=/usr/local/lib/python3.11 PYTHON_PLATFORM=freebsd13 PYTHON_SITELIBDIR=/usr/local/lib/python3.11/site-packages PYTHON_SUFFIX=311 PYTHON_EXT_SUFFIX=.cpython-311 PYTHON_VER=3.11 PYTHON_VERSION=python3.11 PYTHON2="@comment " PYTHON3="" PREFIX=/usr/local LOCALBASE=/usr/local DATADIR=/usr/local/share/dotnet DOCSDIR=/usr/local/share/doc/dotnet EXAMPLESDIR=/usr/local/share/examples/dotnet WWWDIR=/usr/local/www/dotnet ETCDIR=/usr/local/etc/dotnet
--End SUB_LIST--
---Begin make.conf---
USE_PACKAGE_DEPENDS=yes
BATCH=yes
WRKDIRPREFIX=/wrkdirs
PORTSDIR=/usr/ports
PACKAGES=/packages
DISTDIR=/distfiles
PACKAGE_BUILDING=yes
PACKAGE_BUILDING_FLAVORS=yes
#### ####
# XXX: We really need this but cannot use it while 'make checksum' does not
# try the next mirror on checksum failure. It currently retries the same
# failed mirror and then fails rather then trying another. It *does*
# try the next if the size is mismatched though.
#MASTER_SITE_FREEBSD=yes
# Build ALLOW_MAKE_JOBS_PACKAGES with 3 jobs
MAKE_JOBS_NUMBER=3
#### Misc Poudriere ####
.include "/etc/make.conf.ports_env"
GID=0
UID=0
---End make.conf---
--Resource limits--
cpu time (seconds, -t) unlimited
file size (512-blocks, -f) unlimited
data seg size (kbytes, -d) 33554432
stack size (kbytes, -s) 524288
core file size (512-blocks, -c) unlimited
max memory size (kbytes, -m) unlimited
locked memory (kbytes, -l) unlimited
max user processes (-u) 89999
open files (-n) 8192
virtual mem size (kbytes, -v) unlimited
swap limit (kbytes, -w) unlimited
socket buffer size (bytes, -b) unlimited
pseudo-terminals (-p) unlimited
kqueues (-k) unlimited
umtx shared locks (-o) unlimited
--End resource limits--
=======================<phase: check-sanity >============================
===== env: NO_DEPENDS=yes USER=root UID=0 GID=0
===> License MIT accepted by the user
===========================================================================
=======================<phase: pkg-depends >============================
===== env: USE_PACKAGE_DEPENDS_ONLY=1 USER=root UID=0 GID=0
===> dotnet-9.0.4 depends on file: /usr/local/sbin/pkg - not found
===> Installing existing package /packages/All/pkg-2.2.0.pkg
[135amd64-quarterly-job-07] Installing pkg-2.2.0...
[135amd64-quarterly-job-07] Extracting pkg-2.2.0: .......... done
===> dotnet-9.0.4 depends on file: /usr/local/sbin/pkg - found
===> Returning to build of dotnet-9.0.4
===========================================================================
=======================<phase: fetch-depends >============================
===== env: USE_PACKAGE_DEPENDS_ONLY=1 USER=root UID=0 GID=0
===========================================================================
=======================<phase: fetch >============================
===== env: NO_DEPENDS=yes USER=root UID=0 GID=0
===> License MIT accepted by the user
===> Fetching all distfiles required by dotnet-9.0.4 for building
===========================================================================
=======================<phase: checksum >============================
===== env: NO_DEPENDS=yes USER=root UID=0 GID=0
===> License MIT accepted by the user
===> Fetching all distfiles required by dotnet-9.0.4 for building
=> SHA256 Checksum OK for dotnet/release.json-9.0.4.
=> SHA256 Checksum OK for dotnet/Private.SourceBuilt.Artifacts.9.0.103-servicing.25071.1.freebsd-x64.tar.gz.
=> SHA256 Checksum OK for dotnet/dotnet-sdk-9.0.103-freebsd-x64.tar.gz.
=> SHA256 Checksum OK for dotnet/dotnet-dotnet-v9.0.4_GH0.tar.gz.
===========================================================================
=======================<phase: extract-depends>============================
===== env: USE_PACKAGE_DEPENDS_ONLY=1 USER=root UID=0 GID=0
===========================================================================
=======================<phase: extract >============================
===== env: NO_DEPENDS=yes USER=root UID=0 GID=0
===> License MIT accepted by the user
===> Fetching all distfiles required by dotnet-9.0.4 for building
===> Extracting for dotnet-9.0.4
=> SHA256 Checksum OK for dotnet/release.json-9.0.4.
=> SHA256 Checksum OK for dotnet/Private.SourceBuilt.Artifacts.9.0.103-servicing.25071.1.freebsd-x64.tar.gz.
=> SHA256 Checksum OK for dotnet/dotnet-sdk-9.0.103-freebsd-x64.tar.gz.
=> SHA256 Checksum OK for dotnet/dotnet-dotnet-v9.0.4_GH0.tar.gz.
cp -f /portdistfiles/dotnet/release.json-9.0.4 /wrkdirs/usr/ports/lang/dotnet/work/dotnet-9.0.4/release.json
/usr/bin/tar -xf /portdistfiles/dotnet/Private.SourceBuilt.Artifacts.9.0.103-servicing.25071.1.freebsd-x64.tar.gz -C /wrkdirs/usr/ports/lang/dotnet/work/packages --no-same-owner --no-same-permissions
/usr/bin/tar -xf /portdistfiles/dotnet/dotnet-sdk-9.0.103-freebsd-x64.tar.gz -C /wrkdirs/usr/ports/lang/dotnet/work/bootstrap_sdk --no-same-owner --no-same-permissions
elfctl -e +noaslr /wrkdirs/usr/ports/lang/dotnet/work/bootstrap_sdk/dotnet
===========================================================================
=======================<phase: patch-depends >============================
===== env: USE_PACKAGE_DEPENDS_ONLY=1 USER=root UID=0 GID=0
===========================================================================
=======================<phase: patch >============================
===== env: NO_DEPENDS=yes USER=root UID=0 GID=0
===> Patching for dotnet-9.0.4
===> Applying extra patch /usr/ports/lang/dotnet/files/extra-patch-base-openssl
===> Applying FreeBSD patches for dotnet-9.0.4 from /usr/ports/lang/dotnet/files
/usr/bin/sed -i.bak -e 's|linux-x64|freebsd-x64|g' /wrkdirs/usr/ports/lang/dotnet/work/bootstrap_sdk/sdk/9.0.103/Microsoft.NETCoreSdk.BundledVersions.props
===========================================================================
=======================<phase: build-depends >============================
===== env: USE_PACKAGE_DEPENDS_ONLY=1 USER=root UID=0 GID=0
===> dotnet-9.0.4 depends on executable: bash - not found
===> Installing existing package /packages/All/bash-5.2.37.pkg
[135amd64-quarterly-job-07] Installing bash-5.2.37...
[135amd64-quarterly-job-07] `-- Installing gettext-runtime-0.23.1...
[135amd64-quarterly-job-07] | `-- Installing indexinfo-0.3.1_1...
[135amd64-quarterly-job-07] | `-- Extracting indexinfo-0.3.1_1: .... done
[135amd64-quarterly-job-07] `-- Extracting gettext-runtime-0.23.1: .......... done
[135amd64-quarterly-job-07] `-- Installing readline-8.2.13_2...
[135amd64-quarterly-job-07] `-- Extracting readline-8.2.13_2: .......... done
[135amd64-quarterly-job-07] Extracting bash-5.2.37: .......... done
===> dotnet-9.0.4 depends on executable: bash - found
===> Returning to build of dotnet-9.0.4
===> dotnet-9.0.4 depends on executable: cmake - not found
===> Installing existing package /packages/All/cmake-core-3.31.6.pkg
<snip>
[ 71%] Building CXX object tools/superpmi/superpmi-shim-counter/CMakeFiles/superpmi-shim-counter.dir/__/superpmi-shared/hash.cpp.o
[ 71%] Building CXX object jit/CMakeFiles/clrjit.dir/inlinepolicy.cpp.o
[ 71%] Building CXX object tools/superpmi/superpmi-shim-counter/CMakeFiles/superpmi-shim-counter.dir/__/superpmi-shared/logging.cpp.o
[ 71%] Building CXX object jit/CMakeFiles/clrjit_win_x64_x64.dir/hwintrinsic.cpp.o
[ 71%] Building CXX object tools/superpmi/superpmi-shim-collector/CMakeFiles/superpmi-shim-collector.dir/__/superpmi-shared/logging.cpp.o
[ 71%] Building CXX object jit/CMakeFiles/clrjit_win_x64_x64.dir/hostallocator.cpp.o
[ 71%] Building CXX object tools/superpmi/superpmi/CMakeFiles/superpmi.dir/__/superpmi-shared/logging.cpp.o
[ 71%] Building CXX object jit/CMakeFiles/clrjit_win_x86_x64.dir/gschecks.cpp.o
[ 71%] Building CXX object tools/superpmi/superpmi-shim-collector/CMakeFiles/superpmi-shim-collector.dir/__/superpmi-shared/mclist.cpp.o
[ 71%] Building CXX object jit/static/CMakeFiles/clrjit_static.dir/__/simd.cpp.o
[ 71%] Building CXX object vm/wks/CMakeFiles/cee_wks_core.dir/__/zapsig.cpp.o
[ 71%] Building CXX object jit/CMakeFiles/clrjit_win_x64_x64.dir/ifconversion.cpp.o
[ 71%] Building CXX object tools/superpmi/superpmi-shim-simple/CMakeFiles/superpmi-shim-simple.dir/__/superpmi-shared/errorhandling.cpp.o
[ 71%] Building CXX object jit/CMakeFiles/clrjit.dir/instr.cpp.o
[ 71%] Building CXX object tools/superpmi/superpmi-shim-simple/CMakeFiles/superpmi-shim-simple.dir/__/superpmi-shared/hash.cpp.o
[ 71%] Building CXX object jit/CMakeFiles/clrjit_win_x64_x64.dir/importer.cpp.o
[ 71%] Building CXX object jit/CMakeFiles/clrjit_universal_arm64_x64.dir/instr.cpp.o
[ 71%] Building CXX object jit/CMakeFiles/clrjit_unix_x64_x64.dir/hostallocator.cpp.o
[ 71%] Building CXX object jit/CMakeFiles/clrjit_unix_x64_x64.dir/hwintrinsic.cpp.o
[ 71%] Building CXX object jit/CMakeFiles/clrjit_win_x64_x64.dir/importercalls.cpp.o
[ 71%] Building CXX object tools/superpmi/superpmi-shim-simple/CMakeFiles/superpmi-shim-simple.dir/__/superpmi-shared/logging.cpp.o
[ 71%] Building CXX object jit/CMakeFiles/clrjit.dir/jitconfig.cpp.o
[ 71%] Building CXX object jit/CMakeFiles/clrjit_universal_arm64_x64.dir/jitconfig.cpp.o
[ 71%] Building CXX object tools/superpmi/superpmi-shim-simple/CMakeFiles/superpmi-shim-simple.dir/__/superpmi-shared/mclist.cpp.o
[ 71%] Building CXX object tools/superpmi/superpmi-shim-simple/CMakeFiles/superpmi-shim-simple.dir/__/superpmi-shared/methodcontext.cpp.o
[ 71%] Building CXX object jit/CMakeFiles/clrjit.dir/jiteh.cpp.o
[ 71%] Building CXX object jit/CMakeFiles/clrjit_unix_x64_x64.dir/ifconversion.cpp.o
[ 71%] Building CXX object jit/CMakeFiles/clrjit_unix_x64_x64.dir/importer.cpp.o
[ 71%] Building CXX object jit/CMakeFiles/clrjit_unix_x64_x64.dir/importercalls.cpp.o
[ 71%] Building CXX object jit/CMakeFiles/clrjit.dir/jithashtable.cpp.o
[ 71%] Building CXX object jit/CMakeFiles/clrjit.dir/jitmetadata.cpp.o
[ 71%] Building CXX object jit/CMakeFiles/clrjit.dir/layout.cpp.o
[ 71%] Building CXX object tools/superpmi/superpmi-shim-collector/CMakeFiles/superpmi-shim-collector.dir/__/superpmi-shared/methodcontext.cpp.o
[ 71%] Building CXX object tools/superpmi/superpmi/CMakeFiles/superpmi.dir/__/superpmi-shared/methodcontext.cpp.o
[ 71%] Building CXX object jit/CMakeFiles/clrjit_win_x64_x64.dir/importervectorization.cpp.o
[ 71%] Building CXX object jit/CMakeFiles/clrjit_win_x64_x64.dir/indirectcalltransformer.cpp.o
[ 71%] Building CXX object jit/CMakeFiles/clrjit_unix_x64_x64.dir/importervectorization.cpp.o
[ 71%] Building CXX object jit/CMakeFiles/clrjit_win_x64_x64.dir/inductionvariableopts.cpp.o
[ 71%] Building CXX object jit/CMakeFiles/clrjit_unix_x64_x64.dir/indirectcalltransformer.cpp.o
[ 71%] Building CXX object jit/CMakeFiles/clrjit_win_x64_x64.dir/inline.cpp.o
[ 71%] Building CXX object jit/CMakeFiles/clrjit_win_x64_x64.dir/inlinepolicy.cpp.o
[ 71%] Building CXX object jit/CMakeFiles/clrjit_unix_x64_x64.dir/inductionvariableopts.cpp.o
[ 71%] Building CXX object jit/CMakeFiles/clrjit_win_x64_x64.dir/instr.cpp.o
[ 72%] Building CXX object jit/CMakeFiles/clrjit_win_x86_x64.dir/hashbv.cpp.o
[ 71%] Building CXX object tools/superpmi/superpmi/CMakeFiles/superpmi.dir/__/superpmi-shared/mclist.cpp.o
[ 72%] Building CXX object jit/CMakeFiles/clrjit_win_x86_x64.dir/helperexpansion.cpp.o
[ 72%] Building CXX object jit/CMakeFiles/clrjit_universal_arm64_x64.dir/jiteh.cpp.o
[ 72%] Building CXX object tools/superpmi/superpmi-shim-collector/CMakeFiles/superpmi-shim-collector.dir/__/superpmi-shared/spmiutil.cpp.o
[ 72%] Building CXX object jit/CMakeFiles/clrjit_universal_arm64_x64.dir/jithashtable.cpp.o
[ 72%] Building CXX object jit/CMakeFiles/clrjit_universal_arm64_x64.dir/jitmetadata.cpp.o
[ 72%] Building CXX object jit/CMakeFiles/clrjit_universal_arm64_x64.dir/layout.cpp.o
[ 72%] Building CXX object jit/CMakeFiles/clrjit_universal_arm64_x64.dir/lclmorph.cpp.o
[ 74%] Building CXX object jit/CMakeFiles/clrjit_universal_arm64_x64.dir/lclvars.cpp.o
[ 74%] Building CXX object tools/superpmi/superpmi-shim-collector/CMakeFiles/superpmi-shim-collector.dir/__/superpmi-shared/methodcontextreader.cpp.o
[ 74%] Building CXX object tools/superpmi/superpmi-shim-collector/CMakeFiles/superpmi-shim-collector.dir/__/superpmi-shared/simpletimer.cpp.o
[ 74%] Building CXX object tools/superpmi/superpmi-shim-counter/CMakeFiles/superpmi-shim-counter.dir/__/superpmi-shared/mclist.cpp.o
[ 74%] Building CXX object jit/CMakeFiles/clrjit_universal_arm64_x64.dir/likelyclass.cpp.o
[ 74%] Building CXX object jit/CMakeFiles/clrjit_universal_arm64_x64.dir/lir.cpp.o
[ 74%] Building CXX object jit/CMakeFiles/clrjit_universal_arm64_x64.dir/liveness.cpp.o
[ 74%] Building CXX object jit/CMakeFiles/clrjit_universal_arm64_x64.dir/loopcloning.cpp.o
[ 74%] Building CXX object jit/CMakeFiles/clrjit_universal_arm64_x64.dir/lower.cpp.o
[ 74%] Building CXX object jit/CMakeFiles/clrjit_universal_arm_x64.dir/ifconversion.cpp.o
[ 74%] Building CXX object tools/superpmi/mcs/CMakeFiles/mcs.dir/verbinteg.cpp.o
[ 74%] Building CXX object tools/superpmi/superpmi/CMakeFiles/superpmi.dir/__/superpmi-shared/methodcontextreader.cpp.o
[ 74%] Building CXX object tools/superpmi/superpmi/CMakeFiles/superpmi.dir/__/superpmi-shared/simpletimer.cpp.o
[ 74%] Building CXX object tools/superpmi/mcs/CMakeFiles/mcs.dir/verbildump.cpp.o
[ 74%] Building CXX object tools/superpmi/superpmi-shim-collector/CMakeFiles/superpmi-shim-collector.dir/__/superpmi-shared/tocfile.cpp.o
[ 74%] Building CXX object tools/superpmi/superpmi-shim-collector/CMakeFiles/superpmi-shim-collector.dir/__/superpmi-shared/typeutils.cpp.o
[ 74%] Building CXX object jit/CMakeFiles/clrjit.dir/lclmorph.cpp.o
[ 74%] Building CXX object tools/superpmi/superpmi-shim-collector/CMakeFiles/superpmi-shim-collector.dir/__/superpmi-shared/spmidumphelper.cpp.o
[ 74%] Building CXX object jit/CMakeFiles/clrjit_universal_arm_x64.dir/importer.cpp.o
[ 74%] Building CXX object jit/CMakeFiles/clrjit.dir/lclvars.cpp.o
[ 74%] Building CXX object tools/superpmi/mcs/CMakeFiles/mcs.dir/verbmerge.cpp.o
[ 74%] Building CXX object tools/superpmi/mcs/CMakeFiles/mcs.dir/verbprintjiteeversion.cpp.o
[ 74%] Building CXX object tools/superpmi/mcs/CMakeFiles/mcs.dir/verbremovedup.cpp.o
[ 74%] Building CXX object jit/CMakeFiles/clrjit_unix_x64_x64.dir/inline.cpp.o
[ 74%] Building CXX object tools/superpmi/mcs/CMakeFiles/mcs.dir/verbstat.cpp.o
[ 74%] Building CXX object jit/CMakeFiles/clrjit.dir/likelyclass.cpp.o
[ 74%] Building CXX object jit/CMakeFiles/clrjit_unix_x64_x64.dir/inlinepolicy.cpp.o
[ 74%] Building CXX object jit/CMakeFiles/clrjit.dir/lir.cpp.o
[ 74%] Building CXX object tools/superpmi/mcs/CMakeFiles/mcs.dir/verbstrip.cpp.o
[ 74%] Building CXX object tools/superpmi/mcs/CMakeFiles/mcs.dir/verbtoc.cpp.o
[ 74%] Building CXX object jit/CMakeFiles/clrjit_unix_x64_x64.dir/instr.cpp.o
[ 74%] Building CXX object jit/CMakeFiles/clrjit.dir/liveness.cpp.o
[ 74%] Building CXX object tools/superpmi/mcs/CMakeFiles/mcs.dir/__/superpmi-shared/asmdumper.cpp.o
[ 74%] Building CXX object tools/superpmi/superpmi-shim-simple/CMakeFiles/superpmi-shim-simple.dir/__/superpmi-shared/methodcontextreader.cpp.o
[ 74%] Building CXX object jit/CMakeFiles/clrjit.dir/loopcloning.cpp.o
[ 74%] Building CXX object jit/CMakeFiles/clrjit_universal_arm_x64.dir/importercalls.cpp.o
[ 74%] Building CXX object jit/CMakeFiles/clrjit_universal_arm_x64.dir/importervectorization.cpp.o
[ 74%] Building CXX object jit/CMakeFiles/clrjit_universal_arm_x64.dir/indirectcalltransformer.cpp.o
[ 74%] Building CXX object jit/CMakeFiles/clrjit_universal_arm_x64.dir/inductionvariableopts.cpp.o
[ 74%] Building CXX object jit/CMakeFiles/clrjit_universal_arm_x64.dir/inline.cpp.o
[ 74%] Building CXX object tools/superpmi/superpmi/CMakeFiles/superpmi.dir/__/superpmi-shared/spmiutil.cpp.o
MSBUILD : error MSB4166: Child node "2" exited prematurely. Shutting down. Diagnostic information may be found in files in "/tmp/MSBuildTemproot/" and will be named MSBuild_*.failure.txt. This location can be changed by setting the MSBUILDDEBUGPATH environment variable to a different directory.
[ 74%] Building CXX object vm/wks/CMakeFiles/cee_wks_core.dir/__/readytoruninfo.cpp.o
[ 74%] Building CXX object jit/CMakeFiles/clrjit_unix_x64_x64.dir/jitconfig.cpp.o
[ 74%] Building CXX object jit/static/CMakeFiles/clrjit_static.dir/__/simdashwintrinsic.cpp.o
[ 74%] Building CXX object jit/CMakeFiles/clrjit_win_x64_x64.dir/jitconfig.cpp.o
[ 74%] Building CXX object tools/superpmi/superpmi-shim-counter/CMakeFiles/superpmi-shim-counter.dir/__/superpmi-shared/methodcontext.cpp.o
[ 74%] Building CXX object jit/CMakeFiles/clrjit_unix_x64_x64.dir/jiteh.cpp.o
[ 74%] Building CXX object vm/wks/CMakeFiles/cee_wks_core.dir/__/appdomainnative.cpp.o
[ 74%] Building CXX object vm/wks/CMakeFiles/cee_wks_core.dir/__/assemblynative.cpp.o
[ 74%] Building CXX object jit/CMakeFiles/clrjit_unix_x64_x64.dir/jithashtable.cpp.o
[ 74%] Building CXX object jit/CMakeFiles/clrjit_unix_x64_x64.dir/jitmetadata.cpp.o
[ 74%] Building CXX object jit/CMakeFiles/clrjit_unix_x64_x64.dir/layout.cpp.o
[ 74%] Building CXX object jit/CMakeFiles/clrjit_unix_x64_x64.dir/lclmorph.cpp.o
[ 74%] Building CXX object vm/wks/CMakeFiles/cee_wks_core.dir/__/assemblyspec.cpp.o
[ 74%] Building CXX object jit/CMakeFiles/clrjit_unix_x64_x64.dir/lclvars.cpp.o
[ 74%] Building CXX object vm/wks/CMakeFiles/cee_wks_core.dir/__/baseassemblyspec.cpp.o
[ 74%] Building CXX object vm/wks/CMakeFiles/cee_wks_core.dir/__/cachelinealloc.cpp.o
[ 75%] Building CXX object vm/wks/CMakeFiles/cee_wks_core.dir/__/callconvbuilder.cpp.o
[ 75%] Building CXX object tools/superpmi/superpmi-shim-simple/CMakeFiles/superpmi-shim-simple.dir/__/superpmi-shared/simpletimer.cpp.o
[ 76%] Building CXX object tools/superpmi/superpmi-shim-counter/CMakeFiles/superpmi-shim-counter.dir/__/superpmi-shared/methodcontextreader.cpp.o
[ 76%] Building CXX object jit/CMakeFiles/clrjit_win_x64_x64.dir/jiteh.cpp.o
[ 76%] Building CXX object jit/CMakeFiles/clrjit_universal_arm_x64.dir/inlinepolicy.cpp.o
[ 76%] Building CXX object jit/CMakeFiles/clrjit_win_x64_x64.dir/jithashtable.cpp.o
[ 76%] Building CXX object jit/CMakeFiles/clrjit_win_x64_x64.dir/jitmetadata.cpp.o
[ 76%] Building CXX object jit/CMakeFiles/clrjit_win_x64_x64.dir/layout.cpp.o
[ 76%] Building CXX object jit/CMakeFiles/clrjit_universal_arm64_x64.dir/lsra.cpp.o
[ 76%] Building CXX object jit/CMakeFiles/clrjit_universal_arm_x64.dir/instr.cpp.o
[ 76%] Building CXX object jit/CMakeFiles/clrjit.dir/lower.cpp.o
[ 76%] Building CXX object jit/CMakeFiles/clrjit_win_x64_x64.dir/lclmorph.cpp.o
[ 76%] Building CXX object jit/CMakeFiles/clrjit_win_x64_x64.dir/lclvars.cpp.o
[ 76%] Building CXX object jit/CMakeFiles/clrjit_universal_arm_x64.dir/jitconfig.cpp.o
[ 76%] Building CXX object jit/CMakeFiles/clrjit_universal_arm_x64.dir/jiteh.cpp.o
[ 76%] Building CXX object jit/CMakeFiles/clrjit_win_x64_x64.dir/likelyclass.cpp.o
[ 76%] Building CXX object jit/CMakeFiles/clrjit_win_x64_x64.dir/lir.cpp.o
[ 76%] Building CXX object jit/CMakeFiles/clrjit_universal_arm_x64.dir/jithashtable.cpp.o
[ 76%] Building CXX object jit/CMakeFiles/clrjit_win_x64_x64.dir/liveness.cpp.o
[ 76%] Building CXX object jit/CMakeFiles/clrjit_universal_arm_x64.dir/jitmetadata.cpp.o
[ 77%] Building CXX object jit/CMakeFiles/clrjit_universal_arm_x64.dir/layout.cpp.o
[ 77%] Building CXX object jit/CMakeFiles/clrjit.dir/lsra.cpp.o
[ 77%] Building CXX object jit/CMakeFiles/clrjit_win_x64_x64.dir/loopcloning.cpp.o
[ 77%] Building CXX object jit/CMakeFiles/clrjit_universal_arm_x64.dir/lclmorph.cpp.o
[ 77%] Building CXX object jit/CMakeFiles/clrjit_universal_arm64_x64.dir/lsrabuild.cpp.o
/wrkdirs/usr/ports/lang/dotnet/work/dotnet-9.0.4/src/runtime/src/coreclr/runtime.proj(108,5): warning MSB5021: Terminating the task executable "sh" and its child processes because the build was canceled.
/wrkdirs/usr/ports/lang/dotnet/work/dotnet-9.0.4/src/runtime/src/coreclr/runtime.proj(108,5): error MSB4018: The "Exec" task failed unexpectedly.
/wrkdirs/usr/ports/lang/dotnet/work/dotnet-9.0.4/src/runtime/src/coreclr/runtime.proj(108,5): error MSB4018: System.InvalidOperationException: sysctl 1 failed with 3 error.
/wrkdirs/usr/ports/lang/dotnet/work/dotnet-9.0.4/src/runtime/src/coreclr/runtime.proj(108,5): error MSB4018: at Interop.Sys.Sysctl(Int32* name, Int32 name_len, Byte*& value, Int32& len)
/wrkdirs/usr/ports/lang/dotnet/work/dotnet-9.0.4/src/runtime/src/coreclr/runtime.proj(108,5): error MSB4018: at Interop.Sys.Sysctl(ReadOnlySpan`1 name, Byte*& value, Int32& len)
/wrkdirs/usr/ports/lang/dotnet/work/dotnet-9.0.4/src/runtime/src/coreclr/runtime.proj(108,5): error MSB4018: at Interop.Process.GetProcInfo(Int32 pid, Boolean threads, Int32& count)
/wrkdirs/usr/ports/lang/dotnet/work/dotnet-9.0.4/src/runtime/src/coreclr/runtime.proj(108,5): error MSB4018: at Interop.Process.GetProcessInfoById(Int32 pid)
/wrkdirs/usr/ports/lang/dotnet/work/dotnet-9.0.4/src/runtime/src/coreclr/runtime.proj(108,5): error MSB4018: at System.Diagnostics.ProcessManager.CreateProcessInfo(Int32 pid, String processNameFilter)
/wrkdirs/usr/ports/lang/dotnet/work/dotnet-9.0.4/src/runtime/src/coreclr/runtime.proj(108,5): error MSB4018: at System.Diagnostics.ProcessManager.GetProcessInfos(String processNameFilter, String machineName)
/wrkdirs/usr/ports/lang/dotnet/work/dotnet-9.0.4/src/runtime/src/coreclr/runtime.proj(108,5): error MSB4018: at System.Diagnostics.Process.GetProcesses(String machineName)
/wrkdirs/usr/ports/lang/dotnet/work/dotnet-9.0.4/src/runtime/src/coreclr/runtime.proj(108,5): error MSB4018: at System.Diagnostics.Process.IsSelfOrDescendantOf(Process processOfInterest)
/wrkdirs/usr/ports/lang/dotnet/work/dotnet-9.0.4/src/runtime/src/coreclr/runtime.proj(108,5): error MSB4018: at System.Diagnostics.Process.Kill(Boolean entireProcessTree)
/wrkdirs/usr/ports/lang/dotnet/work/dotnet-9.0.4/src/runtime/src/coreclr/runtime.proj(108,5): error MSB4018: at Microsoft.Build.Utilities.ToolTask.KillToolProcessOnTimeout(Process proc, Boolean isBeingCancelled)
/wrkdirs/usr/ports/lang/dotnet/work/dotnet-9.0.4/src/runtime/src/coreclr/runtime.proj(108,5): error MSB4018: at Microsoft.Build.Utilities.ToolTask.HandleToolNotifications(Process proc)
/wrkdirs/usr/ports/lang/dotnet/work/dotnet-9.0.4/src/runtime/src/coreclr/runtime.proj(108,5): error MSB4018: at Microsoft.Build.Utilities.ToolTask.ExecuteTool(String pathToTool, String responseFileCommands, String commandLineCommands)
/wrkdirs/usr/ports/lang/dotnet/work/dotnet-9.0.4/src/runtime/src/coreclr/runtime.proj(108,5): error MSB4018: at Microsoft.Build.Tasks.Exec.ExecuteTool(String pathToTool, String responseFileCommands, String commandLineCommands)
/wrkdirs/usr/ports/lang/dotnet/work/dotnet-9.0.4/src/runtime/src/coreclr/runtime.proj(108,5): error MSB4018: at Microsoft.Build.Utilities.ToolTask.Execute()
/wrkdirs/usr/ports/lang/dotnet/work/dotnet-9.0.4/src/runtime/src/coreclr/runtime.proj(108,5): error MSB4018: at Microsoft.Build.BackEnd.TaskExecutionHost.Execute()
/wrkdirs/usr/ports/lang/dotnet/work/dotnet-9.0.4/src/runtime/src/coreclr/runtime.proj(108,5): error MSB4018: at Microsoft.Build.BackEnd.TaskBuilder.ExecuteInstantiatedTask(TaskExecutionHost taskExecutionHost, TaskLoggingContext taskLoggingContext, TaskHost taskHost, ItemBucket bucket, TaskExecutionMode howToExecuteTask)
Build FAILED.
/wrkdirs/usr/ports/lang/dotnet/work/dotnet-9.0.4/src/runtime/src/coreclr/runtime.proj(108,5): warning MSB5021: Terminating the task executable "sh" and its child processes because the build was canceled.
MSBUILD : error MSB4166: Child node "2" exited prematurely. Shutting down. Diagnostic information may be found in files in "/tmp/MSBuildTemproot/" and will be named MSBuild_*.failure.txt. This location can be changed by setting the MSBUILDDEBUGPATH environment variable to a different directory.
/wrkdirs/usr/ports/lang/dotnet/work/dotnet-9.0.4/src/runtime/src/coreclr/runtime.proj(108,5): error MSB4018: The "Exec" task failed unexpectedly.
/wrkdirs/usr/ports/lang/dotnet/work/dotnet-9.0.4/src/runtime/src/coreclr/runtime.proj(108,5): error MSB4018: System.InvalidOperationException: sysctl 1 failed with 3 error.
/wrkdirs/usr/ports/lang/dotnet/work/dotnet-9.0.4/src/runtime/src/coreclr/runtime.proj(108,5): error MSB4018: at Interop.Sys.Sysctl(Int32* name, Int32 name_len, Byte*& value, Int32& len)
/wrkdirs/usr/ports/lang/dotnet/work/dotnet-9.0.4/src/runtime/src/coreclr/runtime.proj(108,5): error MSB4018: at Interop.Sys.Sysctl(ReadOnlySpan`1 name, Byte*& value, Int32& len)
/wrkdirs/usr/ports/lang/dotnet/work/dotnet-9.0.4/src/runtime/src/coreclr/runtime.proj(108,5): error MSB4018: at Interop.Process.GetProcInfo(Int32 pid, Boolean threads, Int32& count)
/wrkdirs/usr/ports/lang/dotnet/work/dotnet-9.0.4/src/runtime/src/coreclr/runtime.proj(108,5): error MSB4018: at Interop.Process.GetProcessInfoById(Int32 pid)
/wrkdirs/usr/ports/lang/dotnet/work/dotnet-9.0.4/src/runtime/src/coreclr/runtime.proj(108,5): error MSB4018: at System.Diagnostics.ProcessManager.CreateProcessInfo(Int32 pid, String processNameFilter)
/wrkdirs/usr/ports/lang/dotnet/work/dotnet-9.0.4/src/runtime/src/coreclr/runtime.proj(108,5): error MSB4018: at System.Diagnostics.ProcessManager.GetProcessInfos(String processNameFilter, String machineName)
/wrkdirs/usr/ports/lang/dotnet/work/dotnet-9.0.4/src/runtime/src/coreclr/runtime.proj(108,5): error MSB4018: at System.Diagnostics.Process.GetProcesses(String machineName)
/wrkdirs/usr/ports/lang/dotnet/work/dotnet-9.0.4/src/runtime/src/coreclr/runtime.proj(108,5): error MSB4018: at System.Diagnostics.Process.IsSelfOrDescendantOf(Process processOfInterest)
/wrkdirs/usr/ports/lang/dotnet/work/dotnet-9.0.4/src/runtime/src/coreclr/runtime.proj(108,5): error MSB4018: at System.Diagnostics.Process.Kill(Boolean entireProcessTree)
/wrkdirs/usr/ports/lang/dotnet/work/dotnet-9.0.4/src/runtime/src/coreclr/runtime.proj(108,5): error MSB4018: at Microsoft.Build.Utilities.ToolTask.KillToolProcessOnTimeout(Process proc, Boolean isBeingCancelled)
/wrkdirs/usr/ports/lang/dotnet/work/dotnet-9.0.4/src/runtime/src/coreclr/runtime.proj(108,5): error MSB4018: at Microsoft.Build.Utilities.ToolTask.HandleToolNotifications(Process proc)
/wrkdirs/usr/ports/lang/dotnet/work/dotnet-9.0.4/src/runtime/src/coreclr/runtime.proj(108,5): error MSB4018: at Microsoft.Build.Utilities.ToolTask.ExecuteTool(String pathToTool, String responseFileCommands, String commandLineCommands)
/wrkdirs/usr/ports/lang/dotnet/work/dotnet-9.0.4/src/runtime/src/coreclr/runtime.proj(108,5): error MSB4018: at Microsoft.Build.Tasks.Exec.ExecuteTool(String pathToTool, String responseFileCommands, String commandLineCommands)
/wrkdirs/usr/ports/lang/dotnet/work/dotnet-9.0.4/src/runtime/src/coreclr/runtime.proj(108,5): error MSB4018: at Microsoft.Build.Utilities.ToolTask.Execute()
/wrkdirs/usr/ports/lang/dotnet/work/dotnet-9.0.4/src/runtime/src/coreclr/runtime.proj(108,5): error MSB4018: at Microsoft.Build.BackEnd.TaskExecutionHost.Execute()
/wrkdirs/usr/ports/lang/dotnet/work/dotnet-9.0.4/src/runtime/src/coreclr/runtime.proj(108,5): error MSB4018: at Microsoft.Build.BackEnd.TaskBuilder.ExecuteInstantiatedTask(TaskExecutionHost taskExecutionHost, TaskLoggingContext taskLoggingContext, TaskHost taskHost, ItemBucket bucket, TaskExecutionMode howToExecuteTask)
1 Warning(s)
2 Error(s)
Time Elapsed 00:08:49.00
Build failed with exit code 1. Check errors above.
/wrkdirs/usr/ports/lang/dotnet/work/dotnet-9.0.4/artifacts/source-built-sdks/Microsoft.DotNet.Arcade.Sdk/tools/SourceBuild/SourceBuildArcadeBuild.targets(130,5): error MSB3073: The command "./build.sh --restore --build --publish --arch x64 --configuration Release --allconfigurations --verbosity minimal --nodereuse false --warnAsError false --outputrid freebsd.13-x64 /p:PackageOS=freebsd /p:ToolsOS=freebsd /p:AdditionalRuntimeIdentifierParent=freebsd-x64 /p:DotNetBuildRepo=true /p:DotNetBuildOrchestrator=true /p:OfficialBuildId=20250313.5 /p:ContinuousIntegrationBuild=true /p:PortableBuild=false /p:RestoreConfigFile=/wrkdirs/usr/ports/lang/dotnet/work/dotnet-9.0.4/artifacts/obj/runtime/NuGet.config /p:SourceBuiltAssetsDir=/wrkdirs/usr/ports/lang/dotnet/work/dotnet-9.0.4/artifacts/assets/Release/ /p:SourceBuiltShippingPackagesDir=/wrkdirs/usr/ports/lang/dotnet/work/dotnet-9.0.4/artifacts/packages/Release/Shipping/runtime/ /p:SourceBuiltNonShippingPackagesDir=/wrkdirs/usr/po
rts/lang/dotnet/work/dotnet-9.0.4/artifacts/packages/Release/NonShipping/runtime/ /p:SourceBuiltAssetManifestsDir=/wrkdirs/usr/ports/lang/dotnet/work/dotnet-9.0.4/artifacts/obj/AssetManifests/runtime/ /p:SourceBuiltSymbolsDir=/wrkdirs/usr/ports/lang/dotnet/work/dotnet-9.0.4/artifacts/obj/Symbols/runtime/ /p:GitHubRepositoryName=runtime --cmakeargs -DCLR_CMAKE_USE_SYSTEM_BROTLI=true /p:DotNetBuildInnerRepo=true /p:DotNetBuildSourceOnly=true /p:ArcadeInnerBuildFromSource=true /p:DotNetBuildFromSource=true /p:RepoRoot="/wrkdirs/usr/ports/lang/dotnet/work/dotnet-9.0.4/src/runtime/" /p:ArtifactsDir="/wrkdirs/usr/ports/lang/dotnet/work/dotnet-9.0.4/src/runtime/artifacts/" /bl:"/wrkdirs/usr/ports/lang/dotnet/work/dotnet-9.0.4/src/runtime/artifacts/log/Release/source-inner-build.binlog" /p:ContinuousIntegrationBuild=true /p:SourceBuildOutputDir="/wrkdirs/usr/ports/lang/dotnet/work/dotnet-9.0.4/src/runtime/artifacts/sb/" /p:DotNetPackageVersionPropsPath="/wrkdirs/usr/ports/lang/dotne
t/work/dotnet-9.0.4/artifacts/obj/PackageVersions/PackageVersions.runtime.props" /p:FullAssemblySigningSupported=false /p:DotNetPublishUsingPipelines=true /p:GitHubRepositoryName=runtime" exited with code 1. [/wrkdirs/usr/ports/lang/dotnet/work/dotnet-9.0.4/artifacts/source-built-sdks/Microsoft.DotNet.Arcade.Sdk/tools/Build.proj]
##vso[task.logissue type=error;sourcepath=/wrkdirs/usr/ports/lang/dotnet/work/dotnet-9.0.4/artifacts/source-built-sdks/Microsoft.DotNet.Arcade.Sdk/tools/SourceBuild/SourceBuildArcadeBuild.targets;linenumber=130;columnnumber=5;code=MSB3073;]The command "./build.sh --restore --build --publish --arch x64 --configuration Release --allconfigurations --verbosity minimal --nodereuse false --warnAsError false --outputrid freebsd.13-x64 /p:PackageOS=freebsd /p:ToolsOS=freebsd /p:AdditionalRuntimeIdentifierParent=freebsd-x64 /p:DotNetBuildRepo=true /p:DotNetBuildOrchestrator=true /p:OfficialBuildId=20250313.5 /p:ContinuousIntegrationBuild=true /p:PortableBuild=false /p:RestoreConfigFile=/wrkdirs/usr/ports/lang/dotnet/work/dotnet-9.0.4/artifacts/obj/runtime/NuGet.config /p:SourceBuiltAssetsDir=/wrkdirs/usr/ports/lang/dotnet/work/dotnet-9.0.4/artifacts/assets/Release/ /p:SourceBuiltShippingPackagesDir=/wrkdirs/usr/ports/lang/dotnet/work/dotnet-9.0.4/artifacts/packages/Release/Shippin
g/runtime/ /p:SourceBuiltNonShippingPackagesDir=/wrkdirs/usr/ports/lang/dotnet/work/dotnet-9.0.4/artifacts/packages/Release/NonShipping/runtime/ /p:SourceBuiltAssetManifestsDir=/wrkdirs/usr/ports/lang/dotnet/work/dotnet-9.0.4/artifacts/obj/AssetManifests/runtime/ /p:SourceBuiltSymbolsDir=/wrkdirs/usr/ports/lang/dotnet/work/dotnet-9.0.4/artifacts/obj/Symbols/runtime/ /p:GitHubRepositoryName=runtime --cmakeargs -DCLR_CMAKE_USE_SYSTEM_BROTLI=true /p:DotNetBuildInnerRepo=true /p:DotNetBuildSourceOnly=true /p:ArcadeInnerBuildFromSource=true /p:DotNetBuildFromSource=true /p:RepoRoot="/wrkdirs/usr/ports/lang/dotnet/work/dotnet-9.0.4/src/runtime/" /p:ArtifactsDir="/wrkdirs/usr/ports/lang/dotnet/work/dotnet-9.0.4/src/runtime/artifacts/" /bl:"/wrkdirs/usr/ports/lang/dotnet/work/dotnet-9.0.4/src/runtime/artifacts/log/Release/source-inner-build.binlog" /p:ContinuousIntegrationBuild=true /p:SourceBuildOutputDir="/wrkdirs/usr/ports/lang/dotnet/work/dotnet-9.0.4/src/runtime/artifacts/sb/"
/p:DotNetPackageVersionPropsPath="/wrkdirs/usr/ports/lang/dotnet/work/dotnet-9.0.4/artifacts/obj/PackageVersions/PackageVersions.runtime.props" /p:FullAssemblySigningSupported=false /p:DotNetPublishUsingPipelines=true /p:GitHubRepositoryName=runtime" exited with code 1.
Build FAILED.
/wrkdirs/usr/ports/lang/dotnet/work/dotnet-9.0.4/artifacts/source-built-sdks/Microsoft.DotNet.Arcade.Sdk/tools/SourceBuild/SourceBuildArcadeBuild.targets(130,5): error MSB3073: The command "./build.sh --restore --build --publish --arch x64 --configuration Release --allconfigurations --verbosity minimal --nodereuse false --warnAsError false --outputrid freebsd.13-x64 /p:PackageOS=freebsd /p:ToolsOS=freebsd /p:AdditionalRuntimeIdentifierParent=freebsd-x64 /p:DotNetBuildRepo=true /p:DotNetBuildOrchestrator=true /p:OfficialBuildId=20250313.5 /p:ContinuousIntegrationBuild=true /p:PortableBuild=false /p:RestoreConfigFile=/wrkdirs/usr/ports/lang/dotnet/work/dotnet-9.0.4/artifacts/obj/runtime/NuGet.config /p:SourceBuiltAssetsDir=/wrkdirs/usr/ports/lang/dotnet/work/dotnet-9.0.4/artifacts/assets/Release/ /p:SourceBuiltShippingPackagesDir=/wrkdirs/usr/ports/lang/dotnet/work/dotnet-9.0.4/artifacts/packages/Release/Shipping/runtime/ /p:SourceBuiltNonShippingPackagesDir=/wrkdirs/usr/po
rts/lang/dotnet/work/dotnet-9.0.4/artifacts/packages/Release/NonShipping/runtime/ /p:SourceBuiltAssetManifestsDir=/wrkdirs/usr/ports/lang/dotnet/work/dotnet-9.0.4/artifacts/obj/AssetManifests/runtime/ /p:SourceBuiltSymbolsDir=/wrkdirs/usr/ports/lang/dotnet/work/dotnet-9.0.4/artifacts/obj/Symbols/runtime/ /p:GitHubRepositoryName=runtime --cmakeargs -DCLR_CMAKE_USE_SYSTEM_BROTLI=true /p:DotNetBuildInnerRepo=true /p:DotNetBuildSourceOnly=true /p:ArcadeInnerBuildFromSource=true /p:DotNetBuildFromSource=true /p:RepoRoot="/wrkdirs/usr/ports/lang/dotnet/work/dotnet-9.0.4/src/runtime/" /p:ArtifactsDir="/wrkdirs/usr/ports/lang/dotnet/work/dotnet-9.0.4/src/runtime/artifacts/" /bl:"/wrkdirs/usr/ports/lang/dotnet/work/dotnet-9.0.4/src/runtime/artifacts/log/Release/source-inner-build.binlog" /p:ContinuousIntegrationBuild=true /p:SourceBuildOutputDir="/wrkdirs/usr/ports/lang/dotnet/work/dotnet-9.0.4/src/runtime/artifacts/sb/" /p:DotNetPackageVersionPropsPath="/wrkdirs/usr/ports/lang/dotne
t/work/dotnet-9.0.4/artifacts/obj/PackageVersions/PackageVersions.runtime.props" /p:FullAssemblySigningSupported=false /p:DotNetPublishUsingPipelines=true /p:GitHubRepositoryName=runtime" exited with code 1. [/wrkdirs/usr/ports/lang/dotnet/work/dotnet-9.0.4/artifacts/source-built-sdks/Microsoft.DotNet.Arcade.Sdk/tools/Build.proj]
0 Warning(s)
1 Error(s)
Time Elapsed 00:09:20.54
Build failed with exit code 1. Check errors above.
'runtime' failed during build.
See '/wrkdirs/usr/ports/lang/dotnet/work/dotnet-9.0.4/artifacts/log/Release/runtime.log' for more information.
*** Error code 1
Stop.
make: stopped in /usr/ports/lang/dotnet