[package - 134arm64-default][lang/pocl] Failed for pocl-4.0 in build

From: <pkg-fallout_at_FreeBSD.org>
Date: Thu, 27 Feb 2025 19:56:38 UTC
You are receiving this mail as a port that you maintain
is failing to build on the FreeBSD package build server.
Please investigate the failure and submit a PR to fix
build.

Maintainer:     ohartmann@walstatt.org
Log URL:        https://pkg-status.freebsd.org/ampere3/data/134arm64-default/413ee6de2f09/logs/pocl-4.0.log
Build URL:      https://pkg-status.freebsd.org/ampere3/build.html?mastername=134arm64-default&build=413ee6de2f09
Log:

=>> Building lang/pocl
build started at Thu Feb 27 19:48:57 UTC 2025
port directory: /usr/ports/lang/pocl
package name: pocl-4.0
building for: FreeBSD 134arm64-default-job-11 13.4-RELEASE-p4 FreeBSD 13.4-RELEASE-p4 arm64
maintained by: ohartmann@walstatt.org
Makefile datestamp: -rw-r--r--  1 root  wheel  2108 Sep 10  2023 /usr/ports/lang/pocl/Makefile
Ports top last git commit: 413ee6de2f0
Ports top unclean checkout: no
Port dir last git commit: d1a08b153ca
Port dir unclean checkout: no
Poudriere version: poudriere-git-3.4.2
Host OSVERSION: 1500028
Jail OSVERSION: 1304000
Job Id: 11

---Begin Environment---
SHELL=/bin/csh
OSVERSION=1304000
UNAME_v=FreeBSD 13.4-RELEASE-p4
UNAME_r=13.4-RELEASE-p4
BLOCKSIZE=K
MAIL=/var/mail/root
MM_CHARSET=UTF-8
LANG=C.UTF-8
STATUS=1
HOME=/root
PATH=/sbin:/bin:/usr/sbin:/usr/bin:/usr/local/sbin:/usr/local/bin:/root/bin
MAKE_OBJDIR_CHECK_WRITABLE=0
LOCALBASE=/usr/local
USER=root
POUDRIERE_NAME=poudriere-git
LIBEXECPREFIX=/usr/local/libexec/poudriere
POUDRIERE_VERSION=3.4.2
MASTERMNT=/usr/local/poudriere/data/.m/134arm64-default/ref
LC_COLLATE=C
POUDRIERE_BUILD_TYPE=bulk
PACKAGE_BUILDING=yes
SAVED_TERM=
OUTPUT_REDIRECTED_STDERR=4
OUTPUT_REDIRECTED=1
PWD=/usr/local/poudriere/data/.m/134arm64-default/11/.p
OUTPUT_REDIRECTED_STDOUT=3
P_PORTS_FEATURES=FLAVORS SUBPACKAGES SELECTED_OPTIONS
MASTERNAME=134arm64-default
SCRIPTPREFIX=/usr/local/share/poudriere
SCRIPTNAME=bulk.sh
OLDPWD=/usr/local/poudriere/data/.m/134arm64-default/ref/.p/pool
POUDRIERE_PKGNAME=poudriere-git-3.4.2
SCRIPTPATH=/usr/local/share/poudriere/bulk.sh
POUDRIEREPATH=/usr/local/bin/poudriere
---End Environment---

---Begin Poudriere Port Flags/Env---
PORT_FLAGS=
PKGENV=
FLAVOR=
MAKE_ARGS=
---End Poudriere Port Flags/Env---

---Begin OPTIONS List---
===> The following configuration options are available for pocl-4.0:
     DOCS=on: Build documentation (needs textproc/py-sphinx)
===> Use 'make config' to modify these settings
---End OPTIONS List---

--MAINTAINER--
ohartmann@walstatt.org
--End MAINTAINER--

--CONFIGURE_ARGS--

--End CONFIGURE_ARGS--

--CONFIGURE_ENV--
PKG_CONFIG=pkgconf PYTHON="/usr/local/bin/python3.11" XDG_DATA_HOME=/wrkdirs/usr/ports/lang/pocl/work  XDG_CONFIG_HOME=/wrkdirs/usr/ports/lang/pocl/work  XDG_CACHE_HOME=/wrkdirs/usr/ports/lang/pocl/work/.cache  HOME=/wrkdirs/usr/ports/lang/pocl/work TMPDIR="/tmp" PATH=/wrkdirs/usr/ports/lang/pocl/work/.bin:/sbin:/bin:/usr/sbin:/usr/bin:/usr/local/sbin:/usr/local/bin:/root/bin PKG_CONFIG_LIBDIR=/wrkdirs/usr/ports/lang/pocl/work/.pkgconfig:/usr/local/libdata/pkgconfig:/usr/local/share/pkgconfig:/usr/libdata/pkgconfig SHELL=/bin/sh CONFIG_SHELL=/bin/sh CMAKE_PREFIX_PATH="/usr/local"
--End CONFIGURE_ENV--

--MAKE_ENV--
NINJA_STATUS="[%p %s/%t] " XDG_DATA_HOME=/wrkdirs/usr/ports/lang/pocl/work  XDG_CONFIG_HOME=/wrkdirs/usr/ports/lang/pocl/work  XDG_CACHE_HOME=/wrkdirs/usr/ports/lang/pocl/work/.cache  HOME=/wrkdirs/usr/ports/lang/pocl/work TMPDIR="/tmp" PATH=/wrkdirs/usr/ports/lang/pocl/work/.bin:/sbin:/bin:/usr/sbin:/usr/bin:/usr/local/sbin:/usr/local/bin:/root/bin PKG_CONFIG_LIBDIR=/wrkdirs/usr/ports/lang/pocl/work/.pkgconfig:/usr/local/libdata/pkgconfig:/usr/local/share/pkgconfig:/usr/libdata/pkgconfig MK_DEBUG_FILES=no MK_KERNEL_SYMBOLS=no SHELL=/bin/sh NO_LINT=YES DESTDIR=/wrkdirs/usr/ports/lang/pocl/work/stage PREFIX=/usr/local  LOCALBASE=/usr/local  CC="cc" CFLAGS="-O2 -pipe  -fstack-protector-strong -isystem /usr/local/include -fno-strict-aliasing "  CPP="cpp" CPPFLAGS="-isystem /usr/local/include"  LDFLAGS=" -fstack-protector-strong -L/usr/local/lib " LIBS=""  CXX="c++" CXXFLAGS="-O2 -pipe -fstack-protector-strong -isystem /usr/local/include -fno-strict-aliasing  -isystem /usr/local
/include " BSD_INSTALL_PROGRAM="install  -s -m 555"  BSD_INSTALL_LIB="install  -s -m 0644"  BSD_INSTALL_SCRIPT="install  -m 555"  BSD_INSTALL_DATA="install  -m 0644"  BSD_INSTALL_MAN="install  -m 444"
--End MAKE_ENV--

--PLIST_SUB--
CONFIGURE_TARGET=aarch64-portbld-freebsd13.4 PORTDOCS="" AARCH64="" PPC64="@comment " PPC64LE="@comment " X86="@comment " CMAKE_BUILD_TYPE="release" PYTHON_INCLUDEDIR=include/python3.11  PYTHON_LIBDIR=lib/python3.11  PYTHON_PLATFORM=freebsd13  PYTHON_SITELIBDIR=lib/python3.11/site-packages  PYTHON_SUFFIX=311  PYTHON_EXT_SUFFIX=.cpython-311  PYTHON_VER=3.11  PYTHON_VERSION=python3.11 PYTHON2="@comment " PYTHON3="" OSREL=13.4 PREFIX=%D LOCALBASE=/usr/local  RESETPREFIX=/usr/local LIB32DIR=lib DOCSDIR="share/doc/pocl"  EXAMPLESDIR="share/examples/pocl"  DATADIR="share/pocl"  WWWDIR="www/pocl"  ETCDIR="etc/pocl"
--End PLIST_SUB--

--SUB_LIST--
 PYTHON_INCLUDEDIR=/usr/local/include/python3.11  PYTHON_LIBDIR=/usr/local/lib/python3.11  PYTHON_PLATFORM=freebsd13  PYTHON_SITELIBDIR=/usr/local/lib/python3.11/site-packages  PYTHON_SUFFIX=311  PYTHON_EXT_SUFFIX=.cpython-311  PYTHON_VER=3.11  PYTHON_VERSION=python3.11 PYTHON2="@comment " PYTHON3="" PREFIX=/usr/local LOCALBASE=/usr/local  DATADIR=/usr/local/share/pocl DOCSDIR=/usr/local/share/doc/pocl EXAMPLESDIR=/usr/local/share/examples/pocl  WWWDIR=/usr/local/www/pocl ETCDIR=/usr/local/etc/pocl
--End SUB_LIST--

---Begin make.conf---
USE_PACKAGE_DEPENDS=yes
BATCH=yes
WRKDIRPREFIX=/wrkdirs
PORTSDIR=/usr/ports
PACKAGES=/packages
DISTDIR=/distfiles
PACKAGE_BUILDING=yes
PACKAGE_BUILDING_FLAVORS=yes
####  ####
# XXX: We really need this but cannot use it while 'make checksum' does not
# try the next mirror on checksum failure.  It currently retries the same
# failed mirror and then fails rather then trying another.  It *does*
# try the next if the size is mismatched though.
#MASTER_SITE_FREEBSD=yes
# Build ALLOW_MAKE_JOBS_PACKAGES with 3 jobs
MAKE_JOBS_NUMBER=3
#### Misc Poudriere ####
.include "/etc/make.conf.ports_env"
GID=0
UID=0
---End make.conf---
--Resource limits--
cpu time               (seconds, -t)  unlimited
file size           (512-blocks, -f)  unlimited
data seg size           (kbytes, -d)  1048576
stack size              (kbytes, -s)  1048576
core file size      (512-blocks, -c)  unlimited
max memory size         (kbytes, -m)  unlimited
locked memory           (kbytes, -l)  unlimited
max user processes              (-u)  89999
open files                      (-n)  8192
virtual mem size        (kbytes, -v)  unlimited
swap limit              (kbytes, -w)  unlimited
socket buffer size       (bytes, -b)  unlimited
pseudo-terminals                (-p)  unlimited
kqueues                         (-k)  unlimited
umtx shared locks               (-o)  unlimited
--End resource limits--
=======================<phase: check-sanity   >============================
===== env: NO_DEPENDS=yes USER=root UID=0 GID=0
===>  License MIT accepted by the user
===========================================================================
=======================<phase: pkg-depends    >============================
===== env: USE_PACKAGE_DEPENDS_ONLY=1 USER=root UID=0 GID=0
===>   pocl-4.0 depends on file: /usr/local/sbin/pkg - not found
===>   Installing existing package /packages/All/pkg-2.0.6.pkg
[134arm64-default-job-11] Installing pkg-2.0.6...
[134arm64-default-job-11] Extracting pkg-2.0.6: .......... done
===>   pocl-4.0 depends on file: /usr/local/sbin/pkg - found
===>   Returning to build of pocl-4.0
===========================================================================
=======================<phase: fetch-depends  >============================
===== env: USE_PACKAGE_DEPENDS_ONLY=1 USER=root UID=0 GID=0
===========================================================================
=======================<phase: fetch          >============================
===== env: NO_DEPENDS=yes USER=root UID=0 GID=0
===>  License MIT accepted by the user
===> Fetching all distfiles required by pocl-4.0 for building
===========================================================================
=======================<phase: checksum       >============================
===== env: NO_DEPENDS=yes USER=root UID=0 GID=0
===>  License MIT accepted by the user
===> Fetching all distfiles required by pocl-4.0 for building
=> SHA256 Checksum OK for pocl-pocl-v4.0_GH0.tar.gz.
===========================================================================
=======================<phase: extract-depends>============================
===== env: USE_PACKAGE_DEPENDS_ONLY=1 USER=root UID=0 GID=0
===========================================================================
=======================<phase: extract        >============================
===== env: NO_DEPENDS=yes USER=root UID=0 GID=0
===>  License MIT accepted by the user
===> Fetching all distfiles required by pocl-4.0 for building
===>  Extracting for pocl-4.0
=> SHA256 Checksum OK for pocl-pocl-v4.0_GH0.tar.gz.
===========================================================================
=======================<phase: patch-depends  >============================
===== env: USE_PACKAGE_DEPENDS_ONLY=1 USER=root UID=0 GID=0
===========================================================================
=======================<phase: patch          >============================
===== env: NO_DEPENDS=yes USER=root UID=0 GID=0
===>  Patching for pocl-4.0
===>  Applying FreeBSD patches for pocl-4.0 from /usr/ports/lang/pocl/files
===========================================================================
=======================<phase: build-depends  >============================
===== env: USE_PACKAGE_DEPENDS_ONLY=1 USER=root UID=0 GID=0
===>   pocl-4.0 depends on package: llvm16>=14 - not found
===>   Installing existing package /packages/All/llvm16-16.0.6_11.pkg
[134arm64-default-job-11] Installing llvm16-16.0.6_11...
[134arm64-default-job-11] `-- Installing libedit-3.1.20240808,1...
[134arm64-default-job-11] `-- Extracting libedit-3.1.20240808,1: .......... done
[134arm64-default-job-11] `-- Installing lua53-5.3.6_1...
[134arm64-default-job-11] `-- Extracting lua53-5.3.6_1: .......... done
[134arm64-default-job-11] `-- Installing perl5-5.36.3_2...
[134arm64-default-job-11] `-- Extracting perl5-5.36.3_2: .......... done
[134arm64-default-job-11] `-- Installing python311-3.11.11...
[134arm64-default-job-11] |   `-- Installing gettext-runtime-0.23.1...
[134arm64-default-job-11] |   | `-- Installing indexinfo-0.3.1...
[134arm64-default-job-11] |   | `-- Extracting indexinfo-0.3.1: .... done
[134arm64-default-job-11] |   `-- Extracting gettext-runtime-0.23.1: .......... done
[134arm64-default-job-11] |   `-- Installing libffi-3.4.6...
[134arm64-default-job-11] |   `-- Extracting libffi-3.4.6: .......... done
[134arm64-default-job-11] |   `-- Installing mpdecimal-4.0.0...
[134arm64-default-job-11] |   `-- Extracting mpdecimal-4.0.0: .......... done
[134arm64-default-job-11] |   `-- Installing readline-8.2.13_2...
[134arm64-default-job-11] |   `-- Extracting readline-8.2.13_2: .......... done
[134arm64-default-job-11] `-- Extracting python311-3.11.11: .......... done
[134arm64-default-job-11] `-- Installing zstd-1.5.6...
[134arm64-default-job-11] |   `-- Installing liblz4-1.10.0,1...
<snip>
   26 | #define CL_HPP_TARGET_OPENCL_VERSION 120
      |         ^
<command line>:1:9: note: previous definition is here
    1 | #define CL_HPP_TARGET_OPENCL_VERSION 300
      |         ^
1 warning generated.
[ 82% 501/605] : && /usr/bin/c++ -O2 -pipe -fstack-protector-strong -isystem /usr/local/include -fno-strict-aliasing  -isystem /usr/local/include -O2 -pipe -fstack-protector-strong -isystem /usr/local/include -fno-strict-aliasing  -isystem /usr/local/include  -DNDEBUG -fstack-protector-strong -L/usr/local/lib -pie     -Xlinker --dependency-file=tests/regression/CMakeFiles/test_flatten_barrier_subs.dir/link.d tests/regression/CMakeFiles/test_flatten_barrier_subs.dir/test_flatten_barrier_subs.cpp.o -o tests/regression/test_flatten_barrier_subs  poclu/libpoclu.a  /usr/local/lib/libOpenCL.so  -lm  -pthread && :
[ 82% 502/605] /usr/bin/c++ -DCL_HPP_TARGET_OPENCL_VERSION=300 -DCL_TARGET_OPENCL_VERSION=300 -DCL_USE_DEPRECATED_OPENCL_1_0_APIS -DCL_USE_DEPRECATED_OPENCL_1_1_APIS -DCL_USE_DEPRECATED_OPENCL_1_2_APIS -DCL_USE_DEPRECATED_OPENCL_2_0_APIS -DCL_USE_DEPRECATED_OPENCL_2_1_APIS -DCL_USE_DEPRECATED_OPENCL_2_2_APIS -DSRCDIR=\"/wrkdirs/usr/ports/lang/pocl/work/pocl-4.0/tests/regression\" -I/wrkdirs/usr/ports/lang/pocl/work/.build -I/wrkdirs/usr/ports/lang/pocl/work/pocl-4.0/poclu -I/wrkdirs/usr/ports/lang/pocl/work/pocl-4.0/lib/CL -O2 -pipe -fstack-protector-strong -isystem /usr/local/include -fno-strict-aliasing  -isystem /usr/local/include -O2 -pipe -fstack-protector-strong -isystem /usr/local/include -fno-strict-aliasing  -isystem /usr/local/include  -DNDEBUG -std=gnu++11 -fPIE -Wno-ignored-attributes -fvisibility=hidden -fvisibility-inlines-hidden -Wno-deprecated -Wno-deprecated-declarations -pthread -MD -MT tests/regression/CMakeFiles/test_alignment_with_dynamic_wg.dir/test_ali
gnment_with_dynamic_wg.cpp.o -MF tests/regression/CMakeFiles/test_alignment_with_dynamic_wg.dir/test_alignment_with_dynamic_wg.cpp.o.d -o tests/regression/CMakeFiles/test_alignment_with_dynamic_wg.dir/test_alignment_with_dynamic_wg.cpp.o -c /wrkdirs/usr/ports/lang/pocl/work/pocl-4.0/tests/regression/test_alignment_with_dynamic_wg.cpp
/wrkdirs/usr/ports/lang/pocl/work/pocl-4.0/tests/regression/test_alignment_with_dynamic_wg.cpp:5:9: warning: 'CL_HPP_TARGET_OPENCL_VERSION' macro redefined [-Wmacro-redefined]
    5 | #define CL_HPP_TARGET_OPENCL_VERSION 120
      |         ^
<command line>:1:9: note: previous definition is here
    1 | #define CL_HPP_TARGET_OPENCL_VERSION 300
      |         ^
1 warning generated.
[ 82% 503/605] : && /usr/bin/c++ -O2 -pipe -fstack-protector-strong -isystem /usr/local/include -fno-strict-aliasing  -isystem /usr/local/include -O2 -pipe -fstack-protector-strong -isystem /usr/local/include -fno-strict-aliasing  -isystem /usr/local/include  -DNDEBUG -fstack-protector-strong -L/usr/local/lib -pie     -Xlinker --dependency-file=tests/regression/CMakeFiles/test_alignment_with_dynamic_wg.dir/link.d tests/regression/CMakeFiles/test_alignment_with_dynamic_wg.dir/test_alignment_with_dynamic_wg.cpp.o -o tests/regression/test_alignment_with_dynamic_wg  poclu/libpoclu.a  /usr/local/lib/libOpenCL.so  -lm  -pthread && :
[ 82% 504/605] /usr/bin/c++ -DCL_HPP_TARGET_OPENCL_VERSION=300 -DCL_TARGET_OPENCL_VERSION=300 -DCL_USE_DEPRECATED_OPENCL_1_0_APIS -DCL_USE_DEPRECATED_OPENCL_1_1_APIS -DCL_USE_DEPRECATED_OPENCL_1_2_APIS -DCL_USE_DEPRECATED_OPENCL_2_0_APIS -DCL_USE_DEPRECATED_OPENCL_2_1_APIS -DCL_USE_DEPRECATED_OPENCL_2_2_APIS -DSRCDIR=\"/wrkdirs/usr/ports/lang/pocl/work/pocl-4.0/tests/regression\" -I/wrkdirs/usr/ports/lang/pocl/work/.build -I/wrkdirs/usr/ports/lang/pocl/work/pocl-4.0/poclu -I/wrkdirs/usr/ports/lang/pocl/work/pocl-4.0/lib/CL -O2 -pipe -fstack-protector-strong -isystem /usr/local/include -fno-strict-aliasing  -isystem /usr/local/include -O2 -pipe -fstack-protector-strong -isystem /usr/local/include -fno-strict-aliasing  -isystem /usr/local/include  -DNDEBUG -std=gnu++11 -fPIE -Wno-ignored-attributes -fvisibility=hidden -fvisibility-inlines-hidden -Wno-deprecated -Wno-deprecated-declarations -pthread -MD -MT tests/regression/CMakeFiles/test_alignment_with_dynamic_wg2.dir/test_al
ignment_with_dynamic_wg2.cpp.o -MF tests/regression/CMakeFiles/test_alignment_with_dynamic_wg2.dir/test_alignment_with_dynamic_wg2.cpp.o.d -o tests/regression/CMakeFiles/test_alignment_with_dynamic_wg2.dir/test_alignment_with_dynamic_wg2.cpp.o -c /wrkdirs/usr/ports/lang/pocl/work/pocl-4.0/tests/regression/test_alignment_with_dynamic_wg2.cpp
/wrkdirs/usr/ports/lang/pocl/work/pocl-4.0/tests/regression/test_alignment_with_dynamic_wg2.cpp:9:9: warning: 'CL_HPP_TARGET_OPENCL_VERSION' macro redefined [-Wmacro-redefined]
    9 | #define CL_HPP_TARGET_OPENCL_VERSION 120
      |         ^
<command line>:1:9: note: previous definition is here
    1 | #define CL_HPP_TARGET_OPENCL_VERSION 300
      |         ^
1 warning generated.
[ 83% 505/605] /usr/bin/c++ -DCL_HPP_TARGET_OPENCL_VERSION=300 -DCL_TARGET_OPENCL_VERSION=300 -DCL_USE_DEPRECATED_OPENCL_1_0_APIS -DCL_USE_DEPRECATED_OPENCL_1_1_APIS -DCL_USE_DEPRECATED_OPENCL_1_2_APIS -DCL_USE_DEPRECATED_OPENCL_2_0_APIS -DCL_USE_DEPRECATED_OPENCL_2_1_APIS -DCL_USE_DEPRECATED_OPENCL_2_2_APIS -DSRCDIR=\"/wrkdirs/usr/ports/lang/pocl/work/pocl-4.0/tests/regression\" -I/wrkdirs/usr/ports/lang/pocl/work/.build -I/wrkdirs/usr/ports/lang/pocl/work/pocl-4.0/poclu -I/wrkdirs/usr/ports/lang/pocl/work/pocl-4.0/lib/CL -O2 -pipe -fstack-protector-strong -isystem /usr/local/include -fno-strict-aliasing  -isystem /usr/local/include -O2 -pipe -fstack-protector-strong -isystem /usr/local/include -fno-strict-aliasing  -isystem /usr/local/include  -DNDEBUG -std=gnu++11 -fPIE -Wno-ignored-attributes -fvisibility=hidden -fvisibility-inlines-hidden -Wno-deprecated -Wno-deprecated-declarations -pthread -MD -MT tests/regression/CMakeFiles/test_alignment_with_dynamic_wg3.dir/test_al
ignment_with_dynamic_wg3.cpp.o -MF tests/regression/CMakeFiles/test_alignment_with_dynamic_wg3.dir/test_alignment_with_dynamic_wg3.cpp.o.d -o tests/regression/CMakeFiles/test_alignment_with_dynamic_wg3.dir/test_alignment_with_dynamic_wg3.cpp.o -c /wrkdirs/usr/ports/lang/pocl/work/pocl-4.0/tests/regression/test_alignment_with_dynamic_wg3.cpp
/wrkdirs/usr/ports/lang/pocl/work/pocl-4.0/tests/regression/test_alignment_with_dynamic_wg3.cpp:6:9: warning: 'CL_HPP_TARGET_OPENCL_VERSION' macro redefined [-Wmacro-redefined]
    6 | #define CL_HPP_TARGET_OPENCL_VERSION 120
      |         ^
<command line>:1:9: note: previous definition is here
    1 | #define CL_HPP_TARGET_OPENCL_VERSION 300
      |         ^
1 warning generated.
[ 83% 506/605] : && /usr/bin/c++ -O2 -pipe -fstack-protector-strong -isystem /usr/local/include -fno-strict-aliasing  -isystem /usr/local/include -O2 -pipe -fstack-protector-strong -isystem /usr/local/include -fno-strict-aliasing  -isystem /usr/local/include  -DNDEBUG -fstack-protector-strong -L/usr/local/lib -pie     -Xlinker --dependency-file=tests/regression/CMakeFiles/test_alignment_with_dynamic_wg2.dir/link.d tests/regression/CMakeFiles/test_alignment_with_dynamic_wg2.dir/test_alignment_with_dynamic_wg2.cpp.o -o tests/regression/test_alignment_with_dynamic_wg2  poclu/libpoclu.a  /usr/local/lib/libOpenCL.so  -lm  -pthread && :
[ 83% 507/605] : && /usr/bin/c++ -O2 -pipe -fstack-protector-strong -isystem /usr/local/include -fno-strict-aliasing  -isystem /usr/local/include -O2 -pipe -fstack-protector-strong -isystem /usr/local/include -fno-strict-aliasing  -isystem /usr/local/include  -DNDEBUG -fstack-protector-strong -L/usr/local/lib -pie     -Xlinker --dependency-file=tests/regression/CMakeFiles/test_alignment_with_dynamic_wg3.dir/link.d tests/regression/CMakeFiles/test_alignment_with_dynamic_wg3.dir/test_alignment_with_dynamic_wg3.cpp.o -o tests/regression/test_alignment_with_dynamic_wg3  poclu/libpoclu.a  /usr/local/lib/libOpenCL.so  -lm  -pthread && :
[ 83% 508/605] /usr/bin/c++ -DCL_HPP_TARGET_OPENCL_VERSION=300 -DCL_TARGET_OPENCL_VERSION=300 -DCL_USE_DEPRECATED_OPENCL_1_0_APIS -DCL_USE_DEPRECATED_OPENCL_1_1_APIS -DCL_USE_DEPRECATED_OPENCL_1_2_APIS -DCL_USE_DEPRECATED_OPENCL_2_0_APIS -DCL_USE_DEPRECATED_OPENCL_2_1_APIS -DCL_USE_DEPRECATED_OPENCL_2_2_APIS -DSRCDIR=\"/wrkdirs/usr/ports/lang/pocl/work/pocl-4.0/tests/regression\" -I/wrkdirs/usr/ports/lang/pocl/work/.build -I/wrkdirs/usr/ports/lang/pocl/work/pocl-4.0/poclu -I/wrkdirs/usr/ports/lang/pocl/work/pocl-4.0/lib/CL -O2 -pipe -fstack-protector-strong -isystem /usr/local/include -fno-strict-aliasing  -isystem /usr/local/include -O2 -pipe -fstack-protector-strong -isystem /usr/local/include -fno-strict-aliasing  -isystem /usr/local/include  -DNDEBUG -std=gnu++11 -fPIE -Wno-ignored-attributes -fvisibility=hidden -fvisibility-inlines-hidden -Wno-deprecated -Wno-deprecated-declarations -pthread -MD -MT tests/regression/CMakeFiles/test_issue_893.dir/test_issue_893.cpp.o -MF
 tests/regression/CMakeFiles/test_issue_893.dir/test_issue_893.cpp.o.d -o tests/regression/CMakeFiles/test_issue_893.dir/test_issue_893.cpp.o -c /wrkdirs/usr/ports/lang/pocl/work/pocl-4.0/tests/regression/test_issue_893.cpp
/wrkdirs/usr/ports/lang/pocl/work/pocl-4.0/tests/regression/test_issue_893.cpp:43:9: warning: 'CL_HPP_TARGET_OPENCL_VERSION' macro redefined [-Wmacro-redefined]
   43 | #define CL_HPP_TARGET_OPENCL_VERSION 120
      |         ^
<command line>:1:9: note: previous definition is here
    1 | #define CL_HPP_TARGET_OPENCL_VERSION 300
      |         ^
1 warning generated.
[ 83% 509/605] : && /usr/bin/c++ -O2 -pipe -fstack-protector-strong -isystem /usr/local/include -fno-strict-aliasing  -isystem /usr/local/include -O2 -pipe -fstack-protector-strong -isystem /usr/local/include -fno-strict-aliasing  -isystem /usr/local/include  -DNDEBUG -fstack-protector-strong -L/usr/local/lib -pie     -Xlinker --dependency-file=tests/regression/CMakeFiles/test_issue_893.dir/link.d tests/regression/CMakeFiles/test_issue_893.dir/test_issue_893.cpp.o -o tests/regression/test_issue_893  poclu/libpoclu.a  /usr/local/lib/libOpenCL.so  -lm  -pthread && :
[ 83% 510/605] /usr/bin/c++ -DCL_HPP_TARGET_OPENCL_VERSION=300 -DCL_TARGET_OPENCL_VERSION=300 -DCL_USE_DEPRECATED_OPENCL_1_0_APIS -DCL_USE_DEPRECATED_OPENCL_1_1_APIS -DCL_USE_DEPRECATED_OPENCL_1_2_APIS -DCL_USE_DEPRECATED_OPENCL_2_0_APIS -DCL_USE_DEPRECATED_OPENCL_2_1_APIS -DCL_USE_DEPRECATED_OPENCL_2_2_APIS -DSRCDIR=\"/wrkdirs/usr/ports/lang/pocl/work/pocl-4.0/tests/regression\" -I/wrkdirs/usr/ports/lang/pocl/work/.build -I/wrkdirs/usr/ports/lang/pocl/work/pocl-4.0/poclu -I/wrkdirs/usr/ports/lang/pocl/work/pocl-4.0/lib/CL -O2 -pipe -fstack-protector-strong -isystem /usr/local/include -fno-strict-aliasing  -isystem /usr/local/include -O2 -pipe -fstack-protector-strong -isystem /usr/local/include -fno-strict-aliasing  -isystem /usr/local/include  -DNDEBUG -std=gnu++11 -fPIE -Wno-ignored-attributes -fvisibility=hidden -fvisibility-inlines-hidden -Wno-deprecated -Wno-deprecated-declarations -pthread -MD -MT tests/regression/CMakeFiles/test_builtin_args.dir/test_builtin_args.cpp
.o -MF tests/regression/CMakeFiles/test_builtin_args.dir/test_builtin_args.cpp.o.d -o tests/regression/CMakeFiles/test_builtin_args.dir/test_builtin_args.cpp.o -c /wrkdirs/usr/ports/lang/pocl/work/pocl-4.0/tests/regression/test_builtin_args.cpp
/wrkdirs/usr/ports/lang/pocl/work/pocl-4.0/tests/regression/test_builtin_args.cpp:5:9: warning: 'CL_HPP_TARGET_OPENCL_VERSION' macro redefined [-Wmacro-redefined]
    5 | #define CL_HPP_TARGET_OPENCL_VERSION 120
      |         ^
<command line>:1:9: note: previous definition is here
    1 | #define CL_HPP_TARGET_OPENCL_VERSION 300
      |         ^
1 warning generated.
[ 84% 511/605] : && /usr/bin/c++ -O2 -pipe -fstack-protector-strong -isystem /usr/local/include -fno-strict-aliasing  -isystem /usr/local/include -O2 -pipe -fstack-protector-strong -isystem /usr/local/include -fno-strict-aliasing  -isystem /usr/local/include  -DNDEBUG -fstack-protector-strong -L/usr/local/lib -pie     -Xlinker --dependency-file=tests/regression/CMakeFiles/test_builtin_args.dir/link.d tests/regression/CMakeFiles/test_builtin_args.dir/test_builtin_args.cpp.o -o tests/regression/test_builtin_args  poclu/libpoclu.a  /usr/local/lib/libOpenCL.so  -lm  -pthread && :
[ 84% 512/605] /usr/bin/cc -DCL_HPP_TARGET_OPENCL_VERSION=300 -DCL_TARGET_OPENCL_VERSION=300 -DCL_USE_DEPRECATED_OPENCL_1_0_APIS -DCL_USE_DEPRECATED_OPENCL_1_1_APIS -DCL_USE_DEPRECATED_OPENCL_1_2_APIS -DCL_USE_DEPRECATED_OPENCL_2_0_APIS -DCL_USE_DEPRECATED_OPENCL_2_1_APIS -DCL_USE_DEPRECATED_OPENCL_2_2_APIS -I/wrkdirs/usr/ports/lang/pocl/work/.build -I/wrkdirs/usr/ports/lang/pocl/work/pocl-4.0/poclu -I/wrkdirs/usr/ports/lang/pocl/work/pocl-4.0 -O2 -pipe  -fstack-protector-strong -isystem /usr/local/include -fno-strict-aliasing -O2 -pipe  -fstack-protector-strong -isystem /usr/local/include -fno-strict-aliasing  -DNDEBUG -fPIE -Werror=implicit-function-declaration -Wincompatible-pointer-types -Wno-ignored-attributes -fvisibility=hidden -MD -MT tests/runtime/CMakeFiles/test_dlopen.dir/test_dlopen.c.o -MF tests/runtime/CMakeFiles/test_dlopen.dir/test_dlopen.c.o.d -o tests/runtime/CMakeFiles/test_dlopen.dir/test_dlopen.c.o -c /wrkdirs/usr/ports/lang/pocl/work/pocl-4.0/tests/runt
ime/test_dlopen.c
[ 84% 513/605] : && /usr/bin/cc -O2 -pipe  -fstack-protector-strong -isystem /usr/local/include -fno-strict-aliasing -O2 -pipe  -fstack-protector-strong -isystem /usr/local/include -fno-strict-aliasing  -DNDEBUG -fstack-protector-strong -L/usr/local/lib -pie     -Xlinker --dependency-file=tests/runtime/CMakeFiles/test_dlopen.dir/link.d tests/runtime/CMakeFiles/test_dlopen.dir/test_dlopen.c.o -o tests/runtime/test_dlopen  /usr/lib/libdl.so && :
[ 84% 514/605] /usr/bin/cc -DCL_HPP_TARGET_OPENCL_VERSION=300 -DCL_TARGET_OPENCL_VERSION=300 -DCL_USE_DEPRECATED_OPENCL_1_0_APIS -DCL_USE_DEPRECATED_OPENCL_1_1_APIS -DCL_USE_DEPRECATED_OPENCL_1_2_APIS -DCL_USE_DEPRECATED_OPENCL_2_0_APIS -DCL_USE_DEPRECATED_OPENCL_2_1_APIS -DCL_USE_DEPRECATED_OPENCL_2_2_APIS -I/wrkdirs/usr/ports/lang/pocl/work/.build -I/wrkdirs/usr/ports/lang/pocl/work/pocl-4.0/poclu -I/wrkdirs/usr/ports/lang/pocl/work/pocl-4.0 -O2 -pipe  -fstack-protector-strong -isystem /usr/local/include -fno-strict-aliasing -O2 -pipe  -fstack-protector-strong -isystem /usr/local/include -fno-strict-aliasing  -DNDEBUG -fPIE -Werror=implicit-function-declaration -Wincompatible-pointer-types -Wno-ignored-attributes -fvisibility=hidden -pthread -MD -MT tests/runtime/CMakeFiles/test_clFinish.dir/test_clFinish.c.o -MF tests/runtime/CMakeFiles/test_clFinish.dir/test_clFinish.c.o.d -o tests/runtime/CMakeFiles/test_clFinish.dir/test_clFinish.c.o -c /wrkdirs/usr/ports/lang/pocl/wor
k/pocl-4.0/tests/runtime/test_clFinish.c
[ 84% 515/605] /usr/bin/c++ -DCL_HPP_TARGET_OPENCL_VERSION=300 -DCL_TARGET_OPENCL_VERSION=300 -DCL_USE_DEPRECATED_OPENCL_1_0_APIS -DCL_USE_DEPRECATED_OPENCL_1_1_APIS -DCL_USE_DEPRECATED_OPENCL_1_2_APIS -DCL_USE_DEPRECATED_OPENCL_2_0_APIS -DCL_USE_DEPRECATED_OPENCL_2_1_APIS -DCL_USE_DEPRECATED_OPENCL_2_2_APIS -DSRCDIR=\"/wrkdirs/usr/ports/lang/pocl/work/pocl-4.0/tests/regression\" -I/wrkdirs/usr/ports/lang/pocl/work/.build -I/wrkdirs/usr/ports/lang/pocl/work/pocl-4.0/poclu -I/wrkdirs/usr/ports/lang/pocl/work/pocl-4.0/lib/CL -O2 -pipe -fstack-protector-strong -isystem /usr/local/include -fno-strict-aliasing  -isystem /usr/local/include -O2 -pipe -fstack-protector-strong -isystem /usr/local/include -fno-strict-aliasing  -isystem /usr/local/include  -DNDEBUG -std=gnu++11 -fPIE -Wno-ignored-attributes -fvisibility=hidden -fvisibility-inlines-hidden -Wno-deprecated -Wno-deprecated-declarations -pthread -MD -MT tests/regression/CMakeFiles/test_workitem_func_outside_kernel.dir/test_
workitem_func_outside_kernel.cpp.o -MF tests/regression/CMakeFiles/test_workitem_func_outside_kernel.dir/test_workitem_func_outside_kernel.cpp.o.d -o tests/regression/CMakeFiles/test_workitem_func_outside_kernel.dir/test_workitem_func_outside_kernel.cpp.o -c /wrkdirs/usr/ports/lang/pocl/work/pocl-4.0/tests/regression/test_workitem_func_outside_kernel.cpp
[ 84% 516/605] : && /usr/bin/cc -O2 -pipe  -fstack-protector-strong -isystem /usr/local/include -fno-strict-aliasing -O2 -pipe  -fstack-protector-strong -isystem /usr/local/include -fno-strict-aliasing  -DNDEBUG -fstack-protector-strong -L/usr/local/lib -pie     -Xlinker --dependency-file=tests/runtime/CMakeFiles/test_clFinish.dir/link.d tests/runtime/CMakeFiles/test_clFinish.dir/test_clFinish.c.o -o tests/runtime/test_clFinish  poclu/libpoclu.a  /usr/local/lib/libOpenCL.so  -lm  -pthread && :
[ 85% 517/605] : && /usr/bin/c++ -O2 -pipe -fstack-protector-strong -isystem /usr/local/include -fno-strict-aliasing  -isystem /usr/local/include -O2 -pipe -fstack-protector-strong -isystem /usr/local/include -fno-strict-aliasing  -isystem /usr/local/include  -DNDEBUG -fstack-protector-strong -L/usr/local/lib -pie     -Xlinker --dependency-file=tests/regression/CMakeFiles/test_workitem_func_outside_kernel.dir/link.d tests/regression/CMakeFiles/test_workitem_func_outside_kernel.dir/test_workitem_func_outside_kernel.cpp.o -o tests/regression/test_workitem_func_outside_kernel  poclu/libpoclu.a  /usr/local/lib/libOpenCL.so  -lm  -pthread && :
[ 85% 518/605] /usr/bin/cc -DCL_HPP_TARGET_OPENCL_VERSION=300 -DCL_TARGET_OPENCL_VERSION=300 -DCL_USE_DEPRECATED_OPENCL_1_0_APIS -DCL_USE_DEPRECATED_OPENCL_1_1_APIS -DCL_USE_DEPRECATED_OPENCL_1_2_APIS -DCL_USE_DEPRECATED_OPENCL_2_0_APIS -DCL_USE_DEPRECATED_OPENCL_2_1_APIS -DCL_USE_DEPRECATED_OPENCL_2_2_APIS -I/wrkdirs/usr/ports/lang/pocl/work/.build -I/wrkdirs/usr/ports/lang/pocl/work/pocl-4.0/poclu -I/wrkdirs/usr/ports/lang/pocl/work/pocl-4.0 -O2 -pipe  -fstack-protector-strong -isystem /usr/local/include -fno-strict-aliasing -O2 -pipe  -fstack-protector-strong -isystem /usr/local/include -fno-strict-aliasing  -DNDEBUG -fPIE -Werror=implicit-function-declaration -Wincompatible-pointer-types -Wno-ignored-attributes -fvisibility=hidden -pthread -MD -MT tests/runtime/CMakeFiles/test_clGetDeviceInfo.dir/test_clGetDeviceInfo.c.o -MF tests/runtime/CMakeFiles/test_clGetDeviceInfo.dir/test_clGetDeviceInfo.c.o.d -o tests/runtime/CMakeFiles/test_clGetDeviceInfo.dir/test_clGetDeviceIn
fo.c.o -c /wrkdirs/usr/ports/lang/pocl/work/pocl-4.0/tests/runtime/test_clGetDeviceInfo.c
[ 85% 519/605] /usr/bin/cc -DCL_HPP_TARGET_OPENCL_VERSION=300 -DCL_TARGET_OPENCL_VERSION=300 -DCL_USE_DEPRECATED_OPENCL_1_0_APIS -DCL_USE_DEPRECATED_OPENCL_1_1_APIS -DCL_USE_DEPRECATED_OPENCL_1_2_APIS -DCL_USE_DEPRECATED_OPENCL_2_0_APIS -DCL_USE_DEPRECATED_OPENCL_2_1_APIS -DCL_USE_DEPRECATED_OPENCL_2_2_APIS -I/wrkdirs/usr/ports/lang/pocl/work/.build -I/wrkdirs/usr/ports/lang/pocl/work/pocl-4.0/poclu -I/wrkdirs/usr/ports/lang/pocl/work/pocl-4.0 -O2 -pipe  -fstack-protector-strong -isystem /usr/local/include -fno-strict-aliasing -O2 -pipe  -fstack-protector-strong -isystem /usr/local/include -fno-strict-aliasing  -DNDEBUG -fPIE -Werror=implicit-function-declaration -Wincompatible-pointer-types -Wno-ignored-attributes -fvisibility=hidden -pthread -MD -MT tests/runtime/CMakeFiles/test_clGetEventInfo.dir/test_clGetEventInfo.c.o -MF tests/runtime/CMakeFiles/test_clGetEventInfo.dir/test_clGetEventInfo.c.o.d -o tests/runtime/CMakeFiles/test_clGetEventInfo.dir/test_clGetEventInfo.c.o
 -c /wrkdirs/usr/ports/lang/pocl/work/pocl-4.0/tests/runtime/test_clGetEventInfo.c
[ 85% 520/605] : && /usr/bin/cc -O2 -pipe  -fstack-protector-strong -isystem /usr/local/include -fno-strict-aliasing -O2 -pipe  -fstack-protector-strong -isystem /usr/local/include -fno-strict-aliasing  -DNDEBUG -fstack-protector-strong -L/usr/local/lib -pie     -Xlinker --dependency-file=tests/runtime/CMakeFiles/test_clGetDeviceInfo.dir/link.d tests/runtime/CMakeFiles/test_clGetDeviceInfo.dir/test_clGetDeviceInfo.c.o -o tests/runtime/test_clGetDeviceInfo  poclu/libpoclu.a  /usr/local/lib/libOpenCL.so  -lm  -pthread && :
[ 85% 521/605] : && /usr/bin/cc -O2 -pipe  -fstack-protector-strong -isystem /usr/local/include -fno-strict-aliasing -O2 -pipe  -fstack-protector-strong -isystem /usr/local/include -fno-strict-aliasing  -DNDEBUG -fstack-protector-strong -L/usr/local/lib -pie     -Xlinker --dependency-file=tests/runtime/CMakeFiles/test_clGetEventInfo.dir/link.d tests/runtime/CMakeFiles/test_clGetEventInfo.dir/test_clGetEventInfo.c.o -o tests/runtime/test_clGetEventInfo  poclu/libpoclu.a  /usr/local/lib/libOpenCL.so  -lm  -pthread && :
[ 85% 522/605] /usr/bin/cc -DCL_HPP_TARGET_OPENCL_VERSION=300 -DCL_TARGET_OPENCL_VERSION=300 -DCL_USE_DEPRECATED_OPENCL_1_0_APIS -DCL_USE_DEPRECATED_OPENCL_1_1_APIS -DCL_USE_DEPRECATED_OPENCL_1_2_APIS -DCL_USE_DEPRECATED_OPENCL_2_0_APIS -DCL_USE_DEPRECATED_OPENCL_2_1_APIS -DCL_USE_DEPRECATED_OPENCL_2_2_APIS -I/wrkdirs/usr/ports/lang/pocl/work/.build -I/wrkdirs/usr/ports/lang/pocl/work/pocl-4.0/poclu -I/wrkdirs/usr/ports/lang/pocl/work/pocl-4.0 -O2 -pipe  -fstack-protector-strong -isystem /usr/local/include -fno-strict-aliasing -O2 -pipe  -fstack-protector-strong -isystem /usr/local/include -fno-strict-aliasing  -DNDEBUG -fPIE -Werror=implicit-function-declaration -Wincompatible-pointer-types -Wno-ignored-attributes -fvisibility=hidden -pthread -MD -MT tests/runtime/CMakeFiles/test_clCreateProgramWithBinary.dir/test_clCreateProgramWithBinary.c.o -MF tests/runtime/CMakeFiles/test_clCreateProgramWithBinary.dir/test_clCreateProgramWithBinary.c.o.d -o tests/runtime/CMakeFiles/tes
t_clCreateProgramWithBinary.dir/test_clCreateProgramWithBinary.c.o -c /wrkdirs/usr/ports/lang/pocl/work/pocl-4.0/tests/runtime/test_clCreateProgramWithBinary.c
[ 86% 523/605] /usr/bin/cc -DCL_HPP_TARGET_OPENCL_VERSION=300 -DCL_TARGET_OPENCL_VERSION=300 -DCL_USE_DEPRECATED_OPENCL_1_0_APIS -DCL_USE_DEPRECATED_OPENCL_1_1_APIS -DCL_USE_DEPRECATED_OPENCL_1_2_APIS -DCL_USE_DEPRECATED_OPENCL_2_0_APIS -DCL_USE_DEPRECATED_OPENCL_2_1_APIS -DCL_USE_DEPRECATED_OPENCL_2_2_APIS -I/wrkdirs/usr/ports/lang/pocl/work/.build -I/wrkdirs/usr/ports/lang/pocl/work/pocl-4.0/poclu -I/wrkdirs/usr/ports/lang/pocl/work/pocl-4.0 -O2 -pipe  -fstack-protector-strong -isystem /usr/local/include -fno-strict-aliasing -O2 -pipe  -fstack-protector-strong -isystem /usr/local/include -fno-strict-aliasing  -DNDEBUG -fPIE -Werror=implicit-function-declaration -Wincompatible-pointer-types -Wno-ignored-attributes -fvisibility=hidden -pthread -MD -MT tests/runtime/CMakeFiles/test_clGetSupportedImageFormats.dir/test_clGetSupportedImageFormats.c.o -MF tests/runtime/CMakeFiles/test_clGetSupportedImageFormats.dir/test_clGetSupportedImageFormats.c.o.d -o tests/runtime/CMakeFiles
/test_clGetSupportedImageFormats.dir/test_clGetSupportedImageFormats.c.o -c /wrkdirs/usr/ports/lang/pocl/work/pocl-4.0/tests/runtime/test_clGetSupportedImageFormats.c
[ 86% 524/605] : && /usr/bin/cc -O2 -pipe  -fstack-protector-strong -isystem /usr/local/include -fno-strict-aliasing -O2 -pipe  -fstack-protector-strong -isystem /usr/local/include -fno-strict-aliasing  -DNDEBUG -fstack-protector-strong -L/usr/local/lib -pie     -Xlinker --dependency-file=tests/runtime/CMakeFiles/test_clCreateProgramWithBinary.dir/link.d tests/runtime/CMakeFiles/test_clCreateProgramWithBinary.dir/test_clCreateProgramWithBinary.c.o -o tests/runtime/test_clCreateProgramWithBinary  poclu/libpoclu.a  /usr/local/lib/libOpenCL.so  -lm  -pthread && :
[ 86% 525/605] : && /usr/bin/cc -O2 -pipe  -fstack-protector-strong -isystem /usr/local/include -fno-strict-aliasing -O2 -pipe  -fstack-protector-strong -isystem /usr/local/include -fno-strict-aliasing  -DNDEBUG -fstack-protector-strong -L/usr/local/lib -pie     -Xlinker --dependency-file=tests/runtime/CMakeFiles/test_clGetSupportedImageFormats.dir/link.d tests/runtime/CMakeFiles/test_clGetSupportedImageFormats.dir/test_clGetSupportedImageFormats.c.o -o tests/runtime/test_clGetSupportedImageFormats  poclu/libpoclu.a  /usr/local/lib/libOpenCL.so  -lm  -pthread && :
[ 86% 526/605] /usr/bin/cc -DCL_HPP_TARGET_OPENCL_VERSION=300 -DCL_TARGET_OPENCL_VERSION=300 -DCL_USE_DEPRECATED_OPENCL_1_0_APIS -DCL_USE_DEPRECATED_OPENCL_1_1_APIS -DCL_USE_DEPRECATED_OPENCL_1_2_APIS -DCL_USE_DEPRECATED_OPENCL_2_0_APIS -DCL_USE_DEPRECATED_OPENCL_2_1_APIS -DCL_USE_DEPRECATED_OPENCL_2_2_APIS -I/wrkdirs/usr/ports/lang/pocl/work/.build -I/wrkdirs/usr/ports/lang/pocl/work/pocl-4.0/poclu -I/wrkdirs/usr/ports/lang/pocl/work/pocl-4.0 -O2 -pipe  -fstack-protector-strong -isystem /usr/local/include -fno-strict-aliasing -O2 -pipe  -fstack-protector-strong -isystem /usr/local/include -fno-strict-aliasing  -DNDEBUG -fPIE -Werror=implicit-function-declaration -Wincompatible-pointer-types -Wno-ignored-attributes -fvisibility=hidden -pthread -MD -MT tests/runtime/CMakeFiles/test_clEnqueueNativeKernel.dir/test_clEnqueueNativeKernel.c.o -MF tests/runtime/CMakeFiles/test_clEnqueueNativeKernel.dir/test_clEnqueueNativeKernel.c.o.d -o tests/runtime/CMakeFiles/test_clEnqueueNativ
eKernel.dir/test_clEnqueueNativeKernel.c.o -c /wrkdirs/usr/ports/lang/pocl/work/pocl-4.0/tests/runtime/test_clEnqueueNativeKernel.c
[ 86% 527/605] /usr/bin/cc -DCL_HPP_TARGET_OPENCL_VERSION=300 -DCL_TARGET_OPENCL_VERSION=300 -DCL_USE_DEPRECATED_OPENCL_1_0_APIS -DCL_USE_DEPRECATED_OPENCL_1_1_APIS -DCL_USE_DEPRECATED_OPENCL_1_2_APIS -DCL_USE_DEPRECATED_OPENCL_2_0_APIS -DCL_USE_DEPRECATED_OPENCL_2_1_APIS -DCL_USE_DEPRECATED_OPENCL_2_2_APIS -I/wrkdirs/usr/ports/lang/pocl/work/.build -I/wrkdirs/usr/ports/lang/pocl/work/pocl-4.0/poclu -I/wrkdirs/usr/ports/lang/pocl/work/pocl-4.0 -O2 -pipe  -fstack-protector-strong -isystem /usr/local/include -fno-strict-aliasing -O2 -pipe  -fstack-protector-strong -isystem /usr/local/include -fno-strict-aliasing  -DNDEBUG -fPIE -Werror=implicit-function-declaration -Wincompatible-pointer-types -Wno-ignored-attributes -fvisibility=hidden -pthread -MD -MT tests/runtime/CMakeFiles/test_clSetEventCallback.dir/test_clSetEventCallback.c.o -MF tests/runtime/CMakeFiles/test_clSetEventCallback.dir/test_clSetEventCallback.c.o.d -o tests/runtime/CMakeFiles/test_clSetEventCallback.dir/tes
t_clSetEventCallback.c.o -c /wrkdirs/usr/ports/lang/pocl/work/pocl-4.0/tests/runtime/test_clSetEventCallback.c
[ 86% 528/605] : && /usr/bin/cc -O2 -pipe  -fstack-protector-strong -isystem /usr/local/include -fno-strict-aliasing -O2 -pipe  -fstack-protector-strong -isystem /usr/local/include -fno-strict-aliasing  -DNDEBUG -fstack-protector-strong -L/usr/local/lib -pie     -Xlinker --dependency-file=tests/runtime/CMakeFiles/test_clEnqueueNativeKernel.dir/link.d tests/runtime/CMakeFiles/test_clEnqueueNativeKernel.dir/test_clEnqueueNativeKernel.c.o -o tests/runtime/test_clEnqueueNativeKernel  poclu/libpoclu.a  /usr/local/lib/libOpenCL.so  -lm  -pthread && :
[ 87% 529/605] : && /usr/bin/cc -O2 -pipe  -fstack-protector-strong -isystem /usr/local/include -fno-strict-aliasing -O2 -pipe  -fstack-protector-strong -isystem /usr/local/include -fno-strict-aliasing  -DNDEBUG -fstack-protector-strong -L/usr/local/lib -pie     -Xlinker --dependency-file=tests/runtime/CMakeFiles/test_clSetEventCallback.dir/link.d tests/runtime/CMakeFiles/test_clSetEventCallback.dir/test_clSetEventCallback.c.o -o tests/runtime/test_clSetEventCallback  poclu/libpoclu.a  /usr/local/lib/libOpenCL.so  -lm  -pthread && :
[ 87% 530/605] /usr/bin/cc -DCL_HPP_TARGET_OPENCL_VERSION=300 -DCL_TARGET_OPENCL_VERSION=300 -DCL_USE_DEPRECATED_OPENCL_1_0_APIS -DCL_USE_DEPRECATED_OPENCL_1_1_APIS -DCL_USE_DEPRECATED_OPENCL_1_2_APIS -DCL_USE_DEPRECATED_OPENCL_2_0_APIS -DCL_USE_DEPRECATED_OPENCL_2_1_APIS -DCL_USE_DEPRECATED_OPENCL_2_2_APIS -I/wrkdirs/usr/ports/lang/pocl/work/.build -I/wrkdirs/usr/ports/lang/pocl/work/pocl-4.0/poclu -I/wrkdirs/usr/ports/lang/pocl/work/pocl-4.0 -O2 -pipe  -fstack-protector-strong -isystem /usr/local/include -fno-strict-aliasing -O2 -pipe  -fstack-protector-strong -isystem /usr/local/include -fno-strict-aliasing  -DNDEBUG -fPIE -Werror=implicit-function-declaration -Wincompatible-pointer-types -Wno-ignored-attributes -fvisibility=hidden -pthread -MD -MT tests/runtime/CMakeFiles/test_clCreateKernelsInProgram.dir/test_clCreateKernelsInProgram.c.o -MF tests/runtime/CMakeFiles/test_clCreateKernelsInProgram.dir/test_clCreateKernelsInProgram.c.o.d -o tests/runtime/CMakeFiles/test_cl
CreateKernelsInProgram.dir/test_clCreateKernelsInProgram.c.o -c /wrkdirs/usr/ports/lang/pocl/work/pocl-4.0/tests/runtime/test_clCreateKernelsInProgram.c
[ 87% 531/605] : && /usr/bin/cc -O2 -pipe  -fstack-protector-strong -isystem /usr/local/include -fno-strict-aliasing -O2 -pipe  -fstack-protector-strong -isystem /usr/local/include -fno-strict-aliasing  -DNDEBUG -fstack-protector-strong -L/usr/local/lib -pie     -Xlinker --dependency-file=tests/runtime/CMakeFiles/test_clCreateKernelsInProgram.dir/link.d tests/runtime/CMakeFiles/test_clCreateKernelsInProgram.dir/test_clCreateKernelsInProgram.c.o -o tests/runtime/test_clCreateKernelsInProgram  poclu/libpoclu.a  /usr/local/lib/libOpenCL.so  -lm  -pthread && :
[ 87% 532/605] /usr/bin/cc -DCL_HPP_TARGET_OPENCL_VERSION=300 -DCL_TARGET_OPENCL_VERSION=300 -DCL_USE_DEPRECATED_OPENCL_1_0_APIS -DCL_USE_DEPRECATED_OPENCL_1_1_APIS -DCL_USE_DEPRECATED_OPENCL_1_2_APIS -DCL_USE_DEPRECATED_OPENCL_2_0_APIS -DCL_USE_DEPRECATED_OPENCL_2_1_APIS -DCL_USE_DEPRECATED_OPENCL_2_2_APIS -I/wrkdirs/usr/ports/lang/pocl/work/.build -I/wrkdirs/usr/ports/lang/pocl/work/pocl-4.0/poclu -I/wrkdirs/usr/ports/lang/pocl/work/pocl-4.0 -O2 -pipe  -fstack-protector-strong -isystem /usr/local/include -fno-strict-aliasing -O2 -pipe  -fstack-protector-strong -isystem /usr/local/include -fno-strict-aliasing  -DNDEBUG -fPIE -Werror=implicit-function-declaration -Wincompatible-pointer-types -Wno-ignored-attributes -fvisibility=hidden -pthread -MD -MT tests/runtime/CMakeFiles/test_clBuildProgram.dir/test_clBuildProgram.c.o -MF tests/runtime/CMakeFiles/test_clBuildProgram.dir/test_clBuildProgram.c.o.d -o tests/runtime/CMakeFiles/test_clBuildProgram.dir/test_clBuildProgram.c.o
 -c /wrkdirs/usr/ports/lang/pocl/work/pocl-4.0/tests/runtime/test_clBuildProgram.c
[ 87% 533/605] /usr/bin/cc -DCL_HPP_TARGET_OPENCL_VERSION=300 -DCL_TARGET_OPENCL_VERSION=300 -DCL_USE_DEPRECATED_OPENCL_1_0_APIS -DCL_USE_DEPRECATED_OPENCL_1_1_APIS -DCL_USE_DEPRECATED_OPENCL_1_2_APIS -DCL_USE_DEPRECATED_OPENCL_2_0_APIS -DCL_USE_DEPRECATED_OPENCL_2_1_APIS -DCL_USE_DEPRECATED_OPENCL_2_2_APIS -I/wrkdirs/usr/ports/lang/pocl/work/.build -I/wrkdirs/usr/ports/lang/pocl/work/pocl-4.0/poclu -I/wrkdirs/usr/ports/lang/pocl/work/pocl-4.0 -O2 -pipe  -fstack-protector-strong -isystem /usr/local/include -fno-strict-aliasing -O2 -pipe  -fstack-protector-strong -isystem /usr/local/include -fno-strict-aliasing  -DNDEBUG -fPIE -Werror=implicit-function-declaration -Wincompatible-pointer-types -Wno-ignored-attributes -fvisibility=hidden -pthread -MD -MT tests/runtime/CMakeFiles/test_clCreateKernel.dir/test_clCreateKernel.c.o -MF tests/runtime/CMakeFiles/test_clCreateKernel.dir/test_clCreateKernel.c.o.d -o tests/runtime/CMakeFiles/test_clCreateKernel.dir/test_clCreateKernel.c.o
 -c /wrkdirs/usr/ports/lang/pocl/work/pocl-4.0/tests/runtime/test_clCreateKernel.c
[ 87% 534/605] : && /usr/bin/cc -O2 -pipe  -fstack-protector-strong -isystem /usr/local/include -fno-strict-aliasing -O2 -pipe  -fstack-protector-strong -isystem /usr/local/include -fno-strict-aliasing  -DNDEBUG -fstack-protector-strong -L/usr/local/lib -pie     -Xlinker --dependency-file=tests/runtime/CMakeFiles/test_clBuildProgram.dir/link.d tests/runtime/CMakeFiles/test_clBuildProgram.dir/test_clBuildProgram.c.o -o tests/runtime/test_clBuildProgram  poclu/libpoclu.a  /usr/local/lib/libOpenCL.so  -lm  -pthread && :
[ 88% 535/605] : && /usr/bin/cc -O2 -pipe  -fstack-protector-strong -isystem /usr/local/include -fno-strict-aliasing -O2 -pipe  -fstack-protector-strong -isystem /usr/local/include -fno-strict-aliasing  -DNDEBUG -fstack-protector-strong -L/usr/local/lib -pie     -Xlinker --dependency-file=tests/runtime/CMakeFiles/test_clCreateKernel.dir/link.d tests/runtime/CMakeFiles/test_clCreateKernel.dir/test_clCreateKernel.c.o -o tests/runtime/test_clCreateKernel  poclu/libpoclu.a  /usr/local/lib/libOpenCL.so  -lm  -pthread && :
[ 88% 536/605] /usr/bin/cc -DCL_HPP_TARGET_OPENCL_VERSION=300 -DCL_TARGET_OPENCL_VERSION=300 -DCL_USE_DEPRECATED_OPENCL_1_0_APIS -DCL_USE_DEPRECATED_OPENCL_1_1_APIS -DCL_USE_DEPRECATED_OPENCL_1_2_APIS -DCL_USE_DEPRECATED_OPENCL_2_0_APIS -DCL_USE_DEPRECATED_OPENCL_2_1_APIS -DCL_USE_DEPRECATED_OPENCL_2_2_APIS -I/wrkdirs/usr/ports/lang/pocl/work/.build -I/wrkdirs/usr/ports/lang/pocl/work/pocl-4.0/poclu -I/wrkdirs/usr/ports/lang/pocl/work/pocl-4.0 -O2 -pipe  -fstack-protector-strong -isystem /usr/local/include -fno-strict-aliasing -O2 -pipe  -fstack-protector-strong -isystem /usr/local/include -fno-strict-aliasing  -DNDEBUG -fPIE -Werror=implicit-function-declaration -Wincompatible-pointer-types -Wno-ignored-attributes -fvisibility=hidden -pthread -MD -MT tests/runtime/CMakeFiles/test_version.dir/test_version.c.o -MF tests/runtime/CMakeFiles/test_version.dir/test_version.c.o.d -o tests/runtime/CMakeFiles/test_version.dir/test_version.c.o -c /wrkdirs/usr/ports/lang/pocl/work/pocl
-4.0/tests/runtime/test_version.c
[ 88% 537/605] /usr/bin/cc -DCL_HPP_TARGET_OPENCL_VERSION=300 -DCL_TARGET_OPENCL_VERSION=300 -DCL_USE_DEPRECATED_OPENCL_1_0_APIS -DCL_USE_DEPRECATED_OPENCL_1_1_APIS -DCL_USE_DEPRECATED_OPENCL_1_2_APIS -DCL_USE_DEPRECATED_OPENCL_2_0_APIS -DCL_USE_DEPRECATED_OPENCL_2_1_APIS -DCL_USE_DEPRECATED_OPENCL_2_2_APIS -I/wrkdirs/usr/ports/lang/pocl/work/.build -I/wrkdirs/usr/ports/lang/pocl/work/pocl-4.0/poclu -I/wrkdirs/usr/ports/lang/pocl/work/pocl-4.0 -O2 -pipe  -fstack-protector-strong -isystem /usr/local/include -fno-strict-aliasing -O2 -pipe  -fstack-protector-strong -isystem /usr/local/include -fno-strict-aliasing  -DNDEBUG -fPIE -Werror=implicit-function-declaration -Wincompatible-pointer-types -Wno-ignored-attributes -fvisibility=hidden -pthread -MD -MT tests/runtime/CMakeFiles/test_clGetKernelArgInfo.dir/test_clGetKernelArgInfo.c.o -MF tests/runtime/CMakeFiles/test_clGetKernelArgInfo.dir/test_clGetKernelArgInfo.c.o.d -o tests/runtime/CMakeFiles/test_clGetKernelArgInfo.dir/tes
t_clGetKernelArgInfo.c.o -c /wrkdirs/usr/ports/lang/pocl/work/pocl-4.0/tests/runtime/test_clGetKernelArgInfo.c
[ 88% 538/605] : && /usr/bin/cc -O2 -pipe  -fstack-protector-strong -isystem /usr/local/include -fno-strict-aliasing -O2 -pipe  -fstack-protector-strong -isystem /usr/local/include -fno-strict-aliasing  -DNDEBUG -fstack-protector-strong -L/usr/local/lib -pie     -Xlinker --dependency-file=tests/runtime/CMakeFiles/test_version.dir/link.d tests/runtime/CMakeFiles/test_version.dir/test_version.c.o -o tests/runtime/test_version  poclu/libpoclu.a  /usr/local/lib/libOpenCL.so  -lm  -pthread && :
[ 88% 539/605] : && /usr/bin/cc -O2 -pipe  -fstack-protector-strong -isystem /usr/local/include -fno-strict-aliasing -O2 -pipe  -fstack-protector-strong -isystem /usr/local/include -fno-strict-aliasing  -DNDEBUG -fstack-protector-strong -L/usr/local/lib -pie     -Xlinker --dependency-file=tests/runtime/CMakeFiles/test_clGetKernelArgInfo.dir/link.d tests/runtime/CMakeFiles/test_clGetKernelArgInfo.dir/test_clGetKernelArgInfo.c.o -o tests/runtime/test_clGetKernelArgInfo  poclu/libpoclu.a  /usr/local/lib/libOpenCL.so  -lm  -pthread && :
[ 88% 540/605] /usr/bin/cc -DCL_HPP_TARGET_OPENCL_VERSION=300 -DCL_TARGET_OPENCL_VERSION=300 -DCL_USE_DEPRECATED_OPENCL_1_0_APIS -DCL_USE_DEPRECATED_OPENCL_1_1_APIS -DCL_USE_DEPRECATED_OPENCL_1_2_APIS -DCL_USE_DEPRECATED_OPENCL_2_0_APIS -DCL_USE_DEPRECATED_OPENCL_2_1_APIS -DCL_USE_DEPRECATED_OPENCL_2_2_APIS -I/wrkdirs/usr/ports/lang/pocl/work/.build -I/wrkdirs/usr/ports/lang/pocl/work/pocl-4.0/poclu -I/wrkdirs/usr/ports/lang/pocl/work/pocl-4.0 -O2 -pipe  -fstack-protector-strong -isystem /usr/local/include -fno-strict-aliasing -O2 -pipe  -fstack-protector-strong -isystem /usr/local/include -fno-strict-aliasing  -DNDEBUG -fPIE -Werror=implicit-function-declaration -Wincompatible-pointer-types -Wno-ignored-attributes -fvisibility=hidden -pthread -MD -MT tests/runtime/CMakeFiles/test_kernel_cache_includes.dir/test_kernel_cache_includes.c.o -MF tests/runtime/CMakeFiles/test_kernel_cache_includes.dir/test_kernel_cache_includes.c.o.d -o tests/runtime/CMakeFiles/test_kernel_cache_i
ncludes.dir/test_kernel_cache_includes.c.o -c /wrkdirs/usr/ports/lang/pocl/work/pocl-4.0/tests/runtime/test_kernel_cache_includes.c
[ 89% 541/605] : && /usr/bin/cc -O2 -pipe  -fstack-protector-strong -isystem /usr/local/include -fno-strict-aliasing -O2 -pipe  -fstack-protector-strong -isystem /usr/local/include -fno-strict-aliasing  -DNDEBUG -fstack-protector-strong -L/usr/local/lib -pie     -Xlinker --dependency-file=tests/runtime/CMakeFiles/test_kernel_cache_includes.dir/link.d tests/runtime/CMakeFiles/test_kernel_cache_includes.dir/test_kernel_cache_includes.c.o -o tests/runtime/test_kernel_cache_includes  poclu/libpoclu.a  /usr/local/lib/libOpenCL.so  -lm  -pthread && :
[ 89% 542/605] /usr/bin/cc -DCL_HPP_TARGET_OPENCL_VERSION=300 -DCL_TARGET_OPENCL_VERSION=300 -DCL_USE_DEPRECATED_OPENCL_1_0_APIS -DCL_USE_DEPRECATED_OPENCL_1_1_APIS -DCL_USE_DEPRECATED_OPENCL_1_2_APIS -DCL_USE_DEPRECATED_OPENCL_2_0_APIS -DCL_USE_DEPRECATED_OPENCL_2_1_APIS -DCL_USE_DEPRECATED_OPENCL_2_2_APIS -I/wrkdirs/usr/ports/lang/pocl/work/.build -I/wrkdirs/usr/ports/lang/pocl/work/pocl-4.0/poclu -I/wrkdirs/usr/ports/lang/pocl/work/pocl-4.0 -O2 -pipe  -fstack-protector-strong -isystem /usr/local/include -fno-strict-aliasing -O2 -pipe  -fstack-protector-strong -isystem /usr/local/include -fno-strict-aliasing  -DNDEBUG -fPIE -Werror=implicit-function-declaration -Wincompatible-pointer-types -Wno-ignored-attributes -fvisibility=hidden -pthread -MD -MT tests/runtime/CMakeFiles/test_event_cycle.dir/test_event_cycle.c.o -MF tests/runtime/CMakeFiles/test_event_cycle.dir/test_event_cycle.c.o.d -o tests/runtime/CMakeFiles/test_event_cycle.dir/test_event_cycle.c.o -c /wrkdirs/usr/p
orts/lang/pocl/work/pocl-4.0/tests/runtime/test_event_cycle.c
[ 89% 543/605] : && /usr/bin/cc -O2 -pipe  -fstack-protector-strong -isystem /usr/local/include -fno-strict-aliasing -O2 -pipe  -fstack-protector-strong -isystem /usr/local/include -fno-strict-aliasing  -DNDEBUG -fstack-protector-strong -L/usr/local/lib -pie     -Xlinker --dependency-file=tests/runtime/CMakeFiles/test_event_cycle.dir/link.d tests/runtime/CMakeFiles/test_event_cycle.dir/test_event_cycle.c.o -o tests/runtime/test_event_cycle  poclu/libpoclu.a  /usr/local/lib/libOpenCL.so  -lm  -pthread && :
[ 89% 544/605] /usr/bin/cc -DCL_HPP_TARGET_OPENCL_VERSION=300 -DCL_TARGET_OPENCL_VERSION=300 -DCL_USE_DEPRECATED_OPENCL_1_0_APIS -DCL_USE_DEPRECATED_OPENCL_1_1_APIS -DCL_USE_DEPRECATED_OPENCL_1_2_APIS -DCL_USE_DEPRECATED_OPENCL_2_0_APIS -DCL_USE_DEPRECATED_OPENCL_2_1_APIS -DCL_USE_DEPRECATED_OPENCL_2_2_APIS -I/wrkdirs/usr/ports/lang/pocl/work/.build -I/wrkdirs/usr/ports/lang/pocl/work/pocl-4.0/poclu -I/wrkdirs/usr/ports/lang/pocl/work/pocl-4.0 -O2 -pipe  -fstack-protector-strong -isystem /usr/local/include -fno-strict-aliasing -O2 -pipe  -fstack-protector-strong -isystem /usr/local/include -fno-strict-aliasing  -DNDEBUG -fPIE -Werror=implicit-function-declaration -Wincompatible-pointer-types -Wno-ignored-attributes -fvisibility=hidden -pthread -MD -MT tests/runtime/CMakeFiles/test_link_error.dir/test_link_error.c.o -MF tests/runtime/CMakeFiles/test_link_error.dir/test_link_error.c.o.d -o tests/runtime/CMakeFiles/test_link_error.dir/test_link_error.c.o -c /wrkdirs/usr/ports/l
ang/pocl/work/pocl-4.0/tests/runtime/test_link_error.c
[ 89% 545/605] : && /usr/bin/cc -O2 -pipe  -fstack-protector-strong -isystem /usr/local/include -fno-strict-aliasing -O2 -pipe  -fstack-protector-strong -isystem /usr/local/include -fno-strict-aliasing  -DNDEBUG -fstack-protector-strong -L/usr/local/lib -pie     -Xlinker --dependency-file=tests/runtime/CMakeFiles/test_link_error.dir/link.d tests/runtime/CMakeFiles/test_link_error.dir/test_link_error.c.o -o tests/runtime/test_link_error  poclu/libpoclu.a  /usr/local/lib/libOpenCL.so  -lm  -pthread && :
[ 89% 546/605] /usr/bin/cc -DCL_HPP_TARGET_OPENCL_VERSION=300 -DCL_TARGET_OPENCL_VERSION=300 -DCL_USE_DEPRECATED_OPENCL_1_0_APIS -DCL_USE_DEPRECATED_OPENCL_1_1_APIS -DCL_USE_DEPRECATED_OPENCL_1_2_APIS -DCL_USE_DEPRECATED_OPENCL_2_0_APIS -DCL_USE_DEPRECATED_OPENCL_2_1_APIS -DCL_USE_DEPRECATED_OPENCL_2_2_APIS -I/wrkdirs/usr/ports/lang/pocl/work/.build -I/wrkdirs/usr/ports/lang/pocl/work/pocl-4.0/poclu -I/wrkdirs/usr/ports/lang/pocl/work/pocl-4.0 -O2 -pipe  -fstack-protector-strong -isystem /usr/local/include -fno-strict-aliasing -O2 -pipe  -fstack-protector-strong -isystem /usr/local/include -fno-strict-aliasing  -DNDEBUG -fPIE -Werror=implicit-function-declaration -Wincompatible-pointer-types -Wno-ignored-attributes -fvisibility=hidden -pthread -MD -MT tests/runtime/CMakeFiles/test_read-copy-write-buffer.dir/test_read-copy-write-buffer.c.o -MF tests/runtime/CMakeFiles/test_read-copy-write-buffer.dir/test_read-copy-write-buffer.c.o.d -o tests/runtime/CMakeFiles/test_read-copy-
write-buffer.dir/test_read-copy-write-buffer.c.o -c /wrkdirs/usr/ports/lang/pocl/work/pocl-4.0/tests/runtime/test_read-copy-write-buffer.c
[ 90% 547/605] : && /usr/bin/cc -O2 -pipe  -fstack-protector-strong -isystem /usr/local/include -fno-strict-aliasing -O2 -pipe  -fstack-protector-strong -isystem /usr/local/include -fno-strict-aliasing  -DNDEBUG -fstack-protector-strong -L/usr/local/lib -pie     -Xlinker --dependency-file=tests/runtime/CMakeFiles/test_read-copy-write-buffer.dir/link.d tests/runtime/CMakeFiles/test_read-copy-write-buffer.dir/test_read-copy-write-buffer.c.o -o tests/runtime/test_read-copy-write-buffer  poclu/libpoclu.a  /usr/local/lib/libOpenCL.so  -lm  -pthread && :
[ 90% 548/605] /usr/bin/cc -DCL_HPP_TARGET_OPENCL_VERSION=300 -DCL_TARGET_OPENCL_VERSION=300 -DCL_USE_DEPRECATED_OPENCL_1_0_APIS -DCL_USE_DEPRECATED_OPENCL_1_1_APIS -DCL_USE_DEPRECATED_OPENCL_1_2_APIS -DCL_USE_DEPRECATED_OPENCL_2_0_APIS -DCL_USE_DEPRECATED_OPENCL_2_1_APIS -DCL_USE_DEPRECATED_OPENCL_2_2_APIS -I/wrkdirs/usr/ports/lang/pocl/work/.build -I/wrkdirs/usr/ports/lang/pocl/work/pocl-4.0/poclu -I/wrkdirs/usr/ports/lang/pocl/work/pocl-4.0 -O2 -pipe  -fstack-protector-strong -isystem /usr/local/include -fno-strict-aliasing -O2 -pipe  -fstack-protector-strong -isystem /usr/local/include -fno-strict-aliasing  -DNDEBUG -fPIE -Werror=implicit-function-declaration -Wincompatible-pointer-types -Wno-ignored-attributes -fvisibility=hidden -pthread -MD -MT tests/runtime/CMakeFiles/test_buffer-image-copy.dir/test_buffer-image-copy.c.o -MF tests/runtime/CMakeFiles/test_buffer-image-copy.dir/test_buffer-image-copy.c.o.d -o tests/runtime/CMakeFiles/test_buffer-image-copy.dir/test_buf
fer-image-copy.c.o -c /wrkdirs/usr/ports/lang/pocl/work/pocl-4.0/tests/runtime/test_buffer-image-copy.c
[ 90% 549/605] : && /usr/bin/cc -O2 -pipe  -fstack-protector-strong -isystem /usr/local/include -fno-strict-aliasing -O2 -pipe  -fstack-protector-strong -isystem /usr/local/include -fno-strict-aliasing  -DNDEBUG -fstack-protector-strong -L/usr/local/lib -pie     -Xlinker --dependency-file=tests/runtime/CMakeFiles/test_buffer-image-copy.dir/link.d tests/runtime/CMakeFiles/test_buffer-image-copy.dir/test_buffer-image-copy.c.o -o tests/runtime/test_buffer-image-copy  poclu/libpoclu.a  /usr/local/lib/libOpenCL.so  -lm  -pthread && :
[ 90% 550/605] /usr/bin/cc -DCL_HPP_TARGET_OPENCL_VERSION=300 -DCL_TARGET_OPENCL_VERSION=300 -DCL_USE_DEPRECATED_OPENCL_1_0_APIS -DCL_USE_DEPRECATED_OPENCL_1_1_APIS -DCL_USE_DEPRECATED_OPENCL_1_2_APIS -DCL_USE_DEPRECATED_OPENCL_2_0_APIS -DCL_USE_DEPRECATED_OPENCL_2_1_APIS -DCL_USE_DEPRECATED_OPENCL_2_2_APIS -I/wrkdirs/usr/ports/lang/pocl/work/.build -I/wrkdirs/usr/ports/lang/pocl/work/pocl-4.0/poclu -I/wrkdirs/usr/ports/lang/pocl/work/pocl-4.0 -O2 -pipe  -fstack-protector-strong -isystem /usr/local/include -fno-strict-aliasing -O2 -pipe  -fstack-protector-strong -isystem /usr/local/include -fno-strict-aliasing  -DNDEBUG -fPIE -Werror=implicit-function-declaration -Wincompatible-pointer-types -Wno-ignored-attributes -fvisibility=hidden -pthread -MD -MT tests/runtime/CMakeFiles/test_clCreateSubDevices.dir/test_clCreateSubDevices.c.o -MF tests/runtime/CMakeFiles/test_clCreateSubDevices.dir/test_clCreateSubDevices.c.o.d -o tests/runtime/CMakeFiles/test_clCreateSubDevices.dir/tes
t_clCreateSubDevices.c.o -c /wrkdirs/usr/ports/lang/pocl/work/pocl-4.0/tests/runtime/test_clCreateSubDevices.c
[ 90% 551/605] : && /usr/bin/cc -O2 -pipe  -fstack-protector-strong -isystem /usr/local/include -fno-strict-aliasing -O2 -pipe  -fstack-protector-strong -isystem /usr/local/include -fno-strict-aliasing  -DNDEBUG -fstack-protector-strong -L/usr/local/lib -pie     -Xlinker --dependency-file=tests/runtime/CMakeFiles/test_clCreateSubDevices.dir/link.d tests/runtime/CMakeFiles/test_clCreateSubDevices.dir/test_clCreateSubDevices.c.o -o tests/runtime/test_clCreateSubDevices  poclu/libpoclu.a  /usr/local/lib/libOpenCL.so  -lm  -pthread && :
[ 90% 552/605] /usr/bin/cc -DCL_HPP_TARGET_OPENCL_VERSION=300 -DCL_TARGET_OPENCL_VERSION=300 -DCL_USE_DEPRECATED_OPENCL_1_0_APIS -DCL_USE_DEPRECATED_OPENCL_1_1_APIS -DCL_USE_DEPRECATED_OPENCL_1_2_APIS -DCL_USE_DEPRECATED_OPENCL_2_0_APIS -DCL_USE_DEPRECATED_OPENCL_2_1_APIS -DCL_USE_DEPRECATED_OPENCL_2_2_APIS -I/wrkdirs/usr/ports/lang/pocl/work/.build -I/wrkdirs/usr/ports/lang/pocl/work/pocl-4.0/poclu -I/wrkdirs/usr/ports/lang/pocl/work/pocl-4.0 -O2 -pipe  -fstack-protector-strong -isystem /usr/local/include -fno-strict-aliasing -O2 -pipe  -fstack-protector-strong -isystem /usr/local/include -fno-strict-aliasing  -DNDEBUG -fPIE -Werror=implicit-function-declaration -Wincompatible-pointer-types -Wno-ignored-attributes -fvisibility=hidden -pthread -MD -MT tests/runtime/CMakeFiles/test_event_free.dir/test_event_free.c.o -MF tests/runtime/CMakeFiles/test_event_free.dir/test_event_free.c.o.d -o tests/runtime/CMakeFiles/test_event_free.dir/test_event_free.c.o -c /wrkdirs/usr/ports/l
ang/pocl/work/pocl-4.0/tests/runtime/test_event_free.c
[ 91% 553/605] : && /usr/bin/cc -O2 -pipe  -fstack-protector-strong -isystem /usr/local/include -fno-strict-aliasing -O2 -pipe  -fstack-protector-strong -isystem /usr/local/include -fno-strict-aliasing  -DNDEBUG -fstack-protector-strong -L/usr/local/lib -pie     -Xlinker --dependency-file=tests/runtime/CMakeFiles/test_event_free.dir/link.d tests/runtime/CMakeFiles/test_event_free.dir/test_event_free.c.o -o tests/runtime/test_event_free  poclu/libpoclu.a  /usr/local/lib/libOpenCL.so  -lm  -pthread && :
[ 91% 554/605] /usr/bin/cc -DCL_HPP_TARGET_OPENCL_VERSION=300 -DCL_TARGET_OPENCL_VERSION=300 -DCL_USE_DEPRECATED_OPENCL_1_0_APIS -DCL_USE_DEPRECATED_OPENCL_1_1_APIS -DCL_USE_DEPRECATED_OPENCL_1_2_APIS -DCL_USE_DEPRECATED_OPENCL_2_0_APIS -DCL_USE_DEPRECATED_OPENCL_2_1_APIS -DCL_USE_DEPRECATED_OPENCL_2_2_APIS -I/wrkdirs/usr/ports/lang/pocl/work/.build -I/wrkdirs/usr/ports/lang/pocl/work/pocl-4.0/poclu -I/wrkdirs/usr/ports/lang/pocl/work/pocl-4.0 -O2 -pipe  -fstack-protector-strong -isystem /usr/local/include -fno-strict-aliasing -O2 -pipe  -fstack-protector-strong -isystem /usr/local/include -fno-strict-aliasing  -DNDEBUG -fPIE -Werror=implicit-function-declaration -Wincompatible-pointer-types -Wno-ignored-attributes -fvisibility=hidden -pthread -MD -MT tests/runtime/CMakeFiles/test_event_double_wait.dir/test_event_double_wait.c.o -MF tests/runtime/CMakeFiles/test_event_double_wait.dir/test_event_double_wait.c.o.d -o tests/runtime/CMakeFiles/test_event_double_wait.dir/test_eve
nt_double_wait.c.o -c /wrkdirs/usr/ports/lang/pocl/work/pocl-4.0/tests/runtime/test_event_double_wait.c
[ 91% 555/605] : && /usr/bin/cc -O2 -pipe  -fstack-protector-strong -isystem /usr/local/include -fno-strict-aliasing -O2 -pipe  -fstack-protector-strong -isystem /usr/local/include -fno-strict-aliasing  -DNDEBUG -fstack-protector-strong -L/usr/local/lib -pie     -Xlinker --dependency-file=tests/runtime/CMakeFiles/test_event_double_wait.dir/link.d tests/runtime/CMakeFiles/test_event_double_wait.dir/test_event_double_wait.c.o -o tests/runtime/test_event_double_wait  poclu/libpoclu.a  /usr/local/lib/libOpenCL.so  -lm  -pthread && :
[ 91% 556/605] /usr/bin/cc -DCL_HPP_TARGET_OPENCL_VERSION=300 -DCL_TARGET_OPENCL_VERSION=300 -DCL_USE_DEPRECATED_OPENCL_1_0_APIS -DCL_USE_DEPRECATED_OPENCL_1_1_APIS -DCL_USE_DEPRECATED_OPENCL_1_2_APIS -DCL_USE_DEPRECATED_OPENCL_2_0_APIS -DCL_USE_DEPRECATED_OPENCL_2_1_APIS -DCL_USE_DEPRECATED_OPENCL_2_2_APIS -I/wrkdirs/usr/ports/lang/pocl/work/.build -I/wrkdirs/usr/ports/lang/pocl/work/pocl-4.0/poclu -I/wrkdirs/usr/ports/lang/pocl/work/pocl-4.0 -O2 -pipe  -fstack-protector-strong -isystem /usr/local/include -fno-strict-aliasing -O2 -pipe  -fstack-protector-strong -isystem /usr/local/include -fno-strict-aliasing  -DNDEBUG -fPIE -Werror=implicit-function-declaration -Wincompatible-pointer-types -Wno-ignored-attributes -fvisibility=hidden -pthread -MD -MT tests/runtime/CMakeFiles/test_buffer_migration.dir/test_buffer_migration.c.o -MF tests/runtime/CMakeFiles/test_buffer_migration.dir/test_buffer_migration.c.o.d -o tests/runtime/CMakeFiles/test_buffer_migration.dir/test_buffer_m
igration.c.o -c /wrkdirs/usr/ports/lang/pocl/work/pocl-4.0/tests/runtime/test_buffer_migration.c
[ 91% 557/605] /usr/bin/cc -DCL_HPP_TARGET_OPENCL_VERSION=300 -DCL_TARGET_OPENCL_VERSION=300 -DCL_USE_DEPRECATED_OPENCL_1_0_APIS -DCL_USE_DEPRECATED_OPENCL_1_1_APIS -DCL_USE_DEPRECATED_OPENCL_1_2_APIS -DCL_USE_DEPRECATED_OPENCL_2_0_APIS -DCL_USE_DEPRECATED_OPENCL_2_1_APIS -DCL_USE_DEPRECATED_OPENCL_2_2_APIS -I/wrkdirs/usr/ports/lang/pocl/work/.build -I/wrkdirs/usr/ports/lang/pocl/work/pocl-4.0/poclu -I/wrkdirs/usr/ports/lang/pocl/work/pocl-4.0 -O2 -pipe  -fstack-protector-strong -isystem /usr/local/include -fno-strict-aliasing -O2 -pipe  -fstack-protector-strong -isystem /usr/local/include -fno-strict-aliasing  -DNDEBUG -fPIE -Werror=implicit-function-declaration -Wincompatible-pointer-types -Wno-ignored-attributes -fvisibility=hidden -pthread -MD -MT tests/runtime/CMakeFiles/test_buffer_ping_pong.dir/test_buffer_ping_pong.c.o -MF tests/runtime/CMakeFiles/test_buffer_ping_pong.dir/test_buffer_ping_pong.c.o.d -o tests/runtime/CMakeFiles/test_buffer_ping_pong.dir/test_buffer_p
ing_pong.c.o -c /wrkdirs/usr/ports/lang/pocl/work/pocl-4.0/tests/runtime/test_buffer_ping_pong.c
[ 91% 558/605] : && /usr/bin/cc -O2 -pipe  -fstack-protector-strong -isystem /usr/local/include -fno-strict-aliasing -O2 -pipe  -fstack-protector-strong -isystem /usr/local/include -fno-strict-aliasing  -DNDEBUG -fstack-protector-strong -L/usr/local/lib -pie     -Xlinker --dependency-file=tests/runtime/CMakeFiles/test_buffer_migration.dir/link.d tests/runtime/CMakeFiles/test_buffer_migration.dir/test_buffer_migration.c.o -o tests/runtime/test_buffer_migration  poclu/libpoclu.a  /usr/local/lib/libOpenCL.so  -lm  -pthread && :
[ 92% 559/605] : && /usr/bin/cc -O2 -pipe  -fstack-protector-strong -isystem /usr/local/include -fno-strict-aliasing -O2 -pipe  -fstack-protector-strong -isystem /usr/local/include -fno-strict-aliasing  -DNDEBUG -fstack-protector-strong -L/usr/local/lib -pie     -Xlinker --dependency-file=tests/runtime/CMakeFiles/test_buffer_ping_pong.dir/link.d tests/runtime/CMakeFiles/test_buffer_ping_pong.dir/test_buffer_ping_pong.c.o -o tests/runtime/test_buffer_ping_pong  poclu/libpoclu.a  /usr/local/lib/libOpenCL.so  -lm  -pthread && :
[ 92% 560/605] /usr/bin/cc -DCL_HPP_TARGET_OPENCL_VERSION=300 -DCL_TARGET_OPENCL_VERSION=300 -DCL_USE_DEPRECATED_OPENCL_1_0_APIS -DCL_USE_DEPRECATED_OPENCL_1_1_APIS -DCL_USE_DEPRECATED_OPENCL_1_2_APIS -DCL_USE_DEPRECATED_OPENCL_2_0_APIS -DCL_USE_DEPRECATED_OPENCL_2_1_APIS -DCL_USE_DEPRECATED_OPENCL_2_2_APIS -I/wrkdirs/usr/ports/lang/pocl/work/.build -I/wrkdirs/usr/ports/lang/pocl/work/pocl-4.0/poclu -I/wrkdirs/usr/ports/lang/pocl/work/pocl-4.0 -O2 -pipe  -fstack-protector-strong -isystem /usr/local/include -fno-strict-aliasing -O2 -pipe  -fstack-protector-strong -isystem /usr/local/include -fno-strict-aliasing  -DNDEBUG -fPIE -Werror=implicit-function-declaration -Wincompatible-pointer-types -Wno-ignored-attributes -fvisibility=hidden -pthread -MD -MT tests/runtime/CMakeFiles/test_user_event.dir/test_user_event.c.o -MF tests/runtime/CMakeFiles/test_user_event.dir/test_user_event.c.o.d -o tests/runtime/CMakeFiles/test_user_event.dir/test_user_event.c.o -c /wrkdirs/usr/ports/l
ang/pocl/work/pocl-4.0/tests/runtime/test_user_event.c
[ 92% 561/605] : && /usr/bin/cc -O2 -pipe  -fstack-protector-strong -isystem /usr/local/include -fno-strict-aliasing -O2 -pipe  -fstack-protector-strong -isystem /usr/local/include -fno-strict-aliasing  -DNDEBUG -fstack-protector-strong -L/usr/local/lib -pie     -Xlinker --dependency-file=tests/runtime/CMakeFiles/test_user_event.dir/link.d tests/runtime/CMakeFiles/test_user_event.dir/test_user_event.c.o -o tests/runtime/test_user_event  poclu/libpoclu.a  /usr/local/lib/libOpenCL.so  -lm  -pthread && :
[ 92% 562/605] /usr/bin/cc -DCL_HPP_TARGET_OPENCL_VERSION=300 -DCL_TARGET_OPENCL_VERSION=300 -DCL_USE_DEPRECATED_OPENCL_1_0_APIS -DCL_USE_DEPRECATED_OPENCL_1_1_APIS -DCL_USE_DEPRECATED_OPENCL_1_2_APIS -DCL_USE_DEPRECATED_OPENCL_2_0_APIS -DCL_USE_DEPRECATED_OPENCL_2_1_APIS -DCL_USE_DEPRECATED_OPENCL_2_2_APIS -I/wrkdirs/usr/ports/lang/pocl/work/.build -I/wrkdirs/usr/ports/lang/pocl/work/pocl-4.0/poclu -I/wrkdirs/usr/ports/lang/pocl/work/pocl-4.0 -O2 -pipe  -fstack-protector-strong -isystem /usr/local/include -fno-strict-aliasing -O2 -pipe  -fstack-protector-strong -isystem /usr/local/include -fno-strict-aliasing  -DNDEBUG -fPIE -Werror=implicit-function-declaration -Wincompatible-pointer-types -Wno-ignored-attributes -fvisibility=hidden -pthread -MD -MT tests/runtime/CMakeFiles/test_enqueue_kernel_from_binary.dir/test_enqueue_kernel_from_binary.c.o -MF tests/runtime/CMakeFiles/test_enqueue_kernel_from_binary.dir/test_enqueue_kernel_from_binary.c.o.d -o tests/runtime/CMakeFiles
/test_enqueue_kernel_from_binary.dir/test_enqueue_kernel_from_binary.c.o -c /wrkdirs/usr/ports/lang/pocl/work/pocl-4.0/tests/runtime/test_enqueue_kernel_from_binary.c
[ 92% 563/605] : && /usr/bin/cc -O2 -pipe  -fstack-protector-strong -isystem /usr/local/include -fno-strict-aliasing -O2 -pipe  -fstack-protector-strong -isystem /usr/local/include -fno-strict-aliasing  -DNDEBUG -fstack-protector-strong -L/usr/local/lib -pie     -Xlinker --dependency-file=tests/runtime/CMakeFiles/test_enqueue_kernel_from_binary.dir/link.d tests/runtime/CMakeFiles/test_enqueue_kernel_from_binary.dir/test_enqueue_kernel_from_binary.c.o -o tests/runtime/test_enqueue_kernel_from_binary  poclu/libpoclu.a  /usr/local/lib/libOpenCL.so  -lm  -pthread && :
[ 92% 564/605] /usr/bin/c++ -DCL_HPP_TARGET_OPENCL_VERSION=300 -DCL_TARGET_OPENCL_VERSION=300 -DCL_USE_DEPRECATED_OPENCL_1_0_APIS -DCL_USE_DEPRECATED_OPENCL_1_1_APIS -DCL_USE_DEPRECATED_OPENCL_1_2_APIS -DCL_USE_DEPRECATED_OPENCL_2_0_APIS -DCL_USE_DEPRECATED_OPENCL_2_1_APIS -DCL_USE_DEPRECATED_OPENCL_2_2_APIS -DSRCDIR=\"/wrkdirs/usr/ports/lang/pocl/work/pocl-4.0/tests/regression\" -I/wrkdirs/usr/ports/lang/pocl/work/.build -I/wrkdirs/usr/ports/lang/pocl/work/pocl-4.0/poclu -I/wrkdirs/usr/ports/lang/pocl/work/pocl-4.0/lib/CL -O2 -pipe -fstack-protector-strong -isystem /usr/local/include -fno-strict-aliasing  -isystem /usr/local/include -O2 -pipe -fstack-protector-strong -isystem /usr/local/include -fno-strict-aliasing  -isystem /usr/local/include  -DNDEBUG -std=gnu++11 -fPIE -Wno-ignored-attributes -fvisibility=hidden -fvisibility-inlines-hidden -Wno-deprecated -Wno-deprecated-declarations -pthread -MD -MT tests/regression/CMakeFiles/test_program_scope_vars.dir/test_program_sc
ope_vars.cpp.o -MF tests/regression/CMakeFiles/test_program_scope_vars.dir/test_program_scope_vars.cpp.o.d -o tests/regression/CMakeFiles/test_program_scope_vars.dir/test_program_scope_vars.cpp.o -c /wrkdirs/usr/ports/lang/pocl/work/pocl-4.0/tests/regression/test_program_scope_vars.cpp
[ 93% 565/605] /usr/bin/cc -DCL_HPP_TARGET_OPENCL_VERSION=300 -DCL_TARGET_OPENCL_VERSION=300 -DCL_USE_DEPRECATED_OPENCL_1_0_APIS -DCL_USE_DEPRECATED_OPENCL_1_1_APIS -DCL_USE_DEPRECATED_OPENCL_1_2_APIS -DCL_USE_DEPRECATED_OPENCL_2_0_APIS -DCL_USE_DEPRECATED_OPENCL_2_1_APIS -DCL_USE_DEPRECATED_OPENCL_2_2_APIS -I/wrkdirs/usr/ports/lang/pocl/work/.build -I/wrkdirs/usr/ports/lang/pocl/work/pocl-4.0/poclu -I/wrkdirs/usr/ports/lang/pocl/work/pocl-4.0 -O2 -pipe  -fstack-protector-strong -isystem /usr/local/include -fno-strict-aliasing -O2 -pipe  -fstack-protector-strong -isystem /usr/local/include -fno-strict-aliasing  -DNDEBUG -fPIE -Werror=implicit-function-declaration -Wincompatible-pointer-types -Wno-ignored-attributes -fvisibility=hidden -pthread -MD -MT tests/runtime/CMakeFiles/test_fill-buffer.dir/test_fill-buffer.c.o -MF tests/runtime/CMakeFiles/test_fill-buffer.dir/test_fill-buffer.c.o.d -o tests/runtime/CMakeFiles/test_fill-buffer.dir/test_fill-buffer.c.o -c /wrkdirs/usr/p
orts/lang/pocl/work/pocl-4.0/tests/runtime/test_fill-buffer.c
[ 93% 566/605] /usr/bin/cc -DCL_HPP_TARGET_OPENCL_VERSION=300 -DCL_TARGET_OPENCL_VERSION=300 -DCL_USE_DEPRECATED_OPENCL_1_0_APIS -DCL_USE_DEPRECATED_OPENCL_1_1_APIS -DCL_USE_DEPRECATED_OPENCL_1_2_APIS -DCL_USE_DEPRECATED_OPENCL_2_0_APIS -DCL_USE_DEPRECATED_OPENCL_2_1_APIS -DCL_USE_DEPRECATED_OPENCL_2_2_APIS -I/wrkdirs/usr/ports/lang/pocl/work/.build -I/wrkdirs/usr/ports/lang/pocl/work/pocl-4.0/poclu -I/wrkdirs/usr/ports/lang/pocl/work/pocl-4.0 -O2 -pipe  -fstack-protector-strong -isystem /usr/local/include -fno-strict-aliasing -O2 -pipe  -fstack-protector-strong -isystem /usr/local/include -fno-strict-aliasing  -DNDEBUG -fPIE -Werror=implicit-function-declaration -Wincompatible-pointer-types -Wno-ignored-attributes -fvisibility=hidden -pthread -MD -MT tests/runtime/CMakeFiles/test_clSetMemObjectDestructorCallback.dir/test_clSetMemObjectDestructorCallback.c.o -MF tests/runtime/CMakeFiles/test_clSetMemObjectDestructorCallback.dir/test_clSetMemObjectDestructorCallback.c.o.d -o 
tests/runtime/CMakeFiles/test_clSetMemObjectDestructorCallback.dir/test_clSetMemObjectDestructorCallback.c.o -c /wrkdirs/usr/ports/lang/pocl/work/pocl-4.0/tests/runtime/test_clSetMemObjectDestructorCallback.c
[ 93% 567/605] : && /usr/bin/c++ -O2 -pipe -fstack-protector-strong -isystem /usr/local/include -fno-strict-aliasing  -isystem /usr/local/include -O2 -pipe -fstack-protector-strong -isystem /usr/local/include -fno-strict-aliasing  -isystem /usr/local/include  -DNDEBUG -fstack-protector-strong -L/usr/local/lib -pie     -Xlinker --dependency-file=tests/regression/CMakeFiles/test_program_scope_vars.dir/link.d tests/regression/CMakeFiles/test_program_scope_vars.dir/test_program_scope_vars.cpp.o -o tests/regression/test_program_scope_vars  poclu/libpoclu.a  /usr/local/lib/libOpenCL.so  -lm  -pthread && :
[ 93% 568/605] : && /usr/bin/cc -O2 -pipe  -fstack-protector-strong -isystem /usr/local/include -fno-strict-aliasing -O2 -pipe  -fstack-protector-strong -isystem /usr/local/include -fno-strict-aliasing  -DNDEBUG -fstack-protector-strong -L/usr/local/lib -pie     -Xlinker --dependency-file=tests/runtime/CMakeFiles/test_fill-buffer.dir/link.d tests/runtime/CMakeFiles/test_fill-buffer.dir/test_fill-buffer.c.o -o tests/runtime/test_fill-buffer  poclu/libpoclu.a  /usr/local/lib/libOpenCL.so  -lm  -pthread && :
[ 93% 569/605] : && /usr/bin/cc -O2 -pipe  -fstack-protector-strong -isystem /usr/local/include -fno-strict-aliasing -O2 -pipe  -fstack-protector-strong -isystem /usr/local/include -fno-strict-aliasing  -DNDEBUG -fstack-protector-strong -L/usr/local/lib -pie     -Xlinker --dependency-file=tests/runtime/CMakeFiles/test_clSetMemObjectDestructorCallback.dir/link.d tests/runtime/CMakeFiles/test_clSetMemObjectDestructorCallback.dir/test_clSetMemObjectDestructorCallback.c.o -o tests/runtime/test_clSetMemObjectDestructorCallback  poclu/libpoclu.a  /usr/local/lib/libOpenCL.so  -lm  -pthread && :
[ 93% 570/605] /usr/bin/cc -DCL_HPP_TARGET_OPENCL_VERSION=300 -DCL_TARGET_OPENCL_VERSION=300 -DCL_USE_DEPRECATED_OPENCL_1_0_APIS -DCL_USE_DEPRECATED_OPENCL_1_1_APIS -DCL_USE_DEPRECATED_OPENCL_1_2_APIS -DCL_USE_DEPRECATED_OPENCL_2_0_APIS -DCL_USE_DEPRECATED_OPENCL_2_1_APIS -DCL_USE_DEPRECATED_OPENCL_2_2_APIS -I/wrkdirs/usr/ports/lang/pocl/work/.build -I/wrkdirs/usr/ports/lang/pocl/work/pocl-4.0/poclu -I/wrkdirs/usr/ports/lang/pocl/work/pocl-4.0 -O2 -pipe  -fstack-protector-strong -isystem /usr/local/include -fno-strict-aliasing -O2 -pipe  -fstack-protector-strong -isystem /usr/local/include -fno-strict-aliasing  -DNDEBUG -fPIE -Werror=implicit-function-declaration -Wincompatible-pointer-types -Wno-ignored-attributes -fvisibility=hidden -pthread -MD -MT tests/runtime/CMakeFiles/test_command_buffer.dir/test_command_buffer.c.o -MF tests/runtime/CMakeFiles/test_command_buffer.dir/test_command_buffer.c.o.d -o tests/runtime/CMakeFiles/test_command_buffer.dir/test_command_buffer.c.o
 -c /wrkdirs/usr/ports/lang/pocl/work/pocl-4.0/tests/runtime/test_command_buffer.c
FAILED: tests/runtime/CMakeFiles/test_command_buffer.dir/test_command_buffer.c.o 
/usr/bin/cc -DCL_HPP_TARGET_OPENCL_VERSION=300 -DCL_TARGET_OPENCL_VERSION=300 -DCL_USE_DEPRECATED_OPENCL_1_0_APIS -DCL_USE_DEPRECATED_OPENCL_1_1_APIS -DCL_USE_DEPRECATED_OPENCL_1_2_APIS -DCL_USE_DEPRECATED_OPENCL_2_0_APIS -DCL_USE_DEPRECATED_OPENCL_2_1_APIS -DCL_USE_DEPRECATED_OPENCL_2_2_APIS -I/wrkdirs/usr/ports/lang/pocl/work/.build -I/wrkdirs/usr/ports/lang/pocl/work/pocl-4.0/poclu -I/wrkdirs/usr/ports/lang/pocl/work/pocl-4.0 -O2 -pipe  -fstack-protector-strong -isystem /usr/local/include -fno-strict-aliasing -O2 -pipe  -fstack-protector-strong -isystem /usr/local/include -fno-strict-aliasing  -DNDEBUG -fPIE -Werror=implicit-function-declaration -Wincompatible-pointer-types -Wno-ignored-attributes -fvisibility=hidden -pthread -MD -MT tests/runtime/CMakeFiles/test_command_buffer.dir/test_command_buffer.c.o -MF tests/runtime/CMakeFiles/test_command_buffer.dir/test_command_buffer.c.o.d -o tests/runtime/CMakeFiles/test_command_buffer.dir/test_command_buffer.c.o -c /wrkdirs/us
r/ports/lang/pocl/work/pocl-4.0/tests/runtime/test_command_buffer.c
/wrkdirs/usr/ports/lang/pocl/work/pocl-4.0/tests/runtime/test_command_buffer.c:147:15: error: too few arguments to function call, expected 12, have 11
  143 |       CHECK_CL_ERROR (ext.clCommandCopyBufferKHR (
      |                       ~~~~~~~~~~~~~~~~~~~~~~~~~~
  144 |           command_buffer, NULL, buffer_src1, buffer_tile1,
  145 |           tile_index * tile_size, 0, tile_size, tile_sync_point ? 1 : 0,
  146 |           tile_sync_point ? &tile_sync_point : NULL, &copy_sync_points[0],
  147 |           NULL));
      |               ^
/wrkdirs/usr/ports/lang/pocl/work/pocl-4.0/poclu/poclu.h:363:58: note: expanded from macro 'CHECK_CL_ERROR'
  363 | #define CHECK_CL_ERROR(cond) _POCLU_CHECK_CL_ERROR_INNER(cond, __PRETTY_FUNCTION__, __LINE__)
      |                                                          ^~~~
/wrkdirs/usr/ports/lang/pocl/work/pocl-4.0/poclu/poclu.h:354:27: note: expanded from macro '_POCLU_CHECK_CL_ERROR_INNER'
  354 |       if (check_cl_error (cond, line, func))                                  \
      |                           ^~~~
/wrkdirs/usr/ports/lang/pocl/work/pocl-4.0/tests/runtime/test_command_buffer.c:157:37: error: too few arguments to function call, expected 16, have 15
  153 |       CHECK_CL_ERROR (ext.clCommandCopyBufferRectKHR (
      |                       ~~~~~~~~~~~~~~~~~~~~~~~~~~~~~~
  154 |           command_buffer, NULL, buffer_src2, buffer_tile2, src_origin,
  155 |           dst_origin, tile_region, tile_region[0], 0, tile_region[0], 0,
  156 |           tile_sync_point ? 1 : 0, tile_sync_point ? &tile_sync_point : NULL,
  157 |           &copy_sync_points[1], NULL));
      |                                     ^
/wrkdirs/usr/ports/lang/pocl/work/pocl-4.0/poclu/poclu.h:363:58: note: expanded from macro 'CHECK_CL_ERROR'
  363 | #define CHECK_CL_ERROR(cond) _POCLU_CHECK_CL_ERROR_INNER(cond, __PRETTY_FUNCTION__, __LINE__)
      |                                                          ^~~~
/wrkdirs/usr/ports/lang/pocl/work/pocl-4.0/poclu/poclu.h:354:27: note: expanded from macro '_POCLU_CHECK_CL_ERROR_INNER'
  354 |       if (check_cl_error (cond, line, func))                                  \
      |                           ^~~~
/wrkdirs/usr/ports/lang/pocl/work/pocl-4.0/tests/runtime/test_command_buffer.c:168:37: error: too few arguments to function call, expected 12, have 11
  165 |       CHECK_CL_ERROR (ext.clCommandCopyBufferKHR (
      |                       ~~~~~~~~~~~~~~~~~~~~~~~~~~
  166 |           command_buffer, NULL, buffer_res, buffer_dst, 0,
  167 |           tile_index * tile_size, tile_size, 1, &nd_sync_point,
  168 |           &res_copy_sync_point, NULL));
      |                                     ^
/wrkdirs/usr/ports/lang/pocl/work/pocl-4.0/poclu/poclu.h:363:58: note: expanded from macro 'CHECK_CL_ERROR'
  363 | #define CHECK_CL_ERROR(cond) _POCLU_CHECK_CL_ERROR_INNER(cond, __PRETTY_FUNCTION__, __LINE__)
      |                                                          ^~~~
/wrkdirs/usr/ports/lang/pocl/work/pocl-4.0/poclu/poclu.h:354:27: note: expanded from macro '_POCLU_CHECK_CL_ERROR_INNER'
  354 |       if (check_cl_error (cond, line, func))                                  \
      |                           ^~~~
/wrkdirs/usr/ports/lang/pocl/work/pocl-4.0/tests/runtime/test_command_buffer.c:174:67: error: too few arguments to function call, expected 12, have 11
  172 |       CHECK_CL_ERROR (ext.clCommandFillBufferKHR (
      |                       ~~~~~~~~~~~~~~~~~~~~~~~~~~
  173 |           command_buffer, NULL, buffer_tile1, &zero, sizeof (zero), 0,
  174 |           tile_size, 1, &nd_sync_point, &fill_sync_points[0], NULL));
      |                                                                   ^
/wrkdirs/usr/ports/lang/pocl/work/pocl-4.0/poclu/poclu.h:363:58: note: expanded from macro 'CHECK_CL_ERROR'
  363 | #define CHECK_CL_ERROR(cond) _POCLU_CHECK_CL_ERROR_INNER(cond, __PRETTY_FUNCTION__, __LINE__)
      |                                                          ^~~~
/wrkdirs/usr/ports/lang/pocl/work/pocl-4.0/poclu/poclu.h:354:27: note: expanded from macro '_POCLU_CHECK_CL_ERROR_INNER'
  354 |       if (check_cl_error (cond, line, func))                                  \
      |                           ^~~~
/wrkdirs/usr/ports/lang/pocl/work/pocl-4.0/tests/runtime/test_command_buffer.c:177:67: error: too few arguments to function call, expected 12, have 11
  175 |       CHECK_CL_ERROR (ext.clCommandFillBufferKHR (
      |                       ~~~~~~~~~~~~~~~~~~~~~~~~~~
  176 |           command_buffer, NULL, buffer_tile2, &zero, sizeof (zero), 0,
  177 |           tile_size, 1, &nd_sync_point, &fill_sync_points[1], NULL));
      |                                                                   ^
/wrkdirs/usr/ports/lang/pocl/work/pocl-4.0/poclu/poclu.h:363:58: note: expanded from macro 'CHECK_CL_ERROR'
  363 | #define CHECK_CL_ERROR(cond) _POCLU_CHECK_CL_ERROR_INNER(cond, __PRETTY_FUNCTION__, __LINE__)
      |                                                          ^~~~
/wrkdirs/usr/ports/lang/pocl/work/pocl-4.0/poclu/poclu.h:354:27: note: expanded from macro '_POCLU_CHECK_CL_ERROR_INNER'
  354 |       if (check_cl_error (cond, line, func))                                  \
      |                           ^~~~
/wrkdirs/usr/ports/lang/pocl/work/pocl-4.0/tests/runtime/test_command_buffer.c:183:72: error: too few arguments to function call, expected 7, have 6
  182 |       CHECK_CL_ERROR (ext.clCommandBarrierWithWaitListKHR (
      |                       ~~~~~~~~~~~~~~~~~~~~~~~~~~~~~~~~~~~
  183 |           command_buffer, NULL, 4, barrier_deps, &tile_sync_point, NULL));
      |                                                                        ^
/wrkdirs/usr/ports/lang/pocl/work/pocl-4.0/poclu/poclu.h:363:58: note: expanded from macro 'CHECK_CL_ERROR'
  363 | #define CHECK_CL_ERROR(cond) _POCLU_CHECK_CL_ERROR_INNER(cond, __PRETTY_FUNCTION__, __LINE__)
      |                                                          ^~~~
/wrkdirs/usr/ports/lang/pocl/work/pocl-4.0/poclu/poclu.h:354:27: note: expanded from macro '_POCLU_CHECK_CL_ERROR_INNER'
  354 |       if (check_cl_error (cond, line, func))                                  \
      |                           ^~~~
6 errors generated.
[ 94% 570/605] /usr/bin/cc -DCL_HPP_TARGET_OPENCL_VERSION=300 -DCL_TARGET_OPENCL_VERSION=300 -DCL_USE_DEPRECATED_OPENCL_1_0_APIS -DCL_USE_DEPRECATED_OPENCL_1_1_APIS -DCL_USE_DEPRECATED_OPENCL_1_2_APIS -DCL_USE_DEPRECATED_OPENCL_2_0_APIS -DCL_USE_DEPRECATED_OPENCL_2_1_APIS -DCL_USE_DEPRECATED_OPENCL_2_2_APIS -I/wrkdirs/usr/ports/lang/pocl/work/.build -I/wrkdirs/usr/ports/lang/pocl/work/pocl-4.0/poclu -I/wrkdirs/usr/ports/lang/pocl/work/pocl-4.0 -O2 -pipe  -fstack-protector-strong -isystem /usr/local/include -fno-strict-aliasing -O2 -pipe  -fstack-protector-strong -isystem /usr/local/include -fno-strict-aliasing  -DNDEBUG -fPIE -Werror=implicit-function-declaration -Wincompatible-pointer-types -Wno-ignored-attributes -fvisibility=hidden -pthread -MD -MT tests/runtime/CMakeFiles/test_cl_pocl_content_size.dir/test_cl_pocl_content_size.c.o -MF tests/runtime/CMakeFiles/test_cl_pocl_content_size.dir/test_cl_pocl_content_size.c.o.d -o tests/runtime/CMakeFiles/test_cl_pocl_content_si
ze.dir/test_cl_pocl_content_size.c.o -c /wrkdirs/usr/ports/lang/pocl/work/pocl-4.0/tests/runtime/test_cl_pocl_content_size.c
[ 94% 570/605] /usr/bin/cc -DCL_HPP_TARGET_OPENCL_VERSION=300 -DCL_TARGET_OPENCL_VERSION=300 -DCL_USE_DEPRECATED_OPENCL_1_0_APIS -DCL_USE_DEPRECATED_OPENCL_1_1_APIS -DCL_USE_DEPRECATED_OPENCL_1_2_APIS -DCL_USE_DEPRECATED_OPENCL_2_0_APIS -DCL_USE_DEPRECATED_OPENCL_2_1_APIS -DCL_USE_DEPRECATED_OPENCL_2_2_APIS -I/wrkdirs/usr/ports/lang/pocl/work/.build -I/wrkdirs/usr/ports/lang/pocl/work/pocl-4.0/poclu -I/wrkdirs/usr/ports/lang/pocl/work/pocl-4.0 -O2 -pipe  -fstack-protector-strong -isystem /usr/local/include -fno-strict-aliasing -O2 -pipe  -fstack-protector-strong -isystem /usr/local/include -fno-strict-aliasing  -DNDEBUG -fPIE -Werror=implicit-function-declaration -Wincompatible-pointer-types -Wno-ignored-attributes -fvisibility=hidden -pthread -MD -MT tests/runtime/CMakeFiles/test_deviceside_enqueue.dir/test_deviceside_enqueue.c.o -MF tests/runtime/CMakeFiles/test_deviceside_enqueue.dir/test_deviceside_enqueue.c.o.d -o tests/runtime/CMakeFiles/test_deviceside_enqueue.dir/tes
t_deviceside_enqueue.c.o -c /wrkdirs/usr/ports/lang/pocl/work/pocl-4.0/tests/runtime/test_deviceside_enqueue.c
ninja: build stopped: subcommand failed.
===> Compilation failed unexpectedly.
Try to set MAKE_JOBS_UNSAFE=yes and rebuild before reporting the failure to
the maintainer.
*** Error code 1

Stop.
make: stopped in /usr/ports/lang/pocl