[package - 134i386-default][science/parthenon] Failed for parthenon-24.08_2 in build
- Go to: [ bottom of page ] [ top of archives ] [ this month ]
Date: Wed, 05 Feb 2025 14:33:01 UTC
You are receiving this mail as a port that you maintain
is failing to build on the FreeBSD package build server.
Please investigate the failure and submit a PR to fix
build.
Maintainer: yuri@FreeBSD.org
Log URL: https://pkg-status.freebsd.org/beefy15/data/134i386-default/5beddb013d54/logs/parthenon-24.08_2.log
Build URL: https://pkg-status.freebsd.org/beefy15/build.html?mastername=134i386-default&build=5beddb013d54
Log:
=>> Building science/parthenon
build started at Wed Feb 5 14:27:44 UTC 2025
port directory: /usr/ports/science/parthenon
package name: parthenon-24.08_2
building for: FreeBSD 134i386-default-job-05 13.4-RELEASE-p3 FreeBSD 13.4-RELEASE-p3 i386
maintained by: yuri@FreeBSD.org
Makefile datestamp: -rw-r--r-- 1 root wheel 1497 Dec 21 01:01 /usr/ports/science/parthenon/Makefile
Ports top last git commit: 5beddb013d5
Ports top unclean checkout: no
Port dir last git commit: 0b16ed2e323
Port dir unclean checkout: no
Poudriere version: poudriere-git-3.4.2
Host OSVERSION: 1500028
Jail OSVERSION: 1304000
Job Id: 05
---Begin Environment---
SHELL=/bin/csh
BLOCKSIZE=K
MAIL=/var/mail/root
MM_CHARSET=UTF-8
LANG=C.UTF-8
OSVERSION=1304000
STATUS=1
HOME=/root
PATH=/sbin:/bin:/usr/sbin:/usr/bin:/usr/local/sbin:/usr/local/bin:/root/bin
MAKE_OBJDIR_CHECK_WRITABLE=0
UNAME_m=i386
UNAME_p=i386
UNAME_r=13.4-RELEASE-p3
LOCALBASE=/usr/local
UNAME_v=FreeBSD 13.4-RELEASE-p3
USER=root
POUDRIERE_NAME=poudriere-git
LIBEXECPREFIX=/usr/local/libexec/poudriere
POUDRIERE_VERSION=3.4.2
MASTERMNT=/usr/local/poudriere/data/.m/134i386-default/ref
LC_COLLATE=C
POUDRIERE_BUILD_TYPE=bulk
PACKAGE_BUILDING=yes
SAVED_TERM=
OUTPUT_REDIRECTED_STDERR=4
OUTPUT_REDIRECTED=1
PWD=/usr/local/poudriere/data/.m/134i386-default/05/.p
OUTPUT_REDIRECTED_STDOUT=3
P_PORTS_FEATURES=FLAVORS SUBPACKAGES SELECTED_OPTIONS
MASTERNAME=134i386-default
SCRIPTPREFIX=/usr/local/share/poudriere
SCRIPTNAME=bulk.sh
OLDPWD=/usr/local/poudriere/data/.m/134i386-default/ref/.p/pool
POUDRIERE_PKGNAME=poudriere-git-3.4.2
SCRIPTPATH=/usr/local/share/poudriere/bulk.sh
POUDRIEREPATH=/usr/local/bin/poudriere
---End Environment---
---Begin Poudriere Port Flags/Env---
PORT_FLAGS=
PKGENV=
FLAVOR=
MAKE_ARGS=
---End Poudriere Port Flags/Env---
---Begin OPTIONS List---
===> The following configuration options are available for parthenon-24.08_2:
ASCENT=on: Enable Ascent for in situ visualization and analysis
HDF5=off: HDF-5 data format support
===> Use 'make config' to modify these settings
---End OPTIONS List---
--MAINTAINER--
yuri@FreeBSD.org
--End MAINTAINER--
--CONFIGURE_ARGS--
--End CONFIGURE_ARGS--
--CONFIGURE_ENV--
PYTHON="/usr/local/bin/python3.11" XDG_DATA_HOME=/wrkdirs/usr/ports/science/parthenon/work XDG_CONFIG_HOME=/wrkdirs/usr/ports/science/parthenon/work XDG_CACHE_HOME=/wrkdirs/usr/ports/science/parthenon/work/.cache HOME=/wrkdirs/usr/ports/science/parthenon/work TMPDIR="/tmp" PATH=/wrkdirs/usr/ports/science/parthenon/work/.bin:/sbin:/bin:/usr/sbin:/usr/bin:/usr/local/sbin:/usr/local/bin:/root/bin PKG_CONFIG_LIBDIR=/wrkdirs/usr/ports/science/parthenon/work/.pkgconfig:/usr/local/libdata/pkgconfig:/usr/local/share/pkgconfig:/usr/libdata/pkgconfig SHELL=/bin/sh CONFIG_SHELL=/bin/sh
--End CONFIGURE_ENV--
--MAKE_ENV--
NINJA_STATUS="[%p %s/%t] " XDG_DATA_HOME=/wrkdirs/usr/ports/science/parthenon/work XDG_CONFIG_HOME=/wrkdirs/usr/ports/science/parthenon/work XDG_CACHE_HOME=/wrkdirs/usr/ports/science/parthenon/work/.cache HOME=/wrkdirs/usr/ports/science/parthenon/work TMPDIR="/tmp" PATH=/wrkdirs/usr/ports/science/parthenon/work/.bin:/sbin:/bin:/usr/sbin:/usr/bin:/usr/local/sbin:/usr/local/bin:/root/bin PKG_CONFIG_LIBDIR=/wrkdirs/usr/ports/science/parthenon/work/.pkgconfig:/usr/local/libdata/pkgconfig:/usr/local/share/pkgconfig:/usr/libdata/pkgconfig MK_DEBUG_FILES=no MK_KERNEL_SYMBOLS=no SHELL=/bin/sh NO_LINT=YES DESTDIR=/wrkdirs/usr/ports/science/parthenon/work/stage PREFIX=/usr/local LOCALBASE=/usr/local CC="cc" CFLAGS="-O2 -pipe -fstack-protector-strong -fno-strict-aliasing " CPP="cpp" CPPFLAGS="" LDFLAGS=" -lexecinfo -fstack-protector-strong " LIBS="" CXX="c++" CXXFLAGS="-O2 -pipe -fstack-protector-strong -fno-strict-aliasing " BSD_INSTALL_PROGRAM="install -s -m 555" BSD_INST
ALL_LIB="install -s -m 0644" BSD_INSTALL_SCRIPT="install -m 555" BSD_INSTALL_DATA="install -m 0644" BSD_INSTALL_MAN="install -m 444"
--End MAKE_ENV--
--PLIST_SUB--
CMAKE_BUILD_TYPE="release" PYTHON_INCLUDEDIR=include/python3.11 PYTHON_LIBDIR=lib/python3.11 PYTHON_PLATFORM=freebsd13 PYTHON_SITELIBDIR=lib/python3.11/site-packages PYTHON_SUFFIX=311 PYTHON_EXT_SUFFIX=.cpython-311 PYTHON_VER=3.11 PYTHON_VERSION=python3.11 PYTHON2="@comment " PYTHON3="" OSREL=13.4 PREFIX=%D LOCALBASE=/usr/local RESETPREFIX=/usr/local LIB32DIR=lib DOCSDIR="share/doc/parthenon" EXAMPLESDIR="share/examples/parthenon" DATADIR="share/parthenon" WWWDIR="www/parthenon" ETCDIR="etc/parthenon"
--End PLIST_SUB--
--SUB_LIST--
PYTHON_INCLUDEDIR=/usr/local/include/python3.11 PYTHON_LIBDIR=/usr/local/lib/python3.11 PYTHON_PLATFORM=freebsd13 PYTHON_SITELIBDIR=/usr/local/lib/python3.11/site-packages PYTHON_SUFFIX=311 PYTHON_EXT_SUFFIX=.cpython-311 PYTHON_VER=3.11 PYTHON_VERSION=python3.11 PYTHON2="@comment " PYTHON3="" PREFIX=/usr/local LOCALBASE=/usr/local DATADIR=/usr/local/share/parthenon DOCSDIR=/usr/local/share/doc/parthenon EXAMPLESDIR=/usr/local/share/examples/parthenon WWWDIR=/usr/local/www/parthenon ETCDIR=/usr/local/etc/parthenon
--End SUB_LIST--
---Begin make.conf---
USE_PACKAGE_DEPENDS=yes
BATCH=yes
WRKDIRPREFIX=/wrkdirs
PORTSDIR=/usr/ports
PACKAGES=/packages
DISTDIR=/distfiles
PACKAGE_BUILDING=yes
PACKAGE_BUILDING_FLAVORS=yes
MACHINE=i386
MACHINE_ARCH=i386
ARCH=${MACHINE_ARCH}
#### ####
# XXX: We really need this but cannot use it while 'make checksum' does not
# try the next mirror on checksum failure. It currently retries the same
# failed mirror and then fails rather then trying another. It *does*
# try the next if the size is mismatched though.
#MASTER_SITE_FREEBSD=yes
# Build ALLOW_MAKE_JOBS_PACKAGES with 3 jobs
MAKE_JOBS_NUMBER=3
#### Misc Poudriere ####
.include "/etc/make.conf.ports_env"
GID=0
UID=0
---End make.conf---
--Resource limits--
cpu time (seconds, -t) unlimited
file size (512-blocks, -f) unlimited
data seg size (kbytes, -d) 524288
stack size (kbytes, -s) 65536
core file size (512-blocks, -c) unlimited
max memory size (kbytes, -m) unlimited
locked memory (kbytes, -l) unlimited
max user processes (-u) 89999
open files (-n) 8192
virtual mem size (kbytes, -v) unlimited
swap limit (kbytes, -w) unlimited
socket buffer size (bytes, -b) unlimited
pseudo-terminals (-p) unlimited
kqueues (-k) unlimited
umtx shared locks (-o) unlimited
--End resource limits--
=======================<phase: check-sanity >============================
===== env: NO_DEPENDS=yes USER=root UID=0 GID=0
===> License BSD3CLAUSE accepted by the user
===========================================================================
=======================<phase: pkg-depends >============================
===== env: USE_PACKAGE_DEPENDS_ONLY=1 USER=root UID=0 GID=0
===> parthenon-24.08_2 depends on file: /usr/local/sbin/pkg - not found
===> Installing existing package /packages/All/pkg-2.0.5.pkg
[134i386-default-job-05] Installing pkg-2.0.5...
[134i386-default-job-05] Extracting pkg-2.0.5: .......... done
===> parthenon-24.08_2 depends on file: /usr/local/sbin/pkg - found
===> Returning to build of parthenon-24.08_2
===========================================================================
=======================<phase: fetch-depends >============================
===== env: USE_PACKAGE_DEPENDS_ONLY=1 USER=root UID=0 GID=0
===========================================================================
=======================<phase: fetch >============================
===== env: NO_DEPENDS=yes USER=root UID=0 GID=0
===> License BSD3CLAUSE accepted by the user
===> Fetching all distfiles required by parthenon-24.08_2 for building
===========================================================================
=======================<phase: checksum >============================
===== env: NO_DEPENDS=yes USER=root UID=0 GID=0
===> License BSD3CLAUSE accepted by the user
===> Fetching all distfiles required by parthenon-24.08_2 for building
=> SHA256 Checksum OK for parthenon-hpc-lab-parthenon-v24.08_GH0.tar.gz.
=> SHA256 Checksum OK for catchorg-Catch2-216713a_GH0.tar.gz.
===========================================================================
=======================<phase: extract-depends>============================
===== env: USE_PACKAGE_DEPENDS_ONLY=1 USER=root UID=0 GID=0
===========================================================================
=======================<phase: extract >============================
===== env: NO_DEPENDS=yes USER=root UID=0 GID=0
===> License BSD3CLAUSE accepted by the user
===> Fetching all distfiles required by parthenon-24.08_2 for building
===> Extracting for parthenon-24.08_2
=> SHA256 Checksum OK for parthenon-hpc-lab-parthenon-v24.08_GH0.tar.gz.
=> SHA256 Checksum OK for catchorg-Catch2-216713a_GH0.tar.gz.
===========================================================================
=======================<phase: patch-depends >============================
===== env: USE_PACKAGE_DEPENDS_ONLY=1 USER=root UID=0 GID=0
===========================================================================
=======================<phase: patch >============================
===== env: NO_DEPENDS=yes USER=root UID=0 GID=0
===> Patching for parthenon-24.08_2
===> Applying FreeBSD patches for parthenon-24.08_2 from /usr/ports/science/parthenon/files
===========================================================================
=======================<phase: build-depends >============================
===== env: USE_PACKAGE_DEPENDS_ONLY=1 USER=root UID=0 GID=0
===> parthenon-24.08_2 depends on file: /usr/local/bin/cmake - not found
===> Installing existing package /packages/All/cmake-core-3.31.5.pkg
[134i386-default-job-05] Installing cmake-core-3.31.5...
[134i386-default-job-05] `-- Installing expat-2.6.4...
[134i386-default-job-05] `-- Extracting expat-2.6.4: .......... done
[134i386-default-job-05] `-- Installing jsoncpp-1.9.6_1...
[134i386-default-job-05] `-- Extracting jsoncpp-1.9.6_1: .......... done
[134i386-default-job-05] `-- Installing libidn2-2.3.7...
[134i386-default-job-05] | `-- Installing indexinfo-0.3.1...
[134i386-default-job-05] | `-- Extracting indexinfo-0.3.1: .... done
[134i386-default-job-05] | `-- Installing libunistring-1.3...
[134i386-default-job-05] | `-- Extracting libunistring-1.3: .......... done
[134i386-default-job-05] `-- Extracting libidn2-2.3.7: .......... done
[134i386-default-job-05] `-- Installing libuv-1.50.0...
[134i386-default-job-05] `-- Extracting libuv-1.50.0: .......... done
<snip>
105 warnings generated.
[ 27% 21/70] /usr/bin/c++ -DFS_HEADER="<filesystem>" -DFS_NAMESPACE=std::filesystem -DH5_BUILT_AS_DYNAMIC_LIB -DKOKKOS_DEPENDENCE -DMPICH_SKIP_MPICXX -DOMPI_SKIP_MPICXX -D_MPICC_H -Dparthenon_EXPORTS -I/wrkdirs/usr/ports/science/parthenon/work/parthenon-24.08/src -I/wrkdirs/usr/ports/science/parthenon/work/.build/src/generated -isystem /usr/local/include -isystem /usr/local/include/ascent -isystem /usr/local/include/conduit -isystem /usr/local/include/json-c -isystem /usr/local/include/gcc13 -O2 -pipe -fstack-protector-strong -fno-strict-aliasing -O2 -pipe -fstack-protector-strong -fno-strict-aliasing -DNDEBUG -std=c++17 -fPIC -fopenmp=libomp -pthread -DCONDUIT_RELAY_IO_MPI_ENABLED -DCONDUIT_BLUEPRINT_MPI_ENABLED -MD -MT src/CMakeFiles/parthenon.dir/interface/swarm_comms.cpp.o -MF src/CMakeFiles/parthenon.dir/interface/swarm_comms.cpp.o.d -o src/CMakeFiles/parthenon.dir/interface/swarm_comms.cpp.o -c /wrkdirs/usr/ports/science/parthenon/work/parthenon-24.08/src/interface/
swarm_comms.cpp
/wrkdirs/usr/ports/science/parthenon/work/parthenon-24.08/src/interface/swarm_comms.cpp:159:13: warning: loop not vectorized: the optimizer was unable to perform the requested transformation; the transformation might be disabled or specified as part of an unsupported transformation ordering [-Wpass-failed=transform-warning]
159 | void Swarm::CountParticlesToSend_() {
| ^
1 warning generated.
[ 28% 22/70] /usr/bin/c++ -DFS_HEADER="<filesystem>" -DFS_NAMESPACE=std::filesystem -DH5_BUILT_AS_DYNAMIC_LIB -DKOKKOS_DEPENDENCE -DMPICH_SKIP_MPICXX -DOMPI_SKIP_MPICXX -D_MPICC_H -Dparthenon_EXPORTS -I/wrkdirs/usr/ports/science/parthenon/work/parthenon-24.08/src -I/wrkdirs/usr/ports/science/parthenon/work/.build/src/generated -isystem /usr/local/include -isystem /usr/local/include/ascent -isystem /usr/local/include/conduit -isystem /usr/local/include/json-c -isystem /usr/local/include/gcc13 -O2 -pipe -fstack-protector-strong -fno-strict-aliasing -O2 -pipe -fstack-protector-strong -fno-strict-aliasing -DNDEBUG -std=c++17 -fPIC -fopenmp=libomp -pthread -DCONDUIT_RELAY_IO_MPI_ENABLED -DCONDUIT_BLUEPRINT_MPI_ENABLED -MD -MT src/CMakeFiles/parthenon.dir/interface/swarm_container.cpp.o -MF src/CMakeFiles/parthenon.dir/interface/swarm_container.cpp.o.d -o src/CMakeFiles/parthenon.dir/interface/swarm_container.cpp.o -c /wrkdirs/usr/ports/science/parthenon/work/parthenon-24.08/sr
c/interface/swarm_container.cpp
[ 30% 23/70] /usr/bin/c++ -DFS_HEADER="<filesystem>" -DFS_NAMESPACE=std::filesystem -DH5_BUILT_AS_DYNAMIC_LIB -DKOKKOS_DEPENDENCE -DMPICH_SKIP_MPICXX -DOMPI_SKIP_MPICXX -D_MPICC_H -Dparthenon_EXPORTS -I/wrkdirs/usr/ports/science/parthenon/work/parthenon-24.08/src -I/wrkdirs/usr/ports/science/parthenon/work/.build/src/generated -isystem /usr/local/include -isystem /usr/local/include/ascent -isystem /usr/local/include/conduit -isystem /usr/local/include/json-c -isystem /usr/local/include/gcc13 -O2 -pipe -fstack-protector-strong -fno-strict-aliasing -O2 -pipe -fstack-protector-strong -fno-strict-aliasing -DNDEBUG -std=c++17 -fPIC -fopenmp=libomp -pthread -DCONDUIT_RELAY_IO_MPI_ENABLED -DCONDUIT_BLUEPRINT_MPI_ENABLED -MD -MT src/CMakeFiles/parthenon.dir/interface/swarm.cpp.o -MF src/CMakeFiles/parthenon.dir/interface/swarm.cpp.o.d -o src/CMakeFiles/parthenon.dir/interface/swarm.cpp.o -c /wrkdirs/usr/ports/science/parthenon/work/parthenon-24.08/src/interface/swarm.cpp
/wrkdirs/usr/ports/science/parthenon/work/parthenon-24.08/src/interface/swarm.cpp:285:13: warning: loop not vectorized: the optimizer was unable to perform the requested transformation; the transformation might be disabled or specified as part of an unsupported transformation ordering [-Wpass-failed=transform-warning]
285 | void Swarm::UpdateEmptyIndices() {
| ^
In file included from /wrkdirs/usr/ports/science/parthenon/work/parthenon-24.08/src/interface/swarm.cpp:20:
In file included from /wrkdirs/usr/ports/science/parthenon/work/parthenon-24.08/src/mesh/mesh.hpp:37:
In file included from /wrkdirs/usr/ports/science/parthenon/work/parthenon-24.08/src/application_input.hpp:22:
In file included from /wrkdirs/usr/ports/science/parthenon/work/parthenon-24.08/src/bvals/boundary_conditions.hpp:22:
In file included from /wrkdirs/usr/ports/science/parthenon/work/parthenon-24.08/src/interface/meshblock_data.hpp:27:
In file included from /wrkdirs/usr/ports/science/parthenon/work/parthenon-24.08/src/interface/sparse_pack_base.hpp:29:
In file included from /wrkdirs/usr/ports/science/parthenon/work/parthenon-24.08/src/coordinates/coordinates.hpp:18:
In file included from /wrkdirs/usr/ports/science/parthenon/work/parthenon-24.08/src/coordinates/uniform_cartesian.hpp:20:
In file included from /wrkdirs/usr/ports/science/parthenon/work/parthenon-24.08/src/defs.hpp:30:
In file included from /wrkdirs/usr/ports/science/parthenon/work/parthenon-24.08/src/parthenon_arrays.hpp:30:
/wrkdirs/usr/ports/science/parthenon/work/parthenon-24.08/src/kokkos_abstraction.hpp:684:13: warning: loop not vectorized: the optimizer was unable to perform the requested transformation; the transformation might be disabled or specified as part of an unsupported transformation ordering [-Wpass-failed=transform-warning]
684 | inline void par_dispatch(const std::string &name, Args &&...args) {
| ^
/wrkdirs/usr/ports/science/parthenon/work/parthenon-24.08/src/kokkos_abstraction.hpp:684:13: warning: loop not vectorized: the optimizer was unable to perform the requested transformation; the transformation might be disabled or specified as part of an unsupported transformation ordering [-Wpass-failed=transform-warning]
/wrkdirs/usr/ports/science/parthenon/work/parthenon-24.08/src/kokkos_abstraction.hpp:684:13: warning: loop not vectorized: the optimizer was unable to perform the requested transformation; the transformation might be disabled or specified as part of an unsupported transformation ordering [-Wpass-failed=transform-warning]
/wrkdirs/usr/ports/science/parthenon/work/parthenon-24.08/src/kokkos_abstraction.hpp:684:13: warning: loop not vectorized: the optimizer was unable to perform the requested transformation; the transformation might be disabled or specified as part of an unsupported transformation ordering [-Wpass-failed=transform-warning]
/wrkdirs/usr/ports/science/parthenon/work/parthenon-24.08/src/kokkos_abstraction.hpp:684:13: warning: loop not vectorized: the optimizer was unable to perform the requested transformation; the transformation might be disabled or specified as part of an unsupported transformation ordering [-Wpass-failed=transform-warning]
/wrkdirs/usr/ports/science/parthenon/work/parthenon-24.08/src/kokkos_abstraction.hpp:684:13: warning: loop not vectorized: the optimizer was unable to perform the requested transformation; the transformation might be disabled or specified as part of an unsupported transformation ordering [-Wpass-failed=transform-warning]
/wrkdirs/usr/ports/science/parthenon/work/parthenon-24.08/src/kokkos_abstraction.hpp:684:13: warning: loop not vectorized: the optimizer was unable to perform the requested transformation; the transformation might be disabled or specified as part of an unsupported transformation ordering [-Wpass-failed=transform-warning]
/wrkdirs/usr/ports/science/parthenon/work/parthenon-24.08/src/kokkos_abstraction.hpp:684:13: warning: loop not vectorized: the optimizer was unable to perform the requested transformation; the transformation might be disabled or specified as part of an unsupported transformation ordering [-Wpass-failed=transform-warning]
/wrkdirs/usr/ports/science/parthenon/work/parthenon-24.08/src/kokkos_abstraction.hpp:684:13: warning: loop not vectorized: the optimizer was unable to perform the requested transformation; the transformation might be disabled or specified as part of an unsupported transformation ordering [-Wpass-failed=transform-warning]
/wrkdirs/usr/ports/science/parthenon/work/parthenon-24.08/src/kokkos_abstraction.hpp:684:13: warning: loop not vectorized: the optimizer was unable to perform the requested transformation; the transformation might be disabled or specified as part of an unsupported transformation ordering [-Wpass-failed=transform-warning]
/wrkdirs/usr/ports/science/parthenon/work/parthenon-24.08/src/kokkos_abstraction.hpp:684:13: warning: loop not vectorized: the optimizer was unable to perform the requested transformation; the transformation might be disabled or specified as part of an unsupported transformation ordering [-Wpass-failed=transform-warning]
/wrkdirs/usr/ports/science/parthenon/work/parthenon-24.08/src/kokkos_abstraction.hpp:684:13: warning: loop not vectorized: the optimizer was unable to perform the requested transformation; the transformation might be disabled or specified as part of an unsupported transformation ordering [-Wpass-failed=transform-warning]
/wrkdirs/usr/ports/science/parthenon/work/parthenon-24.08/src/kokkos_abstraction.hpp:684:13: warning: loop not vectorized: the optimizer was unable to perform the requested transformation; the transformation might be disabled or specified as part of an unsupported transformation ordering [-Wpass-failed=transform-warning]
/wrkdirs/usr/ports/science/parthenon/work/parthenon-24.08/src/kokkos_abstraction.hpp:684:13: warning: loop not vectorized: the optimizer was unable to perform the requested transformation; the transformation might be disabled or specified as part of an unsupported transformation ordering [-Wpass-failed=transform-warning]
/wrkdirs/usr/ports/science/parthenon/work/parthenon-24.08/src/kokkos_abstraction.hpp:684:13: warning: loop not vectorized: the optimizer was unable to perform the requested transformation; the transformation might be disabled or specified as part of an unsupported transformation ordering [-Wpass-failed=transform-warning]
/wrkdirs/usr/ports/science/parthenon/work/parthenon-24.08/src/kokkos_abstraction.hpp:684:13: warning: loop not vectorized: the optimizer was unable to perform the requested transformation; the transformation might be disabled or specified as part of an unsupported transformation ordering [-Wpass-failed=transform-warning]
/wrkdirs/usr/ports/science/parthenon/work/parthenon-24.08/src/kokkos_abstraction.hpp:684:13: warning: loop not vectorized: the optimizer was unable to perform the requested transformation; the transformation might be disabled or specified as part of an unsupported transformation ordering [-Wpass-failed=transform-warning]
/wrkdirs/usr/ports/science/parthenon/work/parthenon-24.08/src/kokkos_abstraction.hpp:684:13: warning: loop not vectorized: the optimizer was unable to perform the requested transformation; the transformation might be disabled or specified as part of an unsupported transformation ordering [-Wpass-failed=transform-warning]
/wrkdirs/usr/ports/science/parthenon/work/parthenon-24.08/src/kokkos_abstraction.hpp:684:13: warning: loop not vectorized: the optimizer was unable to perform the requested transformation; the transformation might be disabled or specified as part of an unsupported transformation ordering [-Wpass-failed=transform-warning]
/wrkdirs/usr/ports/science/parthenon/work/parthenon-24.08/src/kokkos_abstraction.hpp:684:13: warning: loop not vectorized: the optimizer was unable to perform the requested transformation; the transformation might be disabled or specified as part of an unsupported transformation ordering [-Wpass-failed=transform-warning]
/wrkdirs/usr/ports/science/parthenon/work/parthenon-24.08/src/kokkos_abstraction.hpp:684:13: warning: loop not vectorized: the optimizer was unable to perform the requested transformation; the transformation might be disabled or specified as part of an unsupported transformation ordering [-Wpass-failed=transform-warning]
/wrkdirs/usr/ports/science/parthenon/work/parthenon-24.08/src/kokkos_abstraction.hpp:684:13: warning: loop not vectorized: the optimizer was unable to perform the requested transformation; the transformation might be disabled or specified as part of an unsupported transformation ordering [-Wpass-failed=transform-warning]
/wrkdirs/usr/ports/science/parthenon/work/parthenon-24.08/src/kokkos_abstraction.hpp:684:13: warning: loop not vectorized: the optimizer was unable to perform the requested transformation; the transformation might be disabled or specified as part of an unsupported transformation ordering [-Wpass-failed=transform-warning]
/wrkdirs/usr/ports/science/parthenon/work/parthenon-24.08/src/kokkos_abstraction.hpp:684:13: warning: loop not vectorized: the optimizer was unable to perform the requested transformation; the transformation might be disabled or specified as part of an unsupported transformation ordering [-Wpass-failed=transform-warning]
/wrkdirs/usr/ports/science/parthenon/work/parthenon-24.08/src/kokkos_abstraction.hpp:684:13: warning: loop not vectorized: the optimizer was unable to perform the requested transformation; the transformation might be disabled or specified as part of an unsupported transformation ordering [-Wpass-failed=transform-warning]
/wrkdirs/usr/ports/science/parthenon/work/parthenon-24.08/src/kokkos_abstraction.hpp:684:13: warning: loop not vectorized: the optimizer was unable to perform the requested transformation; the transformation might be disabled or specified as part of an unsupported transformation ordering [-Wpass-failed=transform-warning]
/wrkdirs/usr/ports/science/parthenon/work/parthenon-24.08/src/kokkos_abstraction.hpp:684:13: warning: loop not vectorized: the optimizer was unable to perform the requested transformation; the transformation might be disabled or specified as part of an unsupported transformation ordering [-Wpass-failed=transform-warning]
/wrkdirs/usr/ports/science/parthenon/work/parthenon-24.08/src/kokkos_abstraction.hpp:684:13: warning: loop not vectorized: the optimizer was unable to perform the requested transformation; the transformation might be disabled or specified as part of an unsupported transformation ordering [-Wpass-failed=transform-warning]
/wrkdirs/usr/ports/science/parthenon/work/parthenon-24.08/src/kokkos_abstraction.hpp:684:13: warning: loop not vectorized: the optimizer was unable to perform the requested transformation; the transformation might be disabled or specified as part of an unsupported transformation ordering [-Wpass-failed=transform-warning]
/wrkdirs/usr/ports/science/parthenon/work/parthenon-24.08/src/kokkos_abstraction.hpp:684:13: warning: loop not vectorized: the optimizer was unable to perform the requested transformation; the transformation might be disabled or specified as part of an unsupported transformation ordering [-Wpass-failed=transform-warning]
/wrkdirs/usr/ports/science/parthenon/work/parthenon-24.08/src/kokkos_abstraction.hpp:684:13: warning: loop not vectorized: the optimizer was unable to perform the requested transformation; the transformation might be disabled or specified as part of an unsupported transformation ordering [-Wpass-failed=transform-warning]
/wrkdirs/usr/ports/science/parthenon/work/parthenon-24.08/src/kokkos_abstraction.hpp:684:13: warning: loop not vectorized: the optimizer was unable to perform the requested transformation; the transformation might be disabled or specified as part of an unsupported transformation ordering [-Wpass-failed=transform-warning]
/wrkdirs/usr/ports/science/parthenon/work/parthenon-24.08/src/kokkos_abstraction.hpp:684:13: warning: loop not vectorized: the optimizer was unable to perform the requested transformation; the transformation might be disabled or specified as part of an unsupported transformation ordering [-Wpass-failed=transform-warning]
/wrkdirs/usr/ports/science/parthenon/work/parthenon-24.08/src/kokkos_abstraction.hpp:684:13: warning: loop not vectorized: the optimizer was unable to perform the requested transformation; the transformation might be disabled or specified as part of an unsupported transformation ordering [-Wpass-failed=transform-warning]
/wrkdirs/usr/ports/science/parthenon/work/parthenon-24.08/src/kokkos_abstraction.hpp:684:13: warning: loop not vectorized: the optimizer was unable to perform the requested transformation; the transformation might be disabled or specified as part of an unsupported transformation ordering [-Wpass-failed=transform-warning]
/wrkdirs/usr/ports/science/parthenon/work/parthenon-24.08/src/kokkos_abstraction.hpp:684:13: warning: loop not vectorized: the optimizer was unable to perform the requested transformation; the transformation might be disabled or specified as part of an unsupported transformation ordering [-Wpass-failed=transform-warning]
/wrkdirs/usr/ports/science/parthenon/work/parthenon-24.08/src/kokkos_abstraction.hpp:684:13: warning: loop not vectorized: the optimizer was unable to perform the requested transformation; the transformation might be disabled or specified as part of an unsupported transformation ordering [-Wpass-failed=transform-warning]
/wrkdirs/usr/ports/science/parthenon/work/parthenon-24.08/src/kokkos_abstraction.hpp:684:13: warning: loop not vectorized: the optimizer was unable to perform the requested transformation; the transformation might be disabled or specified as part of an unsupported transformation ordering [-Wpass-failed=transform-warning]
/wrkdirs/usr/ports/science/parthenon/work/parthenon-24.08/src/kokkos_abstraction.hpp:684:13: warning: loop not vectorized: the optimizer was unable to perform the requested transformation; the transformation might be disabled or specified as part of an unsupported transformation ordering [-Wpass-failed=transform-warning]
/wrkdirs/usr/ports/science/parthenon/work/parthenon-24.08/src/kokkos_abstraction.hpp:684:13: warning: loop not vectorized: the optimizer was unable to perform the requested transformation; the transformation might be disabled or specified as part of an unsupported transformation ordering [-Wpass-failed=transform-warning]
/wrkdirs/usr/ports/science/parthenon/work/parthenon-24.08/src/kokkos_abstraction.hpp:684:13: warning: loop not vectorized: the optimizer was unable to perform the requested transformation; the transformation might be disabled or specified as part of an unsupported transformation ordering [-Wpass-failed=transform-warning]
/wrkdirs/usr/ports/science/parthenon/work/parthenon-24.08/src/kokkos_abstraction.hpp:684:13: warning: loop not vectorized: the optimizer was unable to perform the requested transformation; the transformation might be disabled or specified as part of an unsupported transformation ordering [-Wpass-failed=transform-warning]
/wrkdirs/usr/ports/science/parthenon/work/parthenon-24.08/src/kokkos_abstraction.hpp:684:13: warning: loop not vectorized: the optimizer was unable to perform the requested transformation; the transformation might be disabled or specified as part of an unsupported transformation ordering [-Wpass-failed=transform-warning]
/wrkdirs/usr/ports/science/parthenon/work/parthenon-24.08/src/kokkos_abstraction.hpp:684:13: warning: loop not vectorized: the optimizer was unable to perform the requested transformation; the transformation might be disabled or specified as part of an unsupported transformation ordering [-Wpass-failed=transform-warning]
/wrkdirs/usr/ports/science/parthenon/work/parthenon-24.08/src/kokkos_abstraction.hpp:684:13: warning: loop not vectorized: the optimizer was unable to perform the requested transformation; the transformation might be disabled or specified as part of an unsupported transformation ordering [-Wpass-failed=transform-warning]
/wrkdirs/usr/ports/science/parthenon/work/parthenon-24.08/src/kokkos_abstraction.hpp:684:13: warning: loop not vectorized: the optimizer was unable to perform the requested transformation; the transformation might be disabled or specified as part of an unsupported transformation ordering [-Wpass-failed=transform-warning]
/wrkdirs/usr/ports/science/parthenon/work/parthenon-24.08/src/kokkos_abstraction.hpp:684:13: warning: loop not vectorized: the optimizer was unable to perform the requested transformation; the transformation might be disabled or specified as part of an unsupported transformation ordering [-Wpass-failed=transform-warning]
/wrkdirs/usr/ports/science/parthenon/work/parthenon-24.08/src/kokkos_abstraction.hpp:684:13: warning: loop not vectorized: the optimizer was unable to perform the requested transformation; the transformation might be disabled or specified as part of an unsupported transformation ordering [-Wpass-failed=transform-warning]
/wrkdirs/usr/ports/science/parthenon/work/parthenon-24.08/src/kokkos_abstraction.hpp:684:13: warning: loop not vectorized: the optimizer was unable to perform the requested transformation; the transformation might be disabled or specified as part of an unsupported transformation ordering [-Wpass-failed=transform-warning]
/wrkdirs/usr/ports/science/parthenon/work/parthenon-24.08/src/kokkos_abstraction.hpp:684:13: warning: loop not vectorized: the optimizer was unable to perform the requested transformation; the transformation might be disabled or specified as part of an unsupported transformation ordering [-Wpass-failed=transform-warning]
/wrkdirs/usr/ports/science/parthenon/work/parthenon-24.08/src/kokkos_abstraction.hpp:684:13: warning: loop not vectorized: the optimizer was unable to perform the requested transformation; the transformation might be disabled or specified as part of an unsupported transformation ordering [-Wpass-failed=transform-warning]
/wrkdirs/usr/ports/science/parthenon/work/parthenon-24.08/src/kokkos_abstraction.hpp:684:13: warning: loop not vectorized: the optimizer was unable to perform the requested transformation; the transformation might be disabled or specified as part of an unsupported transformation ordering [-Wpass-failed=transform-warning]
/wrkdirs/usr/ports/science/parthenon/work/parthenon-24.08/src/kokkos_abstraction.hpp:684:13: warning: loop not vectorized: the optimizer was unable to perform the requested transformation; the transformation might be disabled or specified as part of an unsupported transformation ordering [-Wpass-failed=transform-warning]
/wrkdirs/usr/ports/science/parthenon/work/parthenon-24.08/src/kokkos_abstraction.hpp:684:13: warning: loop not vectorized: the optimizer was unable to perform the requested transformation; the transformation might be disabled or specified as part of an unsupported transformation ordering [-Wpass-failed=transform-warning]
/wrkdirs/usr/ports/science/parthenon/work/parthenon-24.08/src/kokkos_abstraction.hpp:684:13: warning: loop not vectorized: the optimizer was unable to perform the requested transformation; the transformation might be disabled or specified as part of an unsupported transformation ordering [-Wpass-failed=transform-warning]
/wrkdirs/usr/ports/science/parthenon/work/parthenon-24.08/src/kokkos_abstraction.hpp:684:13: warning: loop not vectorized: the optimizer was unable to perform the requested transformation; the transformation might be disabled or specified as part of an unsupported transformation ordering [-Wpass-failed=transform-warning]
/wrkdirs/usr/ports/science/parthenon/work/parthenon-24.08/src/kokkos_abstraction.hpp:684:13: warning: loop not vectorized: the optimizer was unable to perform the requested transformation; the transformation might be disabled or specified as part of an unsupported transformation ordering [-Wpass-failed=transform-warning]
/wrkdirs/usr/ports/science/parthenon/work/parthenon-24.08/src/kokkos_abstraction.hpp:684:13: warning: loop not vectorized: the optimizer was unable to perform the requested transformation; the transformation might be disabled or specified as part of an unsupported transformation ordering [-Wpass-failed=transform-warning]
/wrkdirs/usr/ports/science/parthenon/work/parthenon-24.08/src/kokkos_abstraction.hpp:684:13: warning: loop not vectorized: the optimizer was unable to perform the requested transformation; the transformation might be disabled or specified as part of an unsupported transformation ordering [-Wpass-failed=transform-warning]
/wrkdirs/usr/ports/science/parthenon/work/parthenon-24.08/src/kokkos_abstraction.hpp:684:13: warning: loop not vectorized: the optimizer was unable to perform the requested transformation; the transformation might be disabled or specified as part of an unsupported transformation ordering [-Wpass-failed=transform-warning]
/wrkdirs/usr/ports/science/parthenon/work/parthenon-24.08/src/kokkos_abstraction.hpp:684:13: warning: loop not vectorized: the optimizer was unable to perform the requested transformation; the transformation might be disabled or specified as part of an unsupported transformation ordering [-Wpass-failed=transform-warning]
/wrkdirs/usr/ports/science/parthenon/work/parthenon-24.08/src/kokkos_abstraction.hpp:684:13: warning: loop not vectorized: the optimizer was unable to perform the requested transformation; the transformation might be disabled or specified as part of an unsupported transformation ordering [-Wpass-failed=transform-warning]
/wrkdirs/usr/ports/science/parthenon/work/parthenon-24.08/src/kokkos_abstraction.hpp:684:13: warning: loop not vectorized: the optimizer was unable to perform the requested transformation; the transformation might be disabled or specified as part of an unsupported transformation ordering [-Wpass-failed=transform-warning]
/wrkdirs/usr/ports/science/parthenon/work/parthenon-24.08/src/kokkos_abstraction.hpp:684:13: warning: loop not vectorized: the optimizer was unable to perform the requested transformation; the transformation might be disabled or specified as part of an unsupported transformation ordering [-Wpass-failed=transform-warning]
/wrkdirs/usr/ports/science/parthenon/work/parthenon-24.08/src/kokkos_abstraction.hpp:684:13: warning: loop not vectorized: the optimizer was unable to perform the requested transformation; the transformation might be disabled or specified as part of an unsupported transformation ordering [-Wpass-failed=transform-warning]
/wrkdirs/usr/ports/science/parthenon/work/parthenon-24.08/src/kokkos_abstraction.hpp:684:13: warning: loop not vectorized: the optimizer was unable to perform the requested transformation; the transformation might be disabled or specified as part of an unsupported transformation ordering [-Wpass-failed=transform-warning]
/wrkdirs/usr/ports/science/parthenon/work/parthenon-24.08/src/kokkos_abstraction.hpp:684:13: warning: loop not vectorized: the optimizer was unable to perform the requested transformation; the transformation might be disabled or specified as part of an unsupported transformation ordering [-Wpass-failed=transform-warning]
/wrkdirs/usr/ports/science/parthenon/work/parthenon-24.08/src/kokkos_abstraction.hpp:684:13: warning: loop not vectorized: the optimizer was unable to perform the requested transformation; the transformation might be disabled or specified as part of an unsupported transformation ordering [-Wpass-failed=transform-warning]
/wrkdirs/usr/ports/science/parthenon/work/parthenon-24.08/src/kokkos_abstraction.hpp:684:13: warning: loop not vectorized: the optimizer was unable to perform the requested transformation; the transformation might be disabled or specified as part of an unsupported transformation ordering [-Wpass-failed=transform-warning]
/wrkdirs/usr/ports/science/parthenon/work/parthenon-24.08/src/kokkos_abstraction.hpp:684:13: warning: loop not vectorized: the optimizer was unable to perform the requested transformation; the transformation might be disabled or specified as part of an unsupported transformation ordering [-Wpass-failed=transform-warning]
/wrkdirs/usr/ports/science/parthenon/work/parthenon-24.08/src/kokkos_abstraction.hpp:684:13: warning: loop not vectorized: the optimizer was unable to perform the requested transformation; the transformation might be disabled or specified as part of an unsupported transformation ordering [-Wpass-failed=transform-warning]
/wrkdirs/usr/ports/science/parthenon/work/parthenon-24.08/src/kokkos_abstraction.hpp:684:13: warning: loop not vectorized: the optimizer was unable to perform the requested transformation; the transformation might be disabled or specified as part of an unsupported transformation ordering [-Wpass-failed=transform-warning]
/wrkdirs/usr/ports/science/parthenon/work/parthenon-24.08/src/kokkos_abstraction.hpp:684:13: warning: loop not vectorized: the optimizer was unable to perform the requested transformation; the transformation might be disabled or specified as part of an unsupported transformation ordering [-Wpass-failed=transform-warning]
/wrkdirs/usr/ports/science/parthenon/work/parthenon-24.08/src/kokkos_abstraction.hpp:684:13: warning: loop not vectorized: the optimizer was unable to perform the requested transformation; the transformation might be disabled or specified as part of an unsupported transformation ordering [-Wpass-failed=transform-warning]
/wrkdirs/usr/ports/science/parthenon/work/parthenon-24.08/src/kokkos_abstraction.hpp:684:13: warning: loop not vectorized: the optimizer was unable to perform the requested transformation; the transformation might be disabled or specified as part of an unsupported transformation ordering [-Wpass-failed=transform-warning]
/wrkdirs/usr/ports/science/parthenon/work/parthenon-24.08/src/kokkos_abstraction.hpp:684:13: warning: loop not vectorized: the optimizer was unable to perform the requested transformation; the transformation might be disabled or specified as part of an unsupported transformation ordering [-Wpass-failed=transform-warning]
/wrkdirs/usr/ports/science/parthenon/work/parthenon-24.08/src/kokkos_abstraction.hpp:684:13: warning: loop not vectorized: the optimizer was unable to perform the requested transformation; the transformation might be disabled or specified as part of an unsupported transformation ordering [-Wpass-failed=transform-warning]
/wrkdirs/usr/ports/science/parthenon/work/parthenon-24.08/src/kokkos_abstraction.hpp:684:13: warning: loop not vectorized: the optimizer was unable to perform the requested transformation; the transformation might be disabled or specified as part of an unsupported transformation ordering [-Wpass-failed=transform-warning]
/wrkdirs/usr/ports/science/parthenon/work/parthenon-24.08/src/kokkos_abstraction.hpp:684:13: warning: loop not vectorized: the optimizer was unable to perform the requested transformation; the transformation might be disabled or specified as part of an unsupported transformation ordering [-Wpass-failed=transform-warning]
/wrkdirs/usr/ports/science/parthenon/work/parthenon-24.08/src/kokkos_abstraction.hpp:684:13: warning: loop not vectorized: the optimizer was unable to perform the requested transformation; the transformation might be disabled or specified as part of an unsupported transformation ordering [-Wpass-failed=transform-warning]
/wrkdirs/usr/ports/science/parthenon/work/parthenon-24.08/src/kokkos_abstraction.hpp:684:13: warning: loop not vectorized: the optimizer was unable to perform the requested transformation; the transformation might be disabled or specified as part of an unsupported transformation ordering [-Wpass-failed=transform-warning]
/wrkdirs/usr/ports/science/parthenon/work/parthenon-24.08/src/kokkos_abstraction.hpp:684:13: warning: loop not vectorized: the optimizer was unable to perform the requested transformation; the transformation might be disabled or specified as part of an unsupported transformation ordering [-Wpass-failed=transform-warning]
/wrkdirs/usr/ports/science/parthenon/work/parthenon-24.08/src/kokkos_abstraction.hpp:684:13: warning: loop not vectorized: the optimizer was unable to perform the requested transformation; the transformation might be disabled or specified as part of an unsupported transformation ordering [-Wpass-failed=transform-warning]
/wrkdirs/usr/ports/science/parthenon/work/parthenon-24.08/src/kokkos_abstraction.hpp:684:13: warning: loop not vectorized: the optimizer was unable to perform the requested transformation; the transformation might be disabled or specified as part of an unsupported transformation ordering [-Wpass-failed=transform-warning]
/wrkdirs/usr/ports/science/parthenon/work/parthenon-24.08/src/kokkos_abstraction.hpp:684:13: warning: loop not vectorized: the optimizer was unable to perform the requested transformation; the transformation might be disabled or specified as part of an unsupported transformation ordering [-Wpass-failed=transform-warning]
/wrkdirs/usr/ports/science/parthenon/work/parthenon-24.08/src/kokkos_abstraction.hpp:684:13: warning: loop not vectorized: the optimizer was unable to perform the requested transformation; the transformation might be disabled or specified as part of an unsupported transformation ordering [-Wpass-failed=transform-warning]
/wrkdirs/usr/ports/science/parthenon/work/parthenon-24.08/src/kokkos_abstraction.hpp:684:13: warning: loop not vectorized: the optimizer was unable to perform the requested transformation; the transformation might be disabled or specified as part of an unsupported transformation ordering [-Wpass-failed=transform-warning]
/wrkdirs/usr/ports/science/parthenon/work/parthenon-24.08/src/kokkos_abstraction.hpp:684:13: warning: loop not vectorized: the optimizer was unable to perform the requested transformation; the transformation might be disabled or specified as part of an unsupported transformation ordering [-Wpass-failed=transform-warning]
/wrkdirs/usr/ports/science/parthenon/work/parthenon-24.08/src/kokkos_abstraction.hpp:684:13: warning: loop not vectorized: the optimizer was unable to perform the requested transformation; the transformation might be disabled or specified as part of an unsupported transformation ordering [-Wpass-failed=transform-warning]
/wrkdirs/usr/ports/science/parthenon/work/parthenon-24.08/src/kokkos_abstraction.hpp:684:13: warning: loop not vectorized: the optimizer was unable to perform the requested transformation; the transformation might be disabled or specified as part of an unsupported transformation ordering [-Wpass-failed=transform-warning]
/wrkdirs/usr/ports/science/parthenon/work/parthenon-24.08/src/kokkos_abstraction.hpp:684:13: warning: loop not vectorized: the optimizer was unable to perform the requested transformation; the transformation might be disabled or specified as part of an unsupported transformation ordering [-Wpass-failed=transform-warning]
/wrkdirs/usr/ports/science/parthenon/work/parthenon-24.08/src/kokkos_abstraction.hpp:684:13: warning: loop not vectorized: the optimizer was unable to perform the requested transformation; the transformation might be disabled or specified as part of an unsupported transformation ordering [-Wpass-failed=transform-warning]
/wrkdirs/usr/ports/science/parthenon/work/parthenon-24.08/src/kokkos_abstraction.hpp:684:13: warning: loop not vectorized: the optimizer was unable to perform the requested transformation; the transformation might be disabled or specified as part of an unsupported transformation ordering [-Wpass-failed=transform-warning]
/wrkdirs/usr/ports/science/parthenon/work/parthenon-24.08/src/kokkos_abstraction.hpp:684:13: warning: loop not vectorized: the optimizer was unable to perform the requested transformation; the transformation might be disabled or specified as part of an unsupported transformation ordering [-Wpass-failed=transform-warning]
/wrkdirs/usr/ports/science/parthenon/work/parthenon-24.08/src/kokkos_abstraction.hpp:684:13: warning: loop not vectorized: the optimizer was unable to perform the requested transformation; the transformation might be disabled or specified as part of an unsupported transformation ordering [-Wpass-failed=transform-warning]
/wrkdirs/usr/ports/science/parthenon/work/parthenon-24.08/src/kokkos_abstraction.hpp:684:13: warning: loop not vectorized: the optimizer was unable to perform the requested transformation; the transformation might be disabled or specified as part of an unsupported transformation ordering [-Wpass-failed=transform-warning]
/wrkdirs/usr/ports/science/parthenon/work/parthenon-24.08/src/kokkos_abstraction.hpp:684:13: warning: loop not vectorized: the optimizer was unable to perform the requested transformation; the transformation might be disabled or specified as part of an unsupported transformation ordering [-Wpass-failed=transform-warning]
/wrkdirs/usr/ports/science/parthenon/work/parthenon-24.08/src/kokkos_abstraction.hpp:684:13: warning: loop not vectorized: the optimizer was unable to perform the requested transformation; the transformation might be disabled or specified as part of an unsupported transformation ordering [-Wpass-failed=transform-warning]
/wrkdirs/usr/ports/science/parthenon/work/parthenon-24.08/src/kokkos_abstraction.hpp:684:13: warning: loop not vectorized: the optimizer was unable to perform the requested transformation; the transformation might be disabled or specified as part of an unsupported transformation ordering [-Wpass-failed=transform-warning]
/wrkdirs/usr/ports/science/parthenon/work/parthenon-24.08/src/kokkos_abstraction.hpp:684:13: warning: loop not vectorized: the optimizer was unable to perform the requested transformation; the transformation might be disabled or specified as part of an unsupported transformation ordering [-Wpass-failed=transform-warning]
/wrkdirs/usr/ports/science/parthenon/work/parthenon-24.08/src/kokkos_abstraction.hpp:684:13: warning: loop not vectorized: the optimizer was unable to perform the requested transformation; the transformation might be disabled or specified as part of an unsupported transformation ordering [-Wpass-failed=transform-warning]
/wrkdirs/usr/ports/science/parthenon/work/parthenon-24.08/src/kokkos_abstraction.hpp:684:13: warning: loop not vectorized: the optimizer was unable to perform the requested transformation; the transformation might be disabled or specified as part of an unsupported transformation ordering [-Wpass-failed=transform-warning]
/wrkdirs/usr/ports/science/parthenon/work/parthenon-24.08/src/kokkos_abstraction.hpp:684:13: warning: loop not vectorized: the optimizer was unable to perform the requested transformation; the transformation might be disabled or specified as part of an unsupported transformation ordering [-Wpass-failed=transform-warning]
/wrkdirs/usr/ports/science/parthenon/work/parthenon-24.08/src/kokkos_abstraction.hpp:684:13: warning: loop not vectorized: the optimizer was unable to perform the requested transformation; the transformation might be disabled or specified as part of an unsupported transformation ordering [-Wpass-failed=transform-warning]
/wrkdirs/usr/ports/science/parthenon/work/parthenon-24.08/src/kokkos_abstraction.hpp:684:13: warning: loop not vectorized: the optimizer was unable to perform the requested transformation; the transformation might be disabled or specified as part of an unsupported transformation ordering [-Wpass-failed=transform-warning]
/wrkdirs/usr/ports/science/parthenon/work/parthenon-24.08/src/interface/swarm.cpp:344:13: warning: loop not vectorized: the optimizer was unable to perform the requested transformation; the transformation might be disabled or specified as part of an unsupported transformation ordering [-Wpass-failed=transform-warning]
344 | void Swarm::Defrag() {
| ^
/wrkdirs/usr/ports/science/parthenon/work/parthenon-24.08/src/interface/swarm.cpp:344:13: warning: loop not vectorized: the optimizer was unable to perform the requested transformation; the transformation might be disabled or specified as part of an unsupported transformation ordering [-Wpass-failed=transform-warning]
/wrkdirs/usr/ports/science/parthenon/work/parthenon-24.08/src/interface/swarm.cpp:431:13: warning: loop not vectorized: the optimizer was unable to perform the requested transformation; the transformation might be disabled or specified as part of an unsupported transformation ordering [-Wpass-failed=transform-warning]
431 | void Swarm::SortParticlesByCell() {
| ^
109 warnings generated.
[ 31% 24/70] /usr/bin/c++ -DFS_HEADER="<filesystem>" -DFS_NAMESPACE=std::filesystem -DH5_BUILT_AS_DYNAMIC_LIB -DKOKKOS_DEPENDENCE -DMPICH_SKIP_MPICXX -DOMPI_SKIP_MPICXX -D_MPICC_H -Dparthenon_EXPORTS -I/wrkdirs/usr/ports/science/parthenon/work/parthenon-24.08/src -I/wrkdirs/usr/ports/science/parthenon/work/.build/src/generated -isystem /usr/local/include -isystem /usr/local/include/ascent -isystem /usr/local/include/conduit -isystem /usr/local/include/json-c -isystem /usr/local/include/gcc13 -O2 -pipe -fstack-protector-strong -fno-strict-aliasing -O2 -pipe -fstack-protector-strong -fno-strict-aliasing -DNDEBUG -std=c++17 -fPIC -fopenmp=libomp -pthread -DCONDUIT_RELAY_IO_MPI_ENABLED -DCONDUIT_BLUEPRINT_MPI_ENABLED -MD -MT src/CMakeFiles/parthenon.dir/interface/variable_state.cpp.o -MF src/CMakeFiles/parthenon.dir/interface/variable_state.cpp.o.d -o src/CMakeFiles/parthenon.dir/interface/variable_state.cpp.o -c /wrkdirs/usr/ports/science/parthenon/work/parthenon-24.08/src/i
nterface/variable_state.cpp
[ 32% 25/70] /usr/bin/c++ -DFS_HEADER="<filesystem>" -DFS_NAMESPACE=std::filesystem -DH5_BUILT_AS_DYNAMIC_LIB -DKOKKOS_DEPENDENCE -DMPICH_SKIP_MPICXX -DOMPI_SKIP_MPICXX -D_MPICC_H -Dparthenon_EXPORTS -I/wrkdirs/usr/ports/science/parthenon/work/parthenon-24.08/src -I/wrkdirs/usr/ports/science/parthenon/work/.build/src/generated -isystem /usr/local/include -isystem /usr/local/include/ascent -isystem /usr/local/include/conduit -isystem /usr/local/include/json-c -isystem /usr/local/include/gcc13 -O2 -pipe -fstack-protector-strong -fno-strict-aliasing -O2 -pipe -fstack-protector-strong -fno-strict-aliasing -DNDEBUG -std=c++17 -fPIC -fopenmp=libomp -pthread -DCONDUIT_RELAY_IO_MPI_ENABLED -DCONDUIT_BLUEPRINT_MPI_ENABLED -MD -MT src/CMakeFiles/parthenon.dir/mesh/forest/block_ownership.cpp.o -MF src/CMakeFiles/parthenon.dir/mesh/forest/block_ownership.cpp.o.d -o src/CMakeFiles/parthenon.dir/mesh/forest/block_ownership.cpp.o -c /wrkdirs/usr/ports/science/parthenon/work/parthenon-24
.08/src/mesh/forest/block_ownership.cpp
[ 34% 26/70] /usr/bin/c++ -DFS_HEADER="<filesystem>" -DFS_NAMESPACE=std::filesystem -DH5_BUILT_AS_DYNAMIC_LIB -DKOKKOS_DEPENDENCE -DMPICH_SKIP_MPICXX -DOMPI_SKIP_MPICXX -D_MPICC_H -Dparthenon_EXPORTS -I/wrkdirs/usr/ports/science/parthenon/work/parthenon-24.08/src -I/wrkdirs/usr/ports/science/parthenon/work/.build/src/generated -isystem /usr/local/include -isystem /usr/local/include/ascent -isystem /usr/local/include/conduit -isystem /usr/local/include/json-c -isystem /usr/local/include/gcc13 -O2 -pipe -fstack-protector-strong -fno-strict-aliasing -O2 -pipe -fstack-protector-strong -fno-strict-aliasing -DNDEBUG -std=c++17 -fPIC -fopenmp=libomp -pthread -DCONDUIT_RELAY_IO_MPI_ENABLED -DCONDUIT_BLUEPRINT_MPI_ENABLED -MD -MT src/CMakeFiles/parthenon.dir/interface/update.cpp.o -MF src/CMakeFiles/parthenon.dir/interface/update.cpp.o.d -o src/CMakeFiles/parthenon.dir/interface/update.cpp.o -c /wrkdirs/usr/ports/science/parthenon/work/parthenon-24.08/src/interface/update.cpp
/wrkdirs/usr/ports/science/parthenon/work/parthenon-24.08/src/interface/update.cpp:37:12: warning: loop not vectorized: the optimizer was unable to perform the requested transformation; the transformation might be disabled or specified as part of an unsupported transformation ordering [-Wpass-failed=transform-warning]
37 | TaskStatus FluxDivergence(MeshBlockData<Real> *in, MeshBlockData<Real> *dudt_cont) {
| ^
/wrkdirs/usr/ports/science/parthenon/work/parthenon-24.08/src/interface/update.cpp:62:12: warning: loop not vectorized: the optimizer was unable to perform the requested transformation; the transformation might be disabled or specified as part of an unsupported transformation ordering [-Wpass-failed=transform-warning]
62 | TaskStatus FluxDivergence(MeshData<Real> *in_obj, MeshData<Real> *dudt_obj) {
| ^
/wrkdirs/usr/ports/science/parthenon/work/parthenon-24.08/src/interface/update.cpp:87:12: warning: loop not vectorized: the optimizer was unable to perform the requested transformation; the transformation might be disabled or specified as part of an unsupported transformation ordering [-Wpass-failed=transform-warning]
87 | TaskStatus UpdateWithFluxDivergence(MeshBlockData<Real> *u0_data,
| ^
/wrkdirs/usr/ports/science/parthenon/work/parthenon-24.08/src/interface/update.cpp:115:12: warning: loop not vectorized: the optimizer was unable to perform the requested transformation; the transformation might be disabled or specified as part of an unsupported transformation ordering [-Wpass-failed=transform-warning]
115 | TaskStatus UpdateWithFluxDivergence(MeshData<Real> *u0_data, MeshData<Real> *u1_data,
| ^
4 warnings generated.
[ 35% 27/70] /usr/bin/c++ -DFS_HEADER="<filesystem>" -DFS_NAMESPACE=std::filesystem -DH5_BUILT_AS_DYNAMIC_LIB -DKOKKOS_DEPENDENCE -DMPICH_SKIP_MPICXX -DOMPI_SKIP_MPICXX -D_MPICC_H -Dparthenon_EXPORTS -I/wrkdirs/usr/ports/science/parthenon/work/parthenon-24.08/src -I/wrkdirs/usr/ports/science/parthenon/work/.build/src/generated -isystem /usr/local/include -isystem /usr/local/include/ascent -isystem /usr/local/include/conduit -isystem /usr/local/include/json-c -isystem /usr/local/include/gcc13 -O2 -pipe -fstack-protector-strong -fno-strict-aliasing -O2 -pipe -fstack-protector-strong -fno-strict-aliasing -DNDEBUG -std=c++17 -fPIC -fopenmp=libomp -pthread -DCONDUIT_RELAY_IO_MPI_ENABLED -DCONDUIT_BLUEPRINT_MPI_ENABLED -MD -MT src/CMakeFiles/parthenon.dir/interface/variable.cpp.o -MF src/CMakeFiles/parthenon.dir/interface/variable.cpp.o.d -o src/CMakeFiles/parthenon.dir/interface/variable.cpp.o -c /wrkdirs/usr/ports/science/parthenon/work/parthenon-24.08/src/interface/variable.cpp
[ 37% 28/70] /usr/bin/c++ -DFS_HEADER="<filesystem>" -DFS_NAMESPACE=std::filesystem -DH5_BUILT_AS_DYNAMIC_LIB -DKOKKOS_DEPENDENCE -DMPICH_SKIP_MPICXX -DOMPI_SKIP_MPICXX -D_MPICC_H -Dparthenon_EXPORTS -I/wrkdirs/usr/ports/science/parthenon/work/parthenon-24.08/src -I/wrkdirs/usr/ports/science/parthenon/work/.build/src/generated -isystem /usr/local/include -isystem /usr/local/include/ascent -isystem /usr/local/include/conduit -isystem /usr/local/include/json-c -isystem /usr/local/include/gcc13 -O2 -pipe -fstack-protector-strong -fno-strict-aliasing -O2 -pipe -fstack-protector-strong -fno-strict-aliasing -DNDEBUG -std=c++17 -fPIC -fopenmp=libomp -pthread -DCONDUIT_RELAY_IO_MPI_ENABLED -DCONDUIT_BLUEPRINT_MPI_ENABLED -MD -MT src/CMakeFiles/parthenon.dir/mesh/forest/forest_topology.cpp.o -MF src/CMakeFiles/parthenon.dir/mesh/forest/forest_topology.cpp.o.d -o src/CMakeFiles/parthenon.dir/mesh/forest/forest_topology.cpp.o -c /wrkdirs/usr/ports/science/parthenon/work/parthenon-24
.08/src/mesh/forest/forest_topology.cpp
[ 38% 29/70] /usr/bin/c++ -DFS_HEADER="<filesystem>" -DFS_NAMESPACE=std::filesystem -DH5_BUILT_AS_DYNAMIC_LIB -DKOKKOS_DEPENDENCE -DMPICH_SKIP_MPICXX -DOMPI_SKIP_MPICXX -D_MPICC_H -Dparthenon_EXPORTS -I/wrkdirs/usr/ports/science/parthenon/work/parthenon-24.08/src -I/wrkdirs/usr/ports/science/parthenon/work/.build/src/generated -isystem /usr/local/include -isystem /usr/local/include/ascent -isystem /usr/local/include/conduit -isystem /usr/local/include/json-c -isystem /usr/local/include/gcc13 -O2 -pipe -fstack-protector-strong -fno-strict-aliasing -O2 -pipe -fstack-protector-strong -fno-strict-aliasing -DNDEBUG -std=c++17 -fPIC -fopenmp=libomp -pthread -DCONDUIT_RELAY_IO_MPI_ENABLED -DCONDUIT_BLUEPRINT_MPI_ENABLED -MD -MT src/CMakeFiles/parthenon.dir/mesh/forest/forest.cpp.o -MF src/CMakeFiles/parthenon.dir/mesh/forest/forest.cpp.o.d -o src/CMakeFiles/parthenon.dir/mesh/forest/forest.cpp.o -c /wrkdirs/usr/ports/science/parthenon/work/parthenon-24.08/src/mesh/forest/forest.cpp
[ 40% 30/70] /usr/bin/c++ -DFS_HEADER="<filesystem>" -DFS_NAMESPACE=std::filesystem -DH5_BUILT_AS_DYNAMIC_LIB -DKOKKOS_DEPENDENCE -DMPICH_SKIP_MPICXX -DOMPI_SKIP_MPICXX -D_MPICC_H -Dparthenon_EXPORTS -I/wrkdirs/usr/ports/science/parthenon/work/parthenon-24.08/src -I/wrkdirs/usr/ports/science/parthenon/work/.build/src/generated -isystem /usr/local/include -isystem /usr/local/include/ascent -isystem /usr/local/include/conduit -isystem /usr/local/include/json-c -isystem /usr/local/include/gcc13 -O2 -pipe -fstack-protector-strong -fno-strict-aliasing -O2 -pipe -fstack-protector-strong -fno-strict-aliasing -DNDEBUG -std=c++17 -fPIC -fopenmp=libomp -pthread -DCONDUIT_RELAY_IO_MPI_ENABLED -DCONDUIT_BLUEPRINT_MPI_ENABLED -MD -MT src/CMakeFiles/parthenon.dir/mesh/forest/logical_location.cpp.o -MF src/CMakeFiles/parthenon.dir/mesh/forest/logical_location.cpp.o.d -o src/CMakeFiles/parthenon.dir/mesh/forest/logical_location.cpp.o -c /wrkdirs/usr/ports/science/parthenon/work/parthenon
-24.08/src/mesh/forest/logical_location.cpp
[ 41% 31/70] /usr/bin/c++ -DFS_HEADER="<filesystem>" -DFS_NAMESPACE=std::filesystem -DH5_BUILT_AS_DYNAMIC_LIB -DKOKKOS_DEPENDENCE -DMPICH_SKIP_MPICXX -DOMPI_SKIP_MPICXX -D_MPICC_H -Dparthenon_EXPORTS -I/wrkdirs/usr/ports/science/parthenon/work/parthenon-24.08/src -I/wrkdirs/usr/ports/science/parthenon/work/.build/src/generated -isystem /usr/local/include -isystem /usr/local/include/ascent -isystem /usr/local/include/conduit -isystem /usr/local/include/json-c -isystem /usr/local/include/gcc13 -O2 -pipe -fstack-protector-strong -fno-strict-aliasing -O2 -pipe -fstack-protector-strong -fno-strict-aliasing -DNDEBUG -std=c++17 -fPIC -fopenmp=libomp -pthread -DCONDUIT_RELAY_IO_MPI_ENABLED -DCONDUIT_BLUEPRINT_MPI_ENABLED -MD -MT src/CMakeFiles/parthenon.dir/mesh/forest/logical_coordinate_transformation.cpp.o -MF src/CMakeFiles/parthenon.dir/mesh/forest/logical_coordinate_transformation.cpp.o.d -o src/CMakeFiles/parthenon.dir/mesh/forest/logical_coordinate_transformation.cpp.o -c
/wrkdirs/usr/ports/science/parthenon/work/parthenon-24.08/src/mesh/forest/logical_coordinate_transformation.cpp
[ 42% 32/70] /usr/bin/c++ -DFS_HEADER="<filesystem>" -DFS_NAMESPACE=std::filesystem -DH5_BUILT_AS_DYNAMIC_LIB -DKOKKOS_DEPENDENCE -DMPICH_SKIP_MPICXX -DOMPI_SKIP_MPICXX -D_MPICC_H -Dparthenon_EXPORTS -I/wrkdirs/usr/ports/science/parthenon/work/parthenon-24.08/src -I/wrkdirs/usr/ports/science/parthenon/work/.build/src/generated -isystem /usr/local/include -isystem /usr/local/include/ascent -isystem /usr/local/include/conduit -isystem /usr/local/include/json-c -isystem /usr/local/include/gcc13 -O2 -pipe -fstack-protector-strong -fno-strict-aliasing -O2 -pipe -fstack-protector-strong -fno-strict-aliasing -DNDEBUG -std=c++17 -fPIC -fopenmp=libomp -pthread -DCONDUIT_RELAY_IO_MPI_ENABLED -DCONDUIT_BLUEPRINT_MPI_ENABLED -MD -MT src/CMakeFiles/parthenon.dir/mesh/forest/tree.cpp.o -MF src/CMakeFiles/parthenon.dir/mesh/forest/tree.cpp.o.d -o src/CMakeFiles/parthenon.dir/mesh/forest/tree.cpp.o -c /wrkdirs/usr/ports/science/parthenon/work/parthenon-24.08/src/mesh/forest/tree.cpp
[ 44% 33/70] /usr/bin/c++ -DFS_HEADER="<filesystem>" -DFS_NAMESPACE=std::filesystem -DH5_BUILT_AS_DYNAMIC_LIB -DKOKKOS_DEPENDENCE -DMPICH_SKIP_MPICXX -DOMPI_SKIP_MPICXX -D_MPICC_H -Dparthenon_EXPORTS -I/wrkdirs/usr/ports/science/parthenon/work/parthenon-24.08/src -I/wrkdirs/usr/ports/science/parthenon/work/.build/src/generated -isystem /usr/local/include -isystem /usr/local/include/ascent -isystem /usr/local/include/conduit -isystem /usr/local/include/json-c -isystem /usr/local/include/gcc13 -O2 -pipe -fstack-protector-strong -fno-strict-aliasing -O2 -pipe -fstack-protector-strong -fno-strict-aliasing -DNDEBUG -std=c++17 -fPIC -fopenmp=libomp -pthread -DCONDUIT_RELAY_IO_MPI_ENABLED -DCONDUIT_BLUEPRINT_MPI_ENABLED -MD -MT src/CMakeFiles/parthenon.dir/mesh/mesh_refinement.cpp.o -MF src/CMakeFiles/parthenon.dir/mesh/mesh_refinement.cpp.o.d -o src/CMakeFiles/parthenon.dir/mesh/mesh_refinement.cpp.o -c /wrkdirs/usr/ports/science/parthenon/work/parthenon-24.08/src/mesh/mesh_ref
inement.cpp
[ 45% 34/70] /usr/bin/c++ -DFS_HEADER="<filesystem>" -DFS_NAMESPACE=std::filesystem -DH5_BUILT_AS_DYNAMIC_LIB -DKOKKOS_DEPENDENCE -DMPICH_SKIP_MPICXX -DOMPI_SKIP_MPICXX -D_MPICC_H -Dparthenon_EXPORTS -I/wrkdirs/usr/ports/science/parthenon/work/parthenon-24.08/src -I/wrkdirs/usr/ports/science/parthenon/work/.build/src/generated -isystem /usr/local/include -isystem /usr/local/include/ascent -isystem /usr/local/include/conduit -isystem /usr/local/include/json-c -isystem /usr/local/include/gcc13 -O2 -pipe -fstack-protector-strong -fno-strict-aliasing -O2 -pipe -fstack-protector-strong -fno-strict-aliasing -DNDEBUG -std=c++17 -fPIC -fopenmp=libomp -pthread -DCONDUIT_RELAY_IO_MPI_ENABLED -DCONDUIT_BLUEPRINT_MPI_ENABLED -MD -MT src/CMakeFiles/parthenon.dir/mesh/mesh-amr_loadbalance.cpp.o -MF src/CMakeFiles/parthenon.dir/mesh/mesh-amr_loadbalance.cpp.o.d -o src/CMakeFiles/parthenon.dir/mesh/mesh-amr_loadbalance.cpp.o -c /wrkdirs/usr/ports/science/parthenon/work/parthenon-24.08/sr
c/mesh/mesh-amr_loadbalance.cpp
/wrkdirs/usr/ports/science/parthenon/work/parthenon-24.08/src/mesh/mesh-amr_loadbalance.cpp:81:6: warning: loop not vectorized: the optimizer was unable to perform the requested transformation; the transformation might be disabled or specified as part of an unsupported transformation ordering [-Wpass-failed=transform-warning]
81 | bool TryRecvCoarseToFine(int lid_recv, int send_rank, const LogicalLocation &fine_loc,
| ^
/wrkdirs/usr/ports/science/parthenon/work/parthenon-24.08/src/mesh/mesh-amr_loadbalance.cpp:172:6: warning: loop not vectorized: the optimizer was unable to perform the requested transformation; the transformation might be disabled or specified as part of an unsupported transformation ordering [-Wpass-failed=transform-warning]
172 | bool TryRecvFineToCoarse(int lid_recv, int send_rank, const LogicalLocation &fine_loc,
| ^
2 warnings generated.
[ 47% 35/70] /usr/bin/c++ -DFS_HEADER="<filesystem>" -DFS_NAMESPACE=std::filesystem -DH5_BUILT_AS_DYNAMIC_LIB -DKOKKOS_DEPENDENCE -DMPICH_SKIP_MPICXX -DOMPI_SKIP_MPICXX -D_MPICC_H -Dparthenon_EXPORTS -I/wrkdirs/usr/ports/science/parthenon/work/parthenon-24.08/src -I/wrkdirs/usr/ports/science/parthenon/work/.build/src/generated -isystem /usr/local/include -isystem /usr/local/include/ascent -isystem /usr/local/include/conduit -isystem /usr/local/include/json-c -isystem /usr/local/include/gcc13 -O2 -pipe -fstack-protector-strong -fno-strict-aliasing -O2 -pipe -fstack-protector-strong -fno-strict-aliasing -DNDEBUG -std=c++17 -fPIC -fopenmp=libomp -pthread -DCONDUIT_RELAY_IO_MPI_ENABLED -DCONDUIT_BLUEPRINT_MPI_ENABLED -MD -MT src/CMakeFiles/parthenon.dir/mesh/mesh-gmg.cpp.o -MF src/CMakeFiles/parthenon.dir/mesh/mesh-gmg.cpp.o.d -o src/CMakeFiles/parthenon.dir/mesh/mesh-gmg.cpp.o -c /wrkdirs/usr/ports/science/parthenon/work/parthenon-24.08/src/mesh/mesh-gmg.cpp
[ 48% 36/70] /usr/bin/c++ -DFS_HEADER="<filesystem>" -DFS_NAMESPACE=std::filesystem -DH5_BUILT_AS_DYNAMIC_LIB -DKOKKOS_DEPENDENCE -DMPICH_SKIP_MPICXX -DOMPI_SKIP_MPICXX -D_MPICC_H -Dparthenon_EXPORTS -I/wrkdirs/usr/ports/science/parthenon/work/parthenon-24.08/src -I/wrkdirs/usr/ports/science/parthenon/work/.build/src/generated -isystem /usr/local/include -isystem /usr/local/include/ascent -isystem /usr/local/include/conduit -isystem /usr/local/include/json-c -isystem /usr/local/include/gcc13 -O2 -pipe -fstack-protector-strong -fno-strict-aliasing -O2 -pipe -fstack-protector-strong -fno-strict-aliasing -DNDEBUG -std=c++17 -fPIC -fopenmp=libomp -pthread -DCONDUIT_RELAY_IO_MPI_ENABLED -DCONDUIT_BLUEPRINT_MPI_ENABLED -MD -MT src/CMakeFiles/parthenon.dir/mesh/mesh.cpp.o -MF src/CMakeFiles/parthenon.dir/mesh/mesh.cpp.o.d -o src/CMakeFiles/parthenon.dir/mesh/mesh.cpp.o -c /wrkdirs/usr/ports/science/parthenon/work/parthenon-24.08/src/mesh/mesh.cpp
[ 50% 37/70] /usr/bin/c++ -DFS_HEADER="<filesystem>" -DFS_NAMESPACE=std::filesystem -DH5_BUILT_AS_DYNAMIC_LIB -DKOKKOS_DEPENDENCE -DMPICH_SKIP_MPICXX -DOMPI_SKIP_MPICXX -D_MPICC_H -Dparthenon_EXPORTS -I/wrkdirs/usr/ports/science/parthenon/work/parthenon-24.08/src -I/wrkdirs/usr/ports/science/parthenon/work/.build/src/generated -isystem /usr/local/include -isystem /usr/local/include/ascent -isystem /usr/local/include/conduit -isystem /usr/local/include/json-c -isystem /usr/local/include/gcc13 -O2 -pipe -fstack-protector-strong -fno-strict-aliasing -O2 -pipe -fstack-protector-strong -fno-strict-aliasing -DNDEBUG -std=c++17 -fPIC -fopenmp=libomp -pthread -DCONDUIT_RELAY_IO_MPI_ENABLED -DCONDUIT_BLUEPRINT_MPI_ENABLED -MD -MT src/CMakeFiles/parthenon.dir/mesh/meshblock.cpp.o -MF src/CMakeFiles/parthenon.dir/mesh/meshblock.cpp.o.d -o src/CMakeFiles/parthenon.dir/mesh/meshblock.cpp.o -c /wrkdirs/usr/ports/science/parthenon/work/parthenon-24.08/src/mesh/meshblock.cpp
[ 51% 38/70] /usr/bin/c++ -DFS_HEADER="<filesystem>" -DFS_NAMESPACE=std::filesystem -DH5_BUILT_AS_DYNAMIC_LIB -DKOKKOS_DEPENDENCE -DMPICH_SKIP_MPICXX -DOMPI_SKIP_MPICXX -D_MPICC_H -Dparthenon_EXPORTS -I/wrkdirs/usr/ports/science/parthenon/work/parthenon-24.08/src -I/wrkdirs/usr/ports/science/parthenon/work/.build/src/generated -isystem /usr/local/include -isystem /usr/local/include/ascent -isystem /usr/local/include/conduit -isystem /usr/local/include/json-c -isystem /usr/local/include/gcc13 -O2 -pipe -fstack-protector-strong -fno-strict-aliasing -O2 -pipe -fstack-protector-strong -fno-strict-aliasing -DNDEBUG -std=c++17 -fPIC -fopenmp=libomp -pthread -DCONDUIT_RELAY_IO_MPI_ENABLED -DCONDUIT_BLUEPRINT_MPI_ENABLED -MD -MT src/CMakeFiles/parthenon.dir/outputs/histogram.cpp.o -MF src/CMakeFiles/parthenon.dir/outputs/histogram.cpp.o.d -o src/CMakeFiles/parthenon.dir/outputs/histogram.cpp.o -c /wrkdirs/usr/ports/science/parthenon/work/parthenon-24.08/src/outputs/histogram.cpp
[ 52% 39/70] /usr/bin/c++ -DFS_HEADER="<filesystem>" -DFS_NAMESPACE=std::filesystem -DH5_BUILT_AS_DYNAMIC_LIB -DKOKKOS_DEPENDENCE -DMPICH_SKIP_MPICXX -DOMPI_SKIP_MPICXX -D_MPICC_H -Dparthenon_EXPORTS -I/wrkdirs/usr/ports/science/parthenon/work/parthenon-24.08/src -I/wrkdirs/usr/ports/science/parthenon/work/.build/src/generated -isystem /usr/local/include -isystem /usr/local/include/ascent -isystem /usr/local/include/conduit -isystem /usr/local/include/json-c -isystem /usr/local/include/gcc13 -O2 -pipe -fstack-protector-strong -fno-strict-aliasing -O2 -pipe -fstack-protector-strong -fno-strict-aliasing -DNDEBUG -std=c++17 -fPIC -fopenmp=libomp -pthread -DCONDUIT_RELAY_IO_MPI_ENABLED -DCONDUIT_BLUEPRINT_MPI_ENABLED -MD -MT src/CMakeFiles/parthenon.dir/outputs/ascent.cpp.o -MF src/CMakeFiles/parthenon.dir/outputs/ascent.cpp.o.d -o src/CMakeFiles/parthenon.dir/outputs/ascent.cpp.o -c /wrkdirs/usr/ports/science/parthenon/work/parthenon-24.08/src/outputs/ascent.cpp
[ 54% 40/70] /usr/bin/c++ -DFS_HEADER="<filesystem>" -DFS_NAMESPACE=std::filesystem -DH5_BUILT_AS_DYNAMIC_LIB -DKOKKOS_DEPENDENCE -DMPICH_SKIP_MPICXX -DOMPI_SKIP_MPICXX -D_MPICC_H -Dparthenon_EXPORTS -I/wrkdirs/usr/ports/science/parthenon/work/parthenon-24.08/src -I/wrkdirs/usr/ports/science/parthenon/work/.build/src/generated -isystem /usr/local/include -isystem /usr/local/include/ascent -isystem /usr/local/include/conduit -isystem /usr/local/include/json-c -isystem /usr/local/include/gcc13 -O2 -pipe -fstack-protector-strong -fno-strict-aliasing -O2 -pipe -fstack-protector-strong -fno-strict-aliasing -DNDEBUG -std=c++17 -fPIC -fopenmp=libomp -pthread -DCONDUIT_RELAY_IO_MPI_ENABLED -DCONDUIT_BLUEPRINT_MPI_ENABLED -MD -MT src/CMakeFiles/parthenon.dir/outputs/io_wrapper.cpp.o -MF src/CMakeFiles/parthenon.dir/outputs/io_wrapper.cpp.o.d -o src/CMakeFiles/parthenon.dir/outputs/io_wrapper.cpp.o -c /wrkdirs/usr/ports/science/parthenon/work/parthenon-24.08/src/outputs/io_wrapper.cpp
[ 55% 41/70] /usr/bin/c++ -DFS_HEADER="<filesystem>" -DFS_NAMESPACE=std::filesystem -DH5_BUILT_AS_DYNAMIC_LIB -DKOKKOS_DEPENDENCE -DMPICH_SKIP_MPICXX -DOMPI_SKIP_MPICXX -D_MPICC_H -Dparthenon_EXPORTS -I/wrkdirs/usr/ports/science/parthenon/work/parthenon-24.08/src -I/wrkdirs/usr/ports/science/parthenon/work/.build/src/generated -isystem /usr/local/include -isystem /usr/local/include/ascent -isystem /usr/local/include/conduit -isystem /usr/local/include/json-c -isystem /usr/local/include/gcc13 -O2 -pipe -fstack-protector-strong -fno-strict-aliasing -O2 -pipe -fstack-protector-strong -fno-strict-aliasing -DNDEBUG -std=c++17 -fPIC -fopenmp=libomp -pthread -DCONDUIT_RELAY_IO_MPI_ENABLED -DCONDUIT_BLUEPRINT_MPI_ENABLED -MD -MT src/CMakeFiles/parthenon.dir/outputs/history.cpp.o -MF src/CMakeFiles/parthenon.dir/outputs/history.cpp.o.d -o src/CMakeFiles/parthenon.dir/outputs/history.cpp.o -c /wrkdirs/usr/ports/science/parthenon/work/parthenon-24.08/src/outputs/history.cpp
[ 57% 42/70] /usr/bin/c++ -DFS_HEADER="<filesystem>" -DFS_NAMESPACE=std::filesystem -DH5_BUILT_AS_DYNAMIC_LIB -DKOKKOS_DEPENDENCE -DMPICH_SKIP_MPICXX -DOMPI_SKIP_MPICXX -D_MPICC_H -Dparthenon_EXPORTS -I/wrkdirs/usr/ports/science/parthenon/work/parthenon-24.08/src -I/wrkdirs/usr/ports/science/parthenon/work/.build/src/generated -isystem /usr/local/include -isystem /usr/local/include/ascent -isystem /usr/local/include/conduit -isystem /usr/local/include/json-c -isystem /usr/local/include/gcc13 -O2 -pipe -fstack-protector-strong -fno-strict-aliasing -O2 -pipe -fstack-protector-strong -fno-strict-aliasing -DNDEBUG -std=c++17 -fPIC -fopenmp=libomp -pthread -DCONDUIT_RELAY_IO_MPI_ENABLED -DCONDUIT_BLUEPRINT_MPI_ENABLED -MD -MT src/CMakeFiles/parthenon.dir/outputs/output_utils.cpp.o -MF src/CMakeFiles/parthenon.dir/outputs/output_utils.cpp.o.d -o src/CMakeFiles/parthenon.dir/outputs/output_utils.cpp.o -c /wrkdirs/usr/ports/science/parthenon/work/parthenon-24.08/src/outputs/outpu
t_utils.cpp
FAILED: src/CMakeFiles/parthenon.dir/outputs/output_utils.cpp.o
/usr/bin/c++ -DFS_HEADER="<filesystem>" -DFS_NAMESPACE=std::filesystem -DH5_BUILT_AS_DYNAMIC_LIB -DKOKKOS_DEPENDENCE -DMPICH_SKIP_MPICXX -DOMPI_SKIP_MPICXX -D_MPICC_H -Dparthenon_EXPORTS -I/wrkdirs/usr/ports/science/parthenon/work/parthenon-24.08/src -I/wrkdirs/usr/ports/science/parthenon/work/.build/src/generated -isystem /usr/local/include -isystem /usr/local/include/ascent -isystem /usr/local/include/conduit -isystem /usr/local/include/json-c -isystem /usr/local/include/gcc13 -O2 -pipe -fstack-protector-strong -fno-strict-aliasing -O2 -pipe -fstack-protector-strong -fno-strict-aliasing -DNDEBUG -std=c++17 -fPIC -fopenmp=libomp -pthread -DCONDUIT_RELAY_IO_MPI_ENABLED -DCONDUIT_BLUEPRINT_MPI_ENABLED -MD -MT src/CMakeFiles/parthenon.dir/outputs/output_utils.cpp.o -MF src/CMakeFiles/parthenon.dir/outputs/output_utils.cpp.o.d -o src/CMakeFiles/parthenon.dir/outputs/output_utils.cpp.o -c /wrkdirs/usr/ports/science/parthenon/work/parthenon-24.08/src/outputs/output_utils.cpp
/wrkdirs/usr/ports/science/parthenon/work/parthenon-24.08/src/outputs/output_utils.cpp:293:17: error: static assertion failed due to requirement 'sizeof(unsigned int) == sizeof(unsigned long long)': MPI_UNSIGNED_LONG_LONG same as size_t
293 | static_assert(sizeof(std::size_t) == sizeof(unsigned long long int),
| ^~~~~~~~~~~~~~~~~~~~~~~~~~~~~~~~~~~~~~~~~~~~~~~~~~~~~
/wrkdirs/usr/ports/science/parthenon/work/parthenon-24.08/src/outputs/output_utils.cpp:293:37: note: expression evaluates to '4 == 8'
293 | static_assert(sizeof(std::size_t) == sizeof(unsigned long long int),
| ~~~~~~~~~~~~~~~~~~~~^~~~~~~~~~~~~~~~~~~~~~~~~~~~~~~~~
/wrkdirs/usr/ports/science/parthenon/work/parthenon-24.08/src/outputs/output_utils.cpp:317:17: error: static assertion failed due to requirement 'sizeof(unsigned int) == sizeof(unsigned long long)': MPI_UNSIGNED_LONG_LONG same as size_t
317 | static_assert(sizeof(std::size_t) == sizeof(unsigned long long int),
| ^~~~~~~~~~~~~~~~~~~~~~~~~~~~~~~~~~~~~~~~~~~~~~~~~~~~~
/wrkdirs/usr/ports/science/parthenon/work/parthenon-24.08/src/outputs/output_utils.cpp:317:37: note: expression evaluates to '4 == 8'
317 | static_assert(sizeof(std::size_t) == sizeof(unsigned long long int),
| ~~~~~~~~~~~~~~~~~~~~^~~~~~~~~~~~~~~~~~~~~~~~~~~~~~~~~
2 errors generated.
[ 58% 42/70] /usr/bin/c++ -DFS_HEADER="<filesystem>" -DFS_NAMESPACE=std::filesystem -DH5_BUILT_AS_DYNAMIC_LIB -DKOKKOS_DEPENDENCE -DMPICH_SKIP_MPICXX -DOMPI_SKIP_MPICXX -D_MPICC_H -Dparthenon_EXPORTS -I/wrkdirs/usr/ports/science/parthenon/work/parthenon-24.08/src -I/wrkdirs/usr/ports/science/parthenon/work/.build/src/generated -isystem /usr/local/include -isystem /usr/local/include/ascent -isystem /usr/local/include/conduit -isystem /usr/local/include/json-c -isystem /usr/local/include/gcc13 -O2 -pipe -fstack-protector-strong -fno-strict-aliasing -O2 -pipe -fstack-protector-strong -fno-strict-aliasing -DNDEBUG -std=c++17 -fPIC -fopenmp=libomp -pthread -DCONDUIT_RELAY_IO_MPI_ENABLED -DCONDUIT_BLUEPRINT_MPI_ENABLED -MD -MT src/CMakeFiles/parthenon.dir/outputs/parthenon_hdf5.cpp.o -MF src/CMakeFiles/parthenon.dir/outputs/parthenon_hdf5.cpp.o.d -o src/CMakeFiles/parthenon.dir/outputs/parthenon_hdf5.cpp.o -c /wrkdirs/usr/ports/science/parthenon/work/parthenon-24.08/src/outputs
/parthenon_hdf5.cpp
[ 60% 42/70] /usr/bin/c++ -DFS_HEADER="<filesystem>" -DFS_NAMESPACE=std::filesystem -DH5_BUILT_AS_DYNAMIC_LIB -DKOKKOS_DEPENDENCE -DMPICH_SKIP_MPICXX -DOMPI_SKIP_MPICXX -D_MPICC_H -Dparthenon_EXPORTS -I/wrkdirs/usr/ports/science/parthenon/work/parthenon-24.08/src -I/wrkdirs/usr/ports/science/parthenon/work/.build/src/generated -isystem /usr/local/include -isystem /usr/local/include/ascent -isystem /usr/local/include/conduit -isystem /usr/local/include/json-c -isystem /usr/local/include/gcc13 -O2 -pipe -fstack-protector-strong -fno-strict-aliasing -O2 -pipe -fstack-protector-strong -fno-strict-aliasing -DNDEBUG -std=c++17 -fPIC -fopenmp=libomp -pthread -DCONDUIT_RELAY_IO_MPI_ENABLED -DCONDUIT_BLUEPRINT_MPI_ENABLED -MD -MT src/CMakeFiles/parthenon.dir/outputs/outputs.cpp.o -MF src/CMakeFiles/parthenon.dir/outputs/outputs.cpp.o.d -o src/CMakeFiles/parthenon.dir/outputs/outputs.cpp.o -c /wrkdirs/usr/ports/science/parthenon/work/parthenon-24.08/src/outputs/outputs.cpp
ninja: build stopped: subcommand failed.
===> Compilation failed unexpectedly.
Try to set MAKE_JOBS_UNSAFE=yes and rebuild before reporting the failure to
the maintainer.
*** Error code 1
Stop.
make: stopped in /usr/ports/science/parthenon