[package - 142amd64-quarterly][mail/mmh] Failed for mmh-0.4_1 in build

From: <pkg-fallout_at_FreeBSD.org>
Date: Sun, 10 Aug 2025 07:53:15 UTC
You are receiving this mail as a port that you maintain
is failing to build on the FreeBSD package build server.
Please investigate the failure and submit a PR to fix
build.

Maintainer:     satanist+freebsd@bureaucracy.de
Log URL:        https://pkg-status.freebsd.org/beefy20/data/142amd64-quarterly/ae4b9c5a1177/logs/mmh-0.4_1.log
Build URL:      https://pkg-status.freebsd.org/beefy20/build.html?mastername=142amd64-quarterly&build=ae4b9c5a1177
Log:

=>> Building mail/mmh
build started at Sun Aug 10 07:52:57 UTC 2025
port directory: /usr/ports/mail/mmh
package name: mmh-0.4_1
building for: FreeBSD 142amd64-quarterly-job-41 14.2-RELEASE-p5 FreeBSD 14.2-RELEASE-p5 amd64
maintained by: satanist+freebsd@bureaucracy.de
Makefile datestamp: -rw-r--r--  1 root wheel 1177 Jul  3 01:01 /usr/ports/mail/mmh/Makefile
Ports top last git commit: ae4b9c5a1
Ports top unclean checkout: no
Port dir last git commit: d7951ee86
Port dir unclean checkout: no
Poudriere version: poudriere-git-3.4.3
Host OSVERSION: 1500052
Jail OSVERSION: 1402000
Job Id: 41

---Begin Environment---
SHELL=/bin/sh
OSVERSION=1402000
UNAME_v=FreeBSD 14.2-RELEASE-p5
UNAME_r=14.2-RELEASE-p5
BLOCKSIZE=K
MAIL=/var/mail/root
MM_CHARSET=UTF-8
LANG=C.UTF-8
STATUS=1
HOME=/root
PATH=/sbin:/bin:/usr/sbin:/usr/bin:/usr/local/sbin:/usr/local/bin:/root/bin
MAKE_OBJDIR_CHECK_WRITABLE=0
LOCALBASE=/usr/local
USER=root
POUDRIERE_NAME=poudriere-git
LIBEXECPREFIX=/usr/local/libexec/poudriere
POUDRIERE_VERSION=3.4.3
MASTERMNT=/usr/local/poudriere/data/.m/142amd64-quarterly/ref
LC_COLLATE=C
POUDRIERE_BUILD_TYPE=bulk
PACKAGE_BUILDING=yes
SAVED_TERM=
OUTPUT_REDIRECTED_STDERR=4
OUTPUT_REDIRECTED=1
PWD=/usr/local/poudriere/data/.m/142amd64-quarterly/41/.p
OUTPUT_REDIRECTED_STDOUT=3
P_PORTS_FEATURES=FLAVORS SUBPACKAGES SELECTED_OPTIONS
MASTERNAME=142amd64-quarterly
SCRIPTPREFIX=/usr/local/share/poudriere
SCRIPTNAME=bulk.sh
OLDPWD=/usr/local/poudriere/data/.m/142amd64-quarterly/ref/.p/pool
POUDRIERE_PKGNAME=poudriere-git-3.4.3
SCRIPTPATH=/usr/local/share/poudriere/bulk.sh
POUDRIEREPATH=/usr/local/bin/poudriere
---End Environment---

---Begin Poudriere Port Flags/Env---
PORT_FLAGS=
PKGENV=
FLAVOR=
MAKE_ARGS=
---End Poudriere Port Flags/Env---

---Begin OPTIONS List---
===> The following configuration options are available for mmh-0.4_1:
====> Options available for the single LOCKING: you have to select exactly one of them
     DOT=off: Dot file locking
     FCNTL=off: fcntl() file locking
     FLOCK=on: flock() file locking
     LOCKF=off: lockf file locking
===> Use 'make config' to modify these settings
---End OPTIONS List---

--MAINTAINER--
satanist+freebsd@bureaucracy.de
--End MAINTAINER--

--CONFIGURE_ARGS--
--libdir=/usr/local/libexec/mmh  --sysconfdir=/usr/local/etc/mmh  --bindir=/usr/local/bin  --mandir=/usr/local/share/man  --docdir=/usr/local/share/doc/mmh --with-locking=flock
--End CONFIGURE_ARGS--

--CONFIGURE_ENV--
XDG_DATA_HOME=/wrkdirs/usr/ports/mail/mmh/work  XDG_CONFIG_HOME=/wrkdirs/usr/ports/mail/mmh/work  XDG_CACHE_HOME=/wrkdirs/usr/ports/mail/mmh/work/.cache  HOME=/wrkdirs/usr/ports/mail/mmh/work TMPDIR="/tmp" PATH=/wrkdirs/usr/ports/mail/mmh/work/.bin:/sbin:/bin:/usr/sbin:/usr/bin:/usr/local/sbin:/usr/local/bin:/root/bin PKG_CONFIG_LIBDIR=/wrkdirs/usr/ports/mail/mmh/work/.pkgconfig:/usr/local/libdata/pkgconfig:/usr/local/share/pkgconfig:/usr/libdata/pkgconfig SHELL=/bin/sh CONFIG_SHELL=/bin/sh
--End CONFIGURE_ENV--

--MAKE_ENV--
XDG_DATA_HOME=/wrkdirs/usr/ports/mail/mmh/work  XDG_CONFIG_HOME=/wrkdirs/usr/ports/mail/mmh/work  XDG_CACHE_HOME=/wrkdirs/usr/ports/mail/mmh/work/.cache  HOME=/wrkdirs/usr/ports/mail/mmh/work TMPDIR="/tmp" PATH=/wrkdirs/usr/ports/mail/mmh/work/.bin:/sbin:/bin:/usr/sbin:/usr/bin:/usr/local/sbin:/usr/local/bin:/root/bin PKG_CONFIG_LIBDIR=/wrkdirs/usr/ports/mail/mmh/work/.pkgconfig:/usr/local/libdata/pkgconfig:/usr/local/share/pkgconfig:/usr/libdata/pkgconfig MK_DEBUG_FILES=no MK_KERNEL_SYMBOLS=no SHELL=/bin/sh NO_LINT=YES PREFIX=/usr/local  LOCALBASE=/usr/local  CC="cc" CFLAGS="-O2 -pipe  -fstack-protector-strong -fno-strict-aliasing "  CPP="cpp" CPPFLAGS=""  LDFLAGS=" -fstack-protector-strong " LIBS=""  CXX="c++" CXXFLAGS="-O2 -pipe -fstack-protector-strong -fno-strict-aliasing  " BSD_INSTALL_PROGRAM="install  -s -m 555"  BSD_INSTALL_LIB="install  -s -m 0644"  BSD_INSTALL_SCRIPT="install  -m 555"  BSD_INSTALL_DATA="install  -m 0644"  BSD_INSTALL_MAN="install  -m 444"
--End MAKE_ENV--

--PLIST_SUB--
 OSREL=14.2 PREFIX=%D LOCALBASE=/usr/local  RESETPREFIX=/usr/local LIB32DIR=lib DOCSDIR="share/doc/mmh"  EXAMPLESDIR="share/examples/mmh"  DATADIR="share/mmh"  WWWDIR="www/mmh"  ETCDIR="etc/mmh"
--End PLIST_SUB--

--SUB_LIST--
 PREFIX=/usr/local LOCALBASE=/usr/local  DATADIR=/usr/local/share/mmh DOCSDIR=/usr/local/share/doc/mmh EXAMPLESDIR=/usr/local/share/examples/mmh  WWWDIR=/usr/local/www/mmh ETCDIR=/usr/local/etc/mmh
--End SUB_LIST--

---Begin make.conf---
USE_PACKAGE_DEPENDS=yes
BATCH=yes
WRKDIRPREFIX=/wrkdirs
PORTSDIR=/usr/ports
PACKAGES=/packages
DISTDIR=/distfiles
PACKAGE_BUILDING=yes
PACKAGE_BUILDING_FLAVORS=yes
####  ####
# XXX: We really need this but cannot use it while 'make checksum' does not
# try the next mirror on checksum failure.  It currently retries the same
# failed mirror and then fails rather then trying another.  It *does*
# try the next if the size is mismatched though.
#MASTER_SITE_FREEBSD=yes
# Build ALLOW_MAKE_JOBS_PACKAGES with 3 jobs
MAKE_JOBS_NUMBER=3
#### Misc Poudriere ####
.include "/etc/make.conf.ports_env"
GID=0
UID=0
DISABLE_MAKE_JOBS=poudriere
---End make.conf---
--Resource limits--
cpu time               (seconds, -t)  unlimited
file size           (512-blocks, -f)  unlimited
data seg size           (kbytes, -d)  33554432
stack size              (kbytes, -s)  524288
core file size      (512-blocks, -c)  unlimited
max memory size         (kbytes, -m)  unlimited
locked memory           (kbytes, -l)  unlimited
max user processes              (-u)  89999
open files                      (-n)  8192
virtual mem size        (kbytes, -v)  unlimited
swap limit              (kbytes, -w)  unlimited
socket buffer size       (bytes, -b)  unlimited
pseudo-terminals                (-p)  unlimited
kqueues                         (-k)  unlimited
umtx shared locks               (-o)  unlimited
pipebuf                         (-y)  unlimited
--End resource limits--
=======================<phase: check-sanity   >============================
===== env: NO_DEPENDS=yes USER=root UID=0 GID=0
===>  License BSD3CLAUSE accepted by the user
===========================================================================
=======================<phase: pkg-depends    >============================
===== env: USE_PACKAGE_DEPENDS_ONLY=1 USER=root UID=0 GID=0
===>   mmh-0.4_1 depends on file: /usr/local/sbin/pkg - not found
===>   Installing existing package /packages/All/pkg-2.2.2.pkg
[142amd64-quarterly-job-41] Installing pkg-2.2.2...
[142amd64-quarterly-job-41] Extracting pkg-2.2.2: .......... done
===>   mmh-0.4_1 depends on file: /usr/local/sbin/pkg - found
===>   Returning to build of mmh-0.4_1
===========================================================================
=======================<phase: fetch-depends  >============================
===== env: USE_PACKAGE_DEPENDS_ONLY=1 USER=root UID=0 GID=0
===========================================================================
=======================<phase: fetch          >============================
===== env: NO_DEPENDS=yes USER=root UID=0 GID=0
===>  License BSD3CLAUSE accepted by the user
===> Fetching all distfiles required by mmh-0.4_1 for building
===========================================================================
=======================<phase: checksum       >============================
===== env: NO_DEPENDS=yes USER=root UID=0 GID=0
===>  License BSD3CLAUSE accepted by the user
===> Fetching all distfiles required by mmh-0.4_1 for building
=> SHA256 Checksum OK for mmh-0.4.tar.gz.
===========================================================================
=======================<phase: extract-depends>============================
===== env: USE_PACKAGE_DEPENDS_ONLY=1 USER=root UID=0 GID=0
===========================================================================
=======================<phase: extract        >============================
===== env: NO_DEPENDS=yes USER=root UID=0 GID=0
===>  License BSD3CLAUSE accepted by the user
===> Fetching all distfiles required by mmh-0.4_1 for building
===>  Extracting for mmh-0.4_1
=> SHA256 Checksum OK for mmh-0.4.tar.gz.
===========================================================================
=======================<phase: patch-depends  >============================
===== env: USE_PACKAGE_DEPENDS_ONLY=1 USER=root UID=0 GID=0
===========================================================================
=======================<phase: patch          >============================
===== env: NO_DEPENDS=yes USER=root UID=0 GID=0
===>  Patching for mmh-0.4_1
===>  Applying FreeBSD patches for mmh-0.4_1 from /usr/ports/mail/mmh/files
===========================================================================
=======================<phase: build-depends  >============================
===== env: USE_PACKAGE_DEPENDS_ONLY=1 USER=root UID=0 GID=0
===========================================================================
=======================<phase: lib-depends    >============================
===== env: USE_PACKAGE_DEPENDS_ONLY=1 USER=root UID=0 GID=0
===========================================================================
=======================<phase: configure      >============================
===== env: NO_DEPENDS=yes USER=root UID=0 GID=0
===>  Configuring for mmh-0.4_1
checking build system type... x86_64-unknown-freebsd14.2
checking host system type... x86_64-unknown-freebsd14.2
checking target system type... x86_64-unknown-freebsd14.2
configuring for mmh-0.4
configuring for mmh dated 2019-01-06
checking for gcc... cc
checking whether the C compiler works... yes
checking for C compiler default output file name... a.out
checking for suffix of executables... 
checking whether we are cross compiling... no
<snip>
      |                                   ^
aliasbr.c:227:24: warning: passing 'char *' to parameter of type 'unsigned char *' converts between pointers to integer types where one is of the unique plain 'char' type and the other is not [-Wpointer-sign]
  227 |                 switch (*(pp = scanp(ap))) {
      |                                      ^~
aliasbr.c:38:35: note: passing argument to parameter here
   38 | static char *scanp(unsigned char *);
      |                                   ^
aliasbr.c:317:9: warning: returning 'unsigned char *' from a function with result type 'char *' converts between pointers to integer types where one is of the unique plain 'char' type and the other is not [-Wpointer-sign]
  317 |         return p;
      |                ^
aliasbr.c:324:28: warning: passing 'char *' to parameter of type 'unsigned char *' converts between pointers to integer types where one is of the unique plain 'char' type and the other is not [-Wpointer-sign]
  324 |         unsigned char *cp = scanp(p);
      |                                   ^
aliasbr.c:313:22: note: passing argument to parameter 'p' here
  313 | scanp(unsigned char *p)
      |                      ^
aliasbr.c:324:17: warning: initializing 'unsigned char *' with an expression of type 'char *' converts between pointers to integer types where one is of the unique plain 'char' type and the other is not [-Wpointer-sign]
  324 |         unsigned char *cp = scanp(p);
      |                        ^    ~~~~~~~~
aliasbr.c:326:4: warning: assigning to 'char *' from 'unsigned char *' converts between pointers to integer types where one is of the unique plain 'char' type and the other is not [-Wpointer-sign]
  326 |         p = cp;
      |           ^ ~~
aliasbr.c:340:17: warning: passing 'char *' to parameter of type 'unsigned char *' converts between pointers to integer types where one is of the unique plain 'char' type and the other is not [-Wpointer-sign]
  340 |         p = cp = scanp(p);
      |                        ^
aliasbr.c:313:22: note: passing argument to parameter 'p' here
  313 | scanp(unsigned char *p)
      |                      ^
aliasbr.c:340:9: warning: assigning to 'unsigned char *' from 'char *' converts between pointers to integer types where one is of the unique plain 'char' type and the other is not [-Wpointer-sign]
  340 |         p = cp = scanp(p);
      |                ^ ~~~~~~~~
aliasbr.c:340:4: warning: assigning to 'char *' from 'unsigned char *' converts between pointers to integer types where one is of the unique plain 'char' type and the other is not [-Wpointer-sign]
  340 |         p = cp = scanp(p);
      |           ^ ~~~~~~~~~~~~~
aliasbr.c:345:5: warning: assigning to 'char *' from 'unsigned char *' converts between pointers to integer types where one is of the unique plain 'char' type and the other is not [-Wpointer-sign]
  345 |         *a = cp;
      |            ^ ~~
aliasbr.c:444:10: warning: assigning to 'unsigned char *' from 'char *' converts between pointers to integer types where one is of the unique plain 'char' type and the other is not [-Wpointer-sign]
  444 |         for (pp = cp; isspace(*pp); pp++)
      |                 ^ ~~
aliasbr.c:452:10: warning: assigning to 'char *' from 'unsigned char *' converts between pointers to integer types where one is of the unique plain 'char' type and the other is not [-Wpointer-sign]
  452 |         for (cp = qp, qp--; qp > pp; qp--)
      |                 ^ ~~
aliasbr.c:460:9: warning: returning 'unsigned char *' from a function with result type 'char *' converts between pointers to integer types where one is of the unique plain 'char' type and the other is not [-Wpointer-sign]
  460 |         return pp;
      |                ^~
aliasbr.c:568:9: warning: assigning to 'unsigned char *' from 'char *' converts between pointers to integer types where one is of the unique plain 'char' type and the other is not [-Wpointer-sign]
  568 |         for (c = name, c1 = lname; *c && (c1 - lname < (int)sizeof(lname) - 1);
      |                ^ ~~~~
14 warnings generated.
cc -fstack-protector-strong -o ali ali.o aliasbr.o ../sbr/libmh.a 
ld: error: undefined symbol: getname
>>> referenced by aliasbr.c
>>>               aliasbr.o:(akval)
>>> referenced by aliasbr.c
>>>               aliasbr.o:(akval)
>>> referenced by ali.c
>>>               ali.o:(main)
>>> referenced 3 more times

ld: error: undefined symbol: getm
>>> referenced by aliasbr.c
>>>               aliasbr.o:(akval)
>>> referenced by ali.c
>>>               ali.o:(main)
>>> referenced by ali.c
>>>               ali.o:(main)
>>> did you mean: getc
>>> defined in: /lib/libc.so.7

ld: error: undefined symbol: add
>>> referenced by aliasbr.c
>>>               aliasbr.o:(akval)
>>> referenced by ali.c
>>>               ali.o:(main)
>>> referenced by ali.c
>>>               ali.o:(main)

ld: error: undefined symbol: concat
>>> referenced by aliasbr.c
>>>               aliasbr.o:(akval)
>>> referenced by aliasbr.c
>>>               aliasbr.o:(akresult)

ld: error: undefined symbol: mnfree
>>> referenced by aliasbr.c
>>>               aliasbr.o:(akval)
>>> referenced by ali.c
>>>               ali.o:(main)
>>> referenced by ali.c
>>>               ali.o:(main)
>>> referenced 1 more times

ld: error: undefined symbol: mh_xstrdup
>>> referenced by aliasbr.c
>>>               aliasbr.o:(akval)
>>> referenced by aliasbr.c
>>>               aliasbr.o:(akresult)
>>> referenced by aliasbr.c
>>>               aliasbr.o:(alias)
>>> referenced 16 more times

ld: error: undefined symbol: mh_free0
>>> referenced by aliasbr.c
>>>               aliasbr.o:(akresult)
>>> referenced by aliasbr.c
>>>               aliasbr.o:(akresult)
>>> referenced by ali.c
>>>               ali.o:(main)
>>> referenced 1 more times

ld: error: undefined symbol: vfgets
>>> referenced by aliasbr.c
>>>               aliasbr.o:(alias)
>>> referenced by aliasbr.c
>>>               aliasbr.o:(alias)

ld: error: undefined symbol: mh_xcalloc
>>> referenced by aliasbr.c
>>>               aliasbr.o:(alias)
>>> referenced by aliasbr.c
>>>               aliasbr.o:(alias)
>>> referenced by aliasbr.c
>>>               aliasbr.o:(alias)
>>> referenced 6 more times

ld: error: undefined symbol: etcpath
>>> referenced by aliasbr.c
>>>               aliasbr.o:(alias)
>>> referenced by ali.c
>>>               ali.o:(main)

ld: error: undefined symbol: mh_strcasecmp
>>> referenced by aliasbr.c
>>>               aliasbr.o:(seek_home)
>>> referenced by ali.c
>>>               ali.o:(main)
>>> referenced by ali.c
>>>               ali.o:(main)

ld: error: undefined symbol: mhbasename
>>> referenced by ali.c
>>>               ali.o:(main)

ld: error: undefined symbol: invo_name
>>> referenced by ali.c
>>>               ali.o:(main)
>>> referenced by ali.c
>>>               ali.o:(main)
>>> referenced by ali.c
>>>               ali.o:(main)
>>> referenced 2 more times

ld: error: undefined symbol: context_read
>>> referenced by ali.c
>>>               ali.o:(main)

ld: error: undefined symbol: getarguments
>>> referenced by ali.c
>>>               ali.o:(main)

ld: error: undefined symbol: smatch
>>> referenced by ali.c
>>>               ali.o:(main)

ld: error: undefined symbol: context_find
>>> referenced by ali.c
>>>               ali.o:(main)

ld: error: undefined symbol: brkstring
>>> referenced by ali.c
>>>               ali.o:(main)

ld: error: undefined symbol: adios
>>> referenced by ali.c
>>>               ali.o:(main)
>>> referenced by ali.c
>>>               ali.o:(main)
>>> referenced by ali.c
>>>               ali.o:(main)
>>> referenced 2 more times

ld: error: undefined symbol: print_help
>>> referenced by ali.c
>>>               ali.o:(main)

ld: error: too many errors emitted, stopping now (use --error-limit=0 to see all errors)
cc: error: linker command failed with exit code 1 (use -v to see invocation)
*** Error code 1

Stop.
make[1]: stopped in /wrkdirs/usr/ports/mail/mmh/work/mmh-0.4/uip
*** Error code 1

Stop.
make: stopped in /wrkdirs/usr/ports/mail/mmh/work/mmh-0.4
*** Error code 1

Stop.
make: stopped in /usr/ports/mail/mmh