[package - main-amd64-default][devel/cvs+ipv6] Failed for cvs+ipv6-1.20120905_4 in build
- Go to: [ bottom of page ] [ top of archives ] [ this month ]
Date: Sat, 09 Aug 2025 22:48:02 UTC
You are receiving this mail as a port that you maintain
is failing to build on the FreeBSD package build server.
Please investigate the failure and submit a PR to fix
build.
Maintainer: ports@FreeBSD.org
Log URL: https://pkg-status.freebsd.org/beefy18/data/main-amd64-default/p2650762431ca_s51affb7e971/logs/cvs+ipv6-1.20120905_4.log
Build URL: https://pkg-status.freebsd.org/beefy18/build.html?mastername=main-amd64-default&build=p2650762431ca_s51affb7e971
Log:
=>> Building devel/cvs+ipv6
build started at Sat Aug 9 22:46:28 UTC 2025
port directory: /usr/ports/devel/cvs+ipv6
package name: cvs+ipv6-1.20120905_4
building for: FreeBSD main-amd64-default-job-06 15.0-CURRENT FreeBSD 15.0-CURRENT 1500056 amd64
maintained by: ports@FreeBSD.org
Makefile datestamp: -rw-r--r-- 1 root wheel 288 Mar 21 2024 /usr/ports/devel/cvs+ipv6/Makefile
Ports top last git commit: 2650762431c
Ports top unclean checkout: no
Port dir last git commit: b0d3d5414da
Port dir unclean checkout: no
Poudriere version: poudriere-git-3.4.3
Host OSVERSION: 1500052
Jail OSVERSION: 1500056
Job Id: 06
!!! Jail is newer than host. (Jail: 1500056, Host: 1500052) !!!
!!! This is not supported. !!!
!!! Host kernel must be same or newer than jail. !!!
!!! Expect build failures. !!!
---Begin Environment---
SHELL=/bin/sh
OSVERSION=1500056
UNAME_v=FreeBSD 15.0-CURRENT 1500056
UNAME_r=15.0-CURRENT
BLOCKSIZE=K
MAIL=/var/mail/root
MM_CHARSET=UTF-8
LANG=C.UTF-8
STATUS=1
HOME=/root
PATH=/sbin:/bin:/usr/sbin:/usr/bin:/usr/local/sbin:/usr/local/bin:/root/bin
MAKE_OBJDIR_CHECK_WRITABLE=0
LOCALBASE=/usr/local
USER=root
POUDRIERE_NAME=poudriere-git
LIBEXECPREFIX=/usr/local/libexec/poudriere
POUDRIERE_VERSION=3.4.3
MASTERMNT=/usr/local/poudriere/data/.m/main-amd64-default/ref
LC_COLLATE=C
POUDRIERE_BUILD_TYPE=bulk
PACKAGE_BUILDING=yes
SAVED_TERM=
OUTPUT_REDIRECTED_STDERR=4
OUTPUT_REDIRECTED=1
PWD=/usr/local/poudriere/data/.m/main-amd64-default/06/.p
OUTPUT_REDIRECTED_STDOUT=3
P_PORTS_FEATURES=FLAVORS SUBPACKAGES SELECTED_OPTIONS
MASTERNAME=main-amd64-default
SCRIPTPREFIX=/usr/local/share/poudriere
SCRIPTNAME=bulk.sh
OLDPWD=/usr/local/poudriere/data/.m/main-amd64-default/ref/.p/pool
POUDRIERE_PKGNAME=poudriere-git-3.4.3
SCRIPTPATH=/usr/local/share/poudriere/bulk.sh
POUDRIEREPATH=/usr/local/bin/poudriere
---End Environment---
---Begin Poudriere Port Flags/Env---
PORT_FLAGS=
PKGENV=
FLAVOR=
MAKE_ARGS=
---End Poudriere Port Flags/Env---
---Begin OPTIONS List---
===> The following configuration options are available for cvs+ipv6-1.20120905_4:
EXAMPLES=on: Build and/or install examples
INFO=on: Build and/or install GNU info pages
KERBEROS=on: Kerberos support
===> Use 'make config' to modify these settings
---End OPTIONS List---
--MAINTAINER--
ports@FreeBSD.org
--End MAINTAINER--
--CONFIGURE_ARGS--
--End CONFIGURE_ARGS--
--CONFIGURE_ENV--
XDG_DATA_HOME=/wrkdirs/usr/ports/devel/cvs+ipv6/work XDG_CONFIG_HOME=/wrkdirs/usr/ports/devel/cvs+ipv6/work XDG_CACHE_HOME=/wrkdirs/usr/ports/devel/cvs+ipv6/work/.cache HOME=/wrkdirs/usr/ports/devel/cvs+ipv6/work TMPDIR="/tmp" PATH=/wrkdirs/usr/ports/devel/cvs+ipv6/work/.bin:/sbin:/bin:/usr/sbin:/usr/bin:/usr/local/sbin:/usr/local/bin:/root/bin PKG_CONFIG_LIBDIR=/wrkdirs/usr/ports/devel/cvs+ipv6/work/.pkgconfig:/usr/local/libdata/pkgconfig:/usr/local/share/pkgconfig:/usr/libdata/pkgconfig SHELL=/bin/sh CONFIG_SHELL=/bin/sh
--End CONFIGURE_ENV--
--MAKE_ENV--
XDG_DATA_HOME=/wrkdirs/usr/ports/devel/cvs+ipv6/work XDG_CONFIG_HOME=/wrkdirs/usr/ports/devel/cvs+ipv6/work XDG_CACHE_HOME=/wrkdirs/usr/ports/devel/cvs+ipv6/work/.cache HOME=/wrkdirs/usr/ports/devel/cvs+ipv6/work TMPDIR="/tmp" PATH=/wrkdirs/usr/ports/devel/cvs+ipv6/work/.bin:/sbin:/bin:/usr/sbin:/usr/bin:/usr/local/sbin:/usr/local/bin:/root/bin PKG_CONFIG_LIBDIR=/wrkdirs/usr/ports/devel/cvs+ipv6/work/.pkgconfig:/usr/local/libdata/pkgconfig:/usr/local/share/pkgconfig:/usr/libdata/pkgconfig MK_DEBUG_FILES=no MK_KERNEL_SYMBOLS=no SHELL=/bin/sh NO_LINT=YES PREFIX=/usr/local LOCALBASE=/usr/local CC="cc" CFLAGS="-O2 -pipe -fstack-protector-strong -fno-strict-aliasing " CPP="cpp" CPPFLAGS="" LDFLAGS=" " LIBS="" CXX="c++" CXXFLAGS="-O2 -pipe -fstack-protector-strong -fno-strict-aliasing " BSD_INSTALL_PROGRAM="install -s -m 555" BSD_INSTALL_LIB="install -s -m 0644" BSD_INSTALL_SCRIPT="install -m 555" BSD_INSTALL_DATA="install -m 0644" BSD_INSTALL_MAN="install -m 444"
--End MAKE_ENV--
--PLIST_SUB--
PORTEXAMPLES="" OSREL=15.0 PREFIX=%D LOCALBASE=/usr/local RESETPREFIX=/usr/local LIB32DIR=lib DOCSDIR="share/doc/cvs" EXAMPLESDIR="share/examples/cvs" DATADIR="share/cvs" WWWDIR="www/cvs" ETCDIR="etc/cvs"
--End PLIST_SUB--
--SUB_LIST--
PREFIX=/usr/local LOCALBASE=/usr/local DATADIR=/usr/local/share/cvs DOCSDIR=/usr/local/share/doc/cvs EXAMPLESDIR=/usr/local/share/examples/cvs WWWDIR=/usr/local/www/cvs ETCDIR=/usr/local/etc/cvs
--End SUB_LIST--
---Begin make.conf---
# XXX: We really need this but cannot use it while 'make checksum' does not
# try the next mirror on checksum failure. It currently retries the same
# failed mirror and then fails rather then trying another. It *does*
# try the next if the size is mismatched though.
#MASTER_SITE_FREEBSD=yes
# Build ALLOW_MAKE_JOBS_PACKAGES with 3 jobs
MAKE_JOBS_NUMBER=3
USE_PACKAGE_DEPENDS=yes
BATCH=yes
WRKDIRPREFIX=/wrkdirs
PORTSDIR=/usr/ports
PACKAGES=/packages
DISTDIR=/distfiles
PACKAGE_BUILDING=yes
PACKAGE_BUILDING_FLAVORS=yes
#### ####
# XXX: We really need this but cannot use it while 'make checksum' does not
# try the next mirror on checksum failure. It currently retries the same
# failed mirror and then fails rather then trying another. It *does*
# try the next if the size is mismatched though.
#MASTER_SITE_FREEBSD=yes
# Build ALLOW_MAKE_JOBS_PACKAGES with 3 jobs
MAKE_JOBS_NUMBER=3
#### Misc Poudriere ####
.include "/etc/make.conf.ports_env"
GID=0
UID=0
---End make.conf---
--Resource limits--
cpu time (seconds, -t) unlimited
file size (512-blocks, -f) unlimited
data seg size (kbytes, -d) 33554432
stack size (kbytes, -s) 524288
core file size (512-blocks, -c) unlimited
max memory size (kbytes, -m) unlimited
locked memory (kbytes, -l) unlimited
max user processes (-u) 89999
open files (-n) 8192
virtual mem size (kbytes, -v) unlimited
swap limit (kbytes, -w) unlimited
socket buffer size (bytes, -b) unlimited
pseudo-terminals (-p) unlimited
kqueues (-k) unlimited
umtx shared locks (-o) unlimited
pipebuf (-y) unlimited
--End resource limits--
=======================<phase: check-sanity >============================
===== env: NO_DEPENDS=yes USER=root UID=0 GID=0
===> NOTICE:
The cvs port currently does not have a maintainer. As a result, it is
more likely to have unresolved issues, not be up-to-date, or even be removed in
the future. To volunteer to maintain this port, please create an issue at:
https://bugs.freebsd.org/bugzilla
More information about port maintainership is available at:
https://docs.freebsd.org/en/articles/contributing/#ports-contributing
===> License GPLv2+ accepted by the user
===========================================================================
=======================<phase: pkg-depends >============================
===== env: USE_PACKAGE_DEPENDS_ONLY=1 USER=root UID=0 GID=0
===> cvs+ipv6-1.20120905_4 depends on file: /usr/local/sbin/pkg - not found
===> Installing existing package /packages/All/pkg-2.2.1.pkg
[main-amd64-default-job-06] Installing pkg-2.2.1...
[main-amd64-default-job-06] Extracting pkg-2.2.1: .......... done
===> cvs+ipv6-1.20120905_4 depends on file: /usr/local/sbin/pkg - found
===> Returning to build of cvs+ipv6-1.20120905_4
===========================================================================
=======================<phase: fetch-depends >============================
===== env: USE_PACKAGE_DEPENDS_ONLY=1 USER=root UID=0 GID=0
===========================================================================
=======================<phase: fetch >============================
===== env: NO_DEPENDS=yes USER=root UID=0 GID=0
===> NOTICE:
The cvs port currently does not have a maintainer. As a result, it is
more likely to have unresolved issues, not be up-to-date, or even be removed in
the future. To volunteer to maintain this port, please create an issue at:
https://bugs.freebsd.org/bugzilla
More information about port maintainership is available at:
https://docs.freebsd.org/en/articles/contributing/#ports-contributing
===> License GPLv2+ accepted by the user
===> Fetching all distfiles required by cvs+ipv6-1.20120905_4 for building
===========================================================================
=======================<phase: checksum >============================
===== env: NO_DEPENDS=yes USER=root UID=0 GID=0
===> NOTICE:
The cvs port currently does not have a maintainer. As a result, it is
<snip>
In file included from /wrkdirs/usr/ports/devel/cvs+ipv6/work/call/cvs-build/cvs/../..//cvs/src/watch.c:13:
/wrkdirs/usr/ports/devel/cvs+ipv6/work/call/cvs-build/cvs/../..//cvs/src/cvs.h:73:7: warning: a function declaration without a prototype is deprecated in all versions of C and is treated as a zero-parameter prototype in C23, conflicting with a previous declaration [-Wdeprecated-non-prototype]
73 | char *strerror ();
| ^
In file included from /wrkdirs/usr/ports/devel/cvs+ipv6/work/call/cvs-build/cvs/../..//cvs/src/watch.c:13:
In file included from /wrkdirs/usr/ports/devel/cvs+ipv6/work/call/cvs-build/cvs/../..//cvs/src/cvs.h:111:
/wrkdirs/usr/ports/devel/cvs+ipv6/work/call/cvs-build/cvs/../..//cvs/lib/regex.h:488:14: warning: a function declaration without a prototype is deprecated in all versions of C and is treated as a zero-parameter prototype in C23, conflicting with a previous declaration [-Wdeprecated-non-prototype]
488 | extern char *re_comp _RE_ARGS (());
| ^
/usr/include/unistd.h:560:7: note: conflicting prototype is here
560 | char *re_comp(const char *);
| ^
In file included from /wrkdirs/usr/ports/devel/cvs+ipv6/work/call/cvs-build/cvs/../..//cvs/src/watch.c:13:
In file included from /wrkdirs/usr/ports/devel/cvs+ipv6/work/call/cvs-build/cvs/../..//cvs/src/cvs.h:111:
/wrkdirs/usr/ports/devel/cvs+ipv6/work/call/cvs-build/cvs/../..//cvs/lib/regex.h:489:12: warning: a function declaration without a prototype is deprecated in all versions of C and is treated as a zero-parameter prototype in C23, conflicting with a previous declaration [-Wdeprecated-non-prototype]
489 | extern int re_exec _RE_ARGS (());
| ^
/usr/include/unistd.h:561:6: note: conflicting prototype is here
561 | int re_exec(const char *);
| ^
--- wrapper.o ---
In file included from /wrkdirs/usr/ports/devel/cvs+ipv6/work/call/cvs-build/cvs/../..//cvs/src/wrapper.c:11:
/wrkdirs/usr/ports/devel/cvs+ipv6/work/call/cvs-build/cvs/../..//cvs/src/cvs.h:73:7: warning: a function declaration without a prototype is deprecated in all versions of C and is treated as a zero-parameter prototype in C23, conflicting with a previous declaration [-Wdeprecated-non-prototype]
73 | char *strerror ();
| ^
--- watch.o ---
/wrkdirs/usr/ports/devel/cvs+ipv6/work/call/cvs-build/cvs/../..//cvs/src/watch.c:34:1: warning: a function definition without a prototype is deprecated in all versions of C and is not supported in C23 [-Wdeprecated-non-prototype]
34 | watch_modify_watchers (file, what)
| ^
/wrkdirs/usr/ports/devel/cvs+ipv6/work/call/cvs-build/cvs/../..//cvs/src/watch.c:220:1: warning: a function definition without a prototype is deprecated in all versions of C and is not supported in C23 [-Wdeprecated-non-prototype]
220 | addremove_fileproc (callerdat, finfo)
| ^
/wrkdirs/usr/ports/devel/cvs+ipv6/work/call/cvs-build/cvs/../..//cvs/src/watch.c:234:1: warning: a function definition without a prototype is deprecated in all versions of C and is not supported in C23 [-Wdeprecated-non-prototype]
234 | addremove_filesdoneproc (callerdat, err, repository, update_dir, entries)
| ^
/wrkdirs/usr/ports/devel/cvs+ipv6/work/call/cvs-build/cvs/../..//cvs/src/watch.c:249:1: warning: a function definition without a prototype is deprecated in all versions of C and is not supported in C23 [-Wdeprecated-non-prototype]
249 | watch_addremove (argc, argv)
| ^
/wrkdirs/usr/ports/devel/cvs+ipv6/work/call/cvs-build/cvs/../..//cvs/src/watch.c:263:24: warning: passing arguments to 'cvs_getopt' without a prototype is deprecated in all versions of C and is not supported in C23 [-Wdeprecated-non-prototype]
263 | while ((c = getopt (argc, argv, "+lRa:")) != -1)
| ^
/wrkdirs/usr/ports/devel/cvs+ipv6/work/call/cvs-build/cvs/../..//cvs/src/watch.c:354:1: warning: a function definition without a prototype is deprecated in all versions of C and is not supported in C23 [-Wdeprecated-non-prototype]
354 | watch_add (argc, argv)
| ^
/wrkdirs/usr/ports/devel/cvs+ipv6/work/call/cvs-build/cvs/../..//cvs/src/watch.c:363:1: warning: a function definition without a prototype is deprecated in all versions of C and is not supported in C23 [-Wdeprecated-non-prototype]
363 | watch_remove (argc, argv)
| ^
/wrkdirs/usr/ports/devel/cvs+ipv6/work/call/cvs-build/cvs/../..//cvs/src/watch.c:372:1: warning: a function definition without a prototype is deprecated in all versions of C and is not supported in C23 [-Wdeprecated-non-prototype]
372 | watch (argc, argv)
| ^
/wrkdirs/usr/ports/devel/cvs+ipv6/work/call/cvs-build/cvs/../..//cvs/src/watch.c:420:1: warning: a function definition without a prototype is deprecated in all versions of C and is not supported in C23 [-Wdeprecated-non-prototype]
420 | watchers_fileproc (callerdat, finfo)
| ^
/wrkdirs/usr/ports/devel/cvs+ipv6/work/call/cvs-build/cvs/../..//cvs/src/watch.c:472:1: warning: a function definition without a prototype is deprecated in all versions of C and is not supported in C23 [-Wdeprecated-non-prototype]
472 | watchers (argc, argv)
| ^
/wrkdirs/usr/ports/devel/cvs+ipv6/work/call/cvs-build/cvs/../..//cvs/src/watch.c:483:24: warning: passing arguments to 'cvs_getopt' without a prototype is deprecated in all versions of C and is not supported in C23 [-Wdeprecated-non-prototype]
483 | while ((c = getopt (argc, argv, "+lR")) != -1)
| ^
--- wrapper.o ---
In file included from /wrkdirs/usr/ports/devel/cvs+ipv6/work/call/cvs-build/cvs/../..//cvs/src/wrapper.c:11:
In file included from /wrkdirs/usr/ports/devel/cvs+ipv6/work/call/cvs-build/cvs/../..//cvs/src/cvs.h:111:
/wrkdirs/usr/ports/devel/cvs+ipv6/work/call/cvs-build/cvs/../..//cvs/lib/regex.h:488:14: warning: a function declaration without a prototype is deprecated in all versions of C and is treated as a zero-parameter prototype in C23, conflicting with a previous declaration [-Wdeprecated-non-prototype]
488 | extern char *re_comp _RE_ARGS (());
| ^
/usr/include/unistd.h:560:7: note: conflicting prototype is here
560 | char *re_comp(const char *);
| ^
In file included from /wrkdirs/usr/ports/devel/cvs+ipv6/work/call/cvs-build/cvs/../..//cvs/src/wrapper.c:11:
In file included from /wrkdirs/usr/ports/devel/cvs+ipv6/work/call/cvs-build/cvs/../..//cvs/src/cvs.h:111:
/wrkdirs/usr/ports/devel/cvs+ipv6/work/call/cvs-build/cvs/../..//cvs/lib/regex.h:489:12: warning: a function declaration without a prototype is deprecated in all versions of C and is treated as a zero-parameter prototype in C23, conflicting with a previous declaration [-Wdeprecated-non-prototype]
489 | extern int re_exec _RE_ARGS (());
| ^
/usr/include/unistd.h:561:6: note: conflicting prototype is here
561 | int re_exec(const char *);
| ^
/wrkdirs/usr/ports/devel/cvs+ipv6/work/call/cvs-build/cvs/../..//cvs/src/wrapper.c:199:1: warning: a function definition without a prototype is deprecated in all versions of C and is not supported in C23 [-Wdeprecated-non-prototype]
199 | wrap_unparse_rcs_options (line, first_call_p)
| ^
/wrkdirs/usr/ports/devel/cvs+ipv6/work/call/cvs-build/cvs/../..//cvs/src/wrapper.c:267:1: warning: a function definition without a prototype is deprecated in all versions of C and is not supported in C23 [-Wdeprecated-non-prototype]
267 | wrap_add_file (file, temp)
| ^
/wrkdirs/usr/ports/devel/cvs+ipv6/work/call/cvs-build/cvs/../..//cvs/src/wrapper.c:314:1: warning: a function definition without a prototype is deprecated in all versions of C and is not supported in C23 [-Wdeprecated-non-prototype]
314 | wrap_free_entry(e)
| ^
/wrkdirs/usr/ports/devel/cvs+ipv6/work/call/cvs-build/cvs/../..//cvs/src/wrapper.c:322:1: warning: a function definition without a prototype is deprecated in all versions of C and is not supported in C23 [-Wdeprecated-non-prototype]
322 | wrap_free_entry_internal(e)
| ^
/wrkdirs/usr/ports/devel/cvs+ipv6/work/call/cvs-build/cvs/../..//cvs/src/wrapper.c:354:1: warning: a function definition without a prototype is deprecated in all versions of C and is not supported in C23 [-Wdeprecated-non-prototype]
354 | wrap_add (line, isTemp)
| ^
/wrkdirs/usr/ports/devel/cvs+ipv6/work/call/cvs-build/cvs/../..//cvs/src/wrapper.c:470:1: warning: a function definition without a prototype is deprecated in all versions of C and is not supported in C23 [-Wdeprecated-non-prototype]
470 | wrap_add_entry(e, temp)
| ^
/wrkdirs/usr/ports/devel/cvs+ipv6/work/call/cvs-build/cvs/../..//cvs/src/wrapper.c:494:1: warning: a function definition without a prototype is deprecated in all versions of C and is not supported in C23 [-Wdeprecated-non-prototype]
494 | wrap_name_has (name,has)
| ^
/wrkdirs/usr/ports/devel/cvs+ipv6/work/call/cvs-build/cvs/../..//cvs/src/wrapper.c:527:1: warning: a function definition without a prototype is deprecated in all versions of C and is not supported in C23 [-Wdeprecated-non-prototype]
527 | wrap_matching_entry (name)
| ^
/wrkdirs/usr/ports/devel/cvs+ipv6/work/call/cvs-build/cvs/../..//cvs/src/wrapper.c:542:1: warning: a function definition without a prototype is deprecated in all versions of C and is not supported in C23 [-Wdeprecated-non-prototype]
542 | wrap_rcsoption (filename, asflag)
| ^
/wrkdirs/usr/ports/devel/cvs+ipv6/work/call/cvs-build/cvs/../..//cvs/src/wrapper.c:566:1: warning: a function definition without a prototype is deprecated in all versions of C and is not supported in C23 [-Wdeprecated-non-prototype]
566 | wrap_tocvs_process_file(fileName)
| ^
/wrkdirs/usr/ports/devel/cvs+ipv6/work/call/cvs-build/cvs/../..//cvs/src/wrapper.c:594:1: warning: a function definition without a prototype is deprecated in all versions of C and is not supported in C23 [-Wdeprecated-non-prototype]
594 | wrap_merge_is_copy (fileName)
| ^
/wrkdirs/usr/ports/devel/cvs+ipv6/work/call/cvs-build/cvs/../..//cvs/src/wrapper.c:605:1: warning: a function definition without a prototype is deprecated in all versions of C and is not supported in C23 [-Wdeprecated-non-prototype]
605 | wrap_fromcvs_process_file(fileName)
| ^
--- update.o ---
23 warnings generated.
--- zlib.o ---
cc -O2 -pipe -fstack-protector-strong -fno-strict-aliasing -I/wrkdirs/usr/ports/devel/cvs+ipv6/work/call/cvs-build/cvs -I../lib -DHAVE_CONFIG_H -I/wrkdirs/usr/ports/devel/cvs+ipv6/work/call/cvs-build/cvs/../..//cvs/src -I/usr/include/gnu -I/wrkdirs/usr/ports/devel/cvs+ipv6/work/call/cvs-build/cvs/../..//cvs/lib -I/wrkdirs/usr/ports/devel/cvs+ipv6/work/call/cvs-build/cvs/../..//cvs/diff -I. -DHAVE_GSSAPI -DENCRYPTION -MD -MF.depend.zlib.o -MTzlib.o -std=gnu17 -Wno-format-zero-length -nobuiltininc -idirafter /usr/lib/clang/19/include -fstack-protector-strong -Qunused-arguments -c /wrkdirs/usr/ports/devel/cvs+ipv6/work/call/cvs-build/cvs/../..//cvs/src/zlib.c -o zlib.o
--- watch.o ---
14 warnings generated.
--- cvs.1.gz ---
gzip -cn /wrkdirs/usr/ports/devel/cvs+ipv6/work/call/cvs-build/cvs/../..//cvs/man/cvs.1 > cvs.1.gz
--- zlib.o ---
In file included from /wrkdirs/usr/ports/devel/cvs+ipv6/work/call/cvs-build/cvs/../..//cvs/src/zlib.c:20:
/wrkdirs/usr/ports/devel/cvs+ipv6/work/call/cvs-build/cvs/../..//cvs/src/cvs.h:73:7: warning: a function declaration without a prototype is deprecated in all versions of C and is treated as a zero-parameter prototype in C23, conflicting with a previous declaration [-Wdeprecated-non-prototype]
73 | char *strerror ();
| ^
In file included from /wrkdirs/usr/ports/devel/cvs+ipv6/work/call/cvs-build/cvs/../..//cvs/src/zlib.c:20:
In file included from /wrkdirs/usr/ports/devel/cvs+ipv6/work/call/cvs-build/cvs/../..//cvs/src/cvs.h:111:
/wrkdirs/usr/ports/devel/cvs+ipv6/work/call/cvs-build/cvs/../..//cvs/lib/regex.h:488:14: warning: a function declaration without a prototype is deprecated in all versions of C and is treated as a zero-parameter prototype in C23, conflicting with a previous declaration [-Wdeprecated-non-prototype]
488 | extern char *re_comp _RE_ARGS (());
| ^
/usr/include/unistd.h:560:7: note: conflicting prototype is here
560 | char *re_comp(const char *);
| ^
In file included from /wrkdirs/usr/ports/devel/cvs+ipv6/work/call/cvs-build/cvs/../..//cvs/src/zlib.c:20:
In file included from /wrkdirs/usr/ports/devel/cvs+ipv6/work/call/cvs-build/cvs/../..//cvs/src/cvs.h:111:
/wrkdirs/usr/ports/devel/cvs+ipv6/work/call/cvs-build/cvs/../..//cvs/lib/regex.h:489:12: warning: a function declaration without a prototype is deprecated in all versions of C and is treated as a zero-parameter prototype in C23, conflicting with a previous declaration [-Wdeprecated-non-prototype]
489 | extern int re_exec _RE_ARGS (());
| ^
/usr/include/unistd.h:561:6: note: conflicting prototype is here
561 | int re_exec(const char *);
| ^
/wrkdirs/usr/ports/devel/cvs+ipv6/work/call/cvs-build/cvs/../..//cvs/src/zlib.c:60:1: warning: a function definition without a prototype is deprecated in all versions of C and is not supported in C23 [-Wdeprecated-non-prototype]
60 | compress_error (status, zstatus, zstr, msg)
| ^
/wrkdirs/usr/ports/devel/cvs+ipv6/work/call/cvs-build/cvs/../..//cvs/src/zlib.c:87:1: warning: a function definition without a prototype is deprecated in all versions of C and is not supported in C23 [-Wdeprecated-non-prototype]
87 | compress_buffer_initialize (buf, input, level, memory)
| ^
/wrkdirs/usr/ports/devel/cvs+ipv6/work/call/cvs-build/cvs/../..//cvs/src/zlib.c:132:1: warning: a function definition without a prototype is deprecated in all versions of C and is not supported in C23 [-Wdeprecated-non-prototype]
132 | compress_buffer_input (closure, data, need, size, got)
| ^
/wrkdirs/usr/ports/devel/cvs+ipv6/work/call/cvs-build/cvs/../..//cvs/src/zlib.c:251:1: warning: a function definition without a prototype is deprecated in all versions of C and is not supported in C23 [-Wdeprecated-non-prototype]
251 | compress_buffer_output (closure, data, have, wrote)
| ^
/wrkdirs/usr/ports/devel/cvs+ipv6/work/call/cvs-build/cvs/../..//cvs/src/zlib.c:293:1: warning: a function definition without a prototype is deprecated in all versions of C and is not supported in C23 [-Wdeprecated-non-prototype]
293 | compress_buffer_flush (closure)
| ^
/wrkdirs/usr/ports/devel/cvs+ipv6/work/call/cvs-build/cvs/../..//cvs/src/zlib.c:343:1: warning: a function definition without a prototype is deprecated in all versions of C and is not supported in C23 [-Wdeprecated-non-prototype]
343 | compress_buffer_block (closure, block)
| ^
/wrkdirs/usr/ports/devel/cvs+ipv6/work/call/cvs-build/cvs/../..//cvs/src/zlib.c:358:1: warning: a function definition without a prototype is deprecated in all versions of C and is not supported in C23 [-Wdeprecated-non-prototype]
358 | compress_buffer_shutdown_input (buf)
| ^
/wrkdirs/usr/ports/devel/cvs+ipv6/work/call/cvs-build/cvs/../..//cvs/src/zlib.c:382:1: warning: a function definition without a prototype is deprecated in all versions of C and is not supported in C23 [-Wdeprecated-non-prototype]
382 | compress_buffer_shutdown_output (buf)
| ^
/wrkdirs/usr/ports/devel/cvs+ipv6/work/call/cvs-build/cvs/../..//cvs/src/zlib.c:447:1: warning: a function definition without a prototype is deprecated in all versions of C and is not supported in C23 [-Wdeprecated-non-prototype]
447 | gunzip_and_write (fd, fullname, buf, size)
| ^
/wrkdirs/usr/ports/devel/cvs+ipv6/work/call/cvs-build/cvs/../..//cvs/src/zlib.c:611:1: warning: a function definition without a prototype is deprecated in all versions of C and is not supported in C23 [-Wdeprecated-non-prototype]
611 | read_and_gzip (fd, fullname, buf, size, len, level)
| ^
--- wrapper.o ---
15 warnings generated.
--- zlib.o ---
13 warnings generated.
--- cvs ---
cc -O2 -pipe -fstack-protector-strong -fno-strict-aliasing -I/wrkdirs/usr/ports/devel/cvs+ipv6/work/call/cvs-build/cvs -I../lib -DHAVE_CONFIG_H -I/wrkdirs/usr/ports/devel/cvs+ipv6/work/call/cvs-build/cvs/../..//cvs/src -I/usr/include/gnu -I/wrkdirs/usr/ports/devel/cvs+ipv6/work/call/cvs-build/cvs/../..//cvs/lib -I/wrkdirs/usr/ports/devel/cvs+ipv6/work/call/cvs-build/cvs/../..//cvs/diff -I. -DHAVE_GSSAPI -DENCRYPTION -std=gnu17 -Wno-format-zero-length -nobuiltininc -idirafter /usr/lib/clang/19/include -fstack-protector-strong -Qunused-arguments -Wl,-zrelro -o cvs add.o admin.o annotate.o buffer.o checkin.o checkout.o classify.o client.o commit.o create_adm.o cvsrc.o diff.o edit.o entries.o error.o expand_path.o fileattr.o filesubr.o find_names.o hardlink.o hash.o history.o ignore.o import.o lock.o log.o login.o logmsg.o main.o mkmodules.o modules.o myndbm.o no_diff.o parseinfo.o patch.o prepend_args.o rcs.o rcscmds.o recurse.o release.o remove.o repos.o root.o run.o scra
mble.o server.o stack.o status.o subr.o tag.o update.o vers_ts.o version.o watch.o wrapper.o zlib.o /wrkdirs/usr/ports/devel/cvs+ipv6/work/call/cvs-build/cvs/../lib/libcvs.a /wrkdirs/usr/ports/devel/cvs+ipv6/work/call/cvs-build/cvs/../libdiff/libdiff.a -lmd -lcrypt -lz -lgssapi -lkrb5 -lhx509 -lasn1 -lcrypto -lroken -lcrypt -lcom_err
ld: error: unable to find library -lhx509
ld: error: unable to find library -lasn1
ld: error: unable to find library -lroken
cc: error: linker command failed with exit code 1 (use -v to see invocation)
*** [cvs] Error code 1
make[1]: stopped making "all" in /wrkdirs/usr/ports/devel/cvs+ipv6/work/call/cvs-build/cvs
make[1]: 1 error
make[1]: stopped making "all" in /wrkdirs/usr/ports/devel/cvs+ipv6/work/call/cvs-build/cvs
make: stopped making "all" in /wrkdirs/usr/ports/devel/cvs+ipv6/work/call/cvs-build
===> Compilation failed unexpectedly.
Try to set MAKE_JOBS_UNSAFE=yes and rebuild before reporting the failure to
the maintainer.
*** Error code 1
Stop.
make: stopped making "build" in /usr/ports/devel/cvs+ipv6