[package - 142arm64-quarterly][mail/claws-mail] Failed for claws-mail-3.21.0_1 in build

From: <pkg-fallout_at_FreeBSD.org>
Date: Wed, 06 Aug 2025 12:30:24 UTC
You are receiving this mail as a port that you maintain
is failing to build on the FreeBSD package build server.
Please investigate the failure and submit a PR to fix
build.

Maintainer:     portmaster@bsdforge.com
Log URL:        https://pkg-status.freebsd.org/ampere1/data/142arm64-quarterly/6f2d24d37f72/logs/claws-mail-3.21.0_1.log
Build URL:      https://pkg-status.freebsd.org/ampere1/build.html?mastername=142arm64-quarterly&build=6f2d24d37f72
Log:

=>> Building mail/claws-mail
build started at Wed Aug  6 12:24:52 UTC 2025
port directory: /usr/ports/mail/claws-mail
package name: claws-mail-3.21.0_1
building for: FreeBSD 142arm64-quarterly-job-12 14.2-RELEASE-p4 FreeBSD 14.2-RELEASE-p4 arm64
maintained by: portmaster@bsdforge.com
Makefile datestamp: -rw-r--r--  1 root wheel 2650 Jul  3 01:02 /usr/ports/mail/claws-mail/Makefile
Ports top last git commit: 6f2d24d37
Ports top unclean checkout: no
Port dir last git commit: d7951ee86
Port dir unclean checkout: no
Poudriere version: poudriere-git-3.4.3
Host OSVERSION: 1500052
Jail OSVERSION: 1402000
Job Id: 12

---Begin Environment---
SHELL=/bin/sh
OSVERSION=1402000
UNAME_v=FreeBSD 14.2-RELEASE-p4
UNAME_r=14.2-RELEASE-p4
BLOCKSIZE=K
MAIL=/var/mail/root
MM_CHARSET=UTF-8
LANG=C.UTF-8
STATUS=1
HOME=/root
PATH=/sbin:/bin:/usr/sbin:/usr/bin:/usr/local/sbin:/usr/local/bin:/root/bin
MAKE_OBJDIR_CHECK_WRITABLE=0
LOCALBASE=/usr/local
USER=root
POUDRIERE_NAME=poudriere-git
LIBEXECPREFIX=/usr/local/libexec/poudriere
POUDRIERE_VERSION=3.4.3
MASTERMNT=/usr/local/poudriere/data/.m/142arm64-quarterly/ref
LC_COLLATE=C
POUDRIERE_BUILD_TYPE=bulk
PACKAGE_BUILDING=yes
SAVED_TERM=
OUTPUT_REDIRECTED_STDERR=4
OUTPUT_REDIRECTED=1
PWD=/usr/local/poudriere/data/.m/142arm64-quarterly/12/.p
OUTPUT_REDIRECTED_STDOUT=3
P_PORTS_FEATURES=FLAVORS SUBPACKAGES SELECTED_OPTIONS
MASTERNAME=142arm64-quarterly
SCRIPTPREFIX=/usr/local/share/poudriere
SCRIPTNAME=bulk.sh
OLDPWD=/usr/local/poudriere/data/.m/142arm64-quarterly/ref/.p/pool
POUDRIERE_PKGNAME=poudriere-git-3.4.3
SCRIPTPATH=/usr/local/share/poudriere/bulk.sh
POUDRIEREPATH=/usr/local/bin/poudriere
---End Environment---

---Begin Poudriere Port Flags/Env---
PORT_FLAGS=
PKGENV=
FLAVOR=
MAKE_ARGS=
---End Poudriere Port Flags/Env---

---Begin OPTIONS List---
===> The following configuration options are available for claws-mail-3.21.0_1:
     COMPFACE=on: X-Face support
     DEBUG=off: Build with debugging support
     DOCS=on: Build and/or install documentation
     ENCHANT=on: Spell checking support
     IPV6=on: IPv6 protocol support
     LDAP=off: LDAP protocol support
     NLS=on: Native Language Support
     STARTUP=on: Startup notification support
     THEMES=on: Additional themes
====> Options available for the radio BRANCH: you can only select none or one of them
     GTK2=on: Build GTK2+ release
     GTK3=off: Build GTK3+ release
===> Use 'make config' to modify these settings
---End OPTIONS List---

--MAINTAINER--
portmaster@bsdforge.com
--End MAINTAINER--

--CONFIGURE_ARGS--
--enable-compface --enable-enchant --enable-ipv6 --disable-ldap --enable-startup-notification  --disable-dbus --disable-static --enable-nls --disable-acpi_notifier-plugin --disable-address_keeper-plugin --disable-archive-plugin --disable-att_remover-plugin --disable-attachwarner-plugin --disable-bogofilter-plugin --disable-bsfilter-plugin --disable-clamd-plugin --disable-dillo-plugin --disable-fancy-plugin --disable-fetchinfo-plugin --disable-gdata-plugin --disable-keyword_warner-plugin --disable-libravatar-plugin --disable-litehtml_viewer-plugin --disable-mailmbox-plugin --disable-managesieve-plugin --disable-newmail-plugin --disable-notification-plugin --disable-pdf_viewer-plugin --disable-perl-plugin --disable-python-plugin --disable-pgpcore-plugin --disable-pgpinline-plugin --disable-pgpmime-plugin --disable-rssyl-plugin --disable-smime-plugin --disable-spam_report-plugin --disable-spamassassin-plugin --disable-tnef_parse-plugin --disable-vcalendar-plugin --x-libraries=/
usr/local/lib --x-includes=/usr/local/include --prefix=/usr/local ${_LATE_CONFIGURE_ARGS}
--End CONFIGURE_ARGS--

--CONFIGURE_ENV--
ac_cv_path_PERL=/usr/local/bin/perl ac_cv_path_PERL_PATH=/usr/local/bin/perl  PERL_USE_UNSAFE_INC=1 PYTHON="/usr/local/bin/python3.11" MAKE=/usr/local/bin/gmake PKG_CONFIG=pkgconf XDG_DATA_HOME=/wrkdirs/usr/ports/mail/claws-mail/work  XDG_CONFIG_HOME=/wrkdirs/usr/ports/mail/claws-mail/work  XDG_CACHE_HOME=/wrkdirs/usr/ports/mail/claws-mail/work/.cache  HOME=/wrkdirs/usr/ports/mail/claws-mail/work TMPDIR="/tmp" PATH=/wrkdirs/usr/ports/mail/claws-mail/work/.bin:/sbin:/bin:/usr/sbin:/usr/bin:/usr/local/sbin:/usr/local/bin:/root/bin PKG_CONFIG_LIBDIR=/wrkdirs/usr/ports/mail/claws-mail/work/.pkgconfig:/usr/local/libdata/pkgconfig:/usr/local/share/pkgconfig:/usr/libdata/pkgconfig SHELL=/bin/sh CONFIG_SHELL=/bin/sh CONFIG_SITE=/usr/ports/Templates/config.site lt_cv_sys_max_cmd_len=524288
--End CONFIGURE_ENV--

--MAKE_ENV--
PERL_USE_UNSAFE_INC=1 XDG_DATA_HOME=/wrkdirs/usr/ports/mail/claws-mail/work  XDG_CONFIG_HOME=/wrkdirs/usr/ports/mail/claws-mail/work  XDG_CACHE_HOME=/wrkdirs/usr/ports/mail/claws-mail/work/.cache  HOME=/wrkdirs/usr/ports/mail/claws-mail/work TMPDIR="/tmp" PATH=/wrkdirs/usr/ports/mail/claws-mail/work/.bin:/sbin:/bin:/usr/sbin:/usr/bin:/usr/local/sbin:/usr/local/bin:/root/bin PKG_CONFIG_LIBDIR=/wrkdirs/usr/ports/mail/claws-mail/work/.pkgconfig:/usr/local/libdata/pkgconfig:/usr/local/share/pkgconfig:/usr/libdata/pkgconfig MK_DEBUG_FILES=no MK_KERNEL_SYMBOLS=no SHELL=/bin/sh NO_LINT=YES PREFIX=/usr/local  LOCALBASE=/usr/local  CC="cc" CFLAGS="-O2 -pipe  -DLIBICONV_PLUG -fstack-protector-strong -fno-strict-aliasing "  CPP="cpp" CPPFLAGS="-DGDK_DISABLE_DEPRECATION_WARNINGS -DLIBICONV_PLUG"  LDFLAGS=" -fstack-protector-strong " LIBS=""  CXX="c++" CXXFLAGS="-O2 -pipe -DLIBICONV_PLUG -fstack-protector-strong -fno-strict-aliasing  -DLIBICONV_PLUG " BSD_INSTALL_PROGRAM="install  -s -m 
555"  BSD_INSTALL_LIB="install  -s -m 0644"  BSD_INSTALL_SCRIPT="install  -m 555"  BSD_INSTALL_DATA="install  -m 0644"  BSD_INSTALL_MAN="install  -m 444"
--End MAKE_ENV--

--PLIST_SUB--
PORTDOCS="" COMPFACE="" NO_COMPFACE="@comment " DEBUG="@comment " NO_DEBUG="" DOCS="" NO_DOCS="@comment " ENCHANT="" NO_ENCHANT="@comment " GTK2="" NO_GTK2="@comment " GTK3="@comment " NO_GTK3="" IPV6="" NO_IPV6="@comment " LDAP="@comment " NO_LDAP="" NLS="" NO_NLS="@comment " STARTUP="" NO_STARTUP="@comment " THEMES="" NO_THEMES="@comment " PYTHON_INCLUDEDIR=include/python3.11  PYTHON_LIBDIR=lib/python3.11  PYTHON_PLATFORM=freebsd14  PYTHON_SITELIBDIR=lib/python3.11/site-packages  PYTHON_SUFFIX=311  PYTHON_BASESUFFIX=311  PYTHON_TAG=.cpython-311  PYTHON_SOABI=.cpython-311  PYTHON_VER=3.11  PYTHON_BASEVER=3.11  PYTHON_VERSION=python3.11 PYTHON2="@comment " PYTHON3="" GTK2_VERSION="2.10.0"  GTK3_VERSION="3.0.0"  GTK4_VERSION="4.0.0" OSREL=14.2 PREFIX=%D LOCALBASE=/usr/local  RESETPREFIX=/usr/local LIB32DIR=lib PERL_VERSION=5.40.2  PERL_VER=5.40  PERL5_MAN1=lib/perl5/site_perl/man/man1  PERL5_MAN3=lib/perl5/site_perl/man/man3  SITE_PERL=lib/perl5/site_perl  SITE_ARCH=lib/perl5
/site_perl/mach/5.40 DOCSDIR="share/doc/claws-mail"  EXAMPLESDIR="share/examples/claws-mail"  DATADIR="share/claws-mail"  WWWDIR="www/claws-mail"  ETCDIR="etc/claws-mail"
--End PLIST_SUB--

--SUB_LIST--
 COMPFACE="" NO_COMPFACE="@comment " DEBUG="@comment " NO_DEBUG="" DOCS="" NO_DOCS="@comment " ENCHANT="" NO_ENCHANT="@comment " GTK2="" NO_GTK2="@comment " GTK3="@comment " NO_GTK3="" IPV6="" NO_IPV6="@comment " LDAP="@comment " NO_LDAP="" NLS="" NO_NLS="@comment " STARTUP="" NO_STARTUP="@comment " THEMES="" NO_THEMES="@comment " PYTHON_INCLUDEDIR=/usr/local/include/python3.11  PYTHON_LIBDIR=/usr/local/lib/python3.11  PYTHON_PLATFORM=freebsd14  PYTHON_SITELIBDIR=/usr/local/lib/python3.11/site-packages  PYTHON_SUFFIX=311  PYTHON_BASESUFFIX=311  PYTHON_TAG=.cpython-311  PYTHON_SOABI=.cpython-311  PYTHON_VER=3.11  PYTHON_BASEVER=3.11  PYTHON_VERSION=python3.11 PYTHON2="@comment " PYTHON3="" PREFIX=/usr/local LOCALBASE=/usr/local  DATADIR=/usr/local/share/claws-mail DOCSDIR=/usr/local/share/doc/claws-mail EXAMPLESDIR=/usr/local/share/examples/claws-mail  WWWDIR=/usr/local/www/claws-mail ETCDIR=/usr/local/etc/claws-mail
--End SUB_LIST--

---Begin make.conf---
USE_PACKAGE_DEPENDS=yes
BATCH=yes
WRKDIRPREFIX=/wrkdirs
PORTSDIR=/usr/ports
PACKAGES=/packages
DISTDIR=/distfiles
PACKAGE_BUILDING=yes
PACKAGE_BUILDING_FLAVORS=yes
####  ####
# XXX: We really need this but cannot use it while 'make checksum' does not
# try the next mirror on checksum failure.  It currently retries the same
# failed mirror and then fails rather then trying another.  It *does*
# try the next if the size is mismatched though.
#MASTER_SITE_FREEBSD=yes
# Build ALLOW_MAKE_JOBS_PACKAGES with 3 jobs
MAKE_JOBS_NUMBER=3
#### Misc Poudriere ####
.include "/etc/make.conf.ports_env"
GID=0
UID=0
---End make.conf---
--Resource limits--
cpu time               (seconds, -t)  unlimited
file size           (512-blocks, -f)  unlimited
data seg size           (kbytes, -d)  1048576
stack size              (kbytes, -s)  1048576
core file size      (512-blocks, -c)  unlimited
max memory size         (kbytes, -m)  unlimited
locked memory           (kbytes, -l)  unlimited
max user processes              (-u)  89999
open files                      (-n)  8192
virtual mem size        (kbytes, -v)  unlimited
swap limit              (kbytes, -w)  unlimited
socket buffer size       (bytes, -b)  unlimited
pseudo-terminals                (-p)  unlimited
kqueues                         (-k)  unlimited
umtx shared locks               (-o)  unlimited
pipebuf                         (-y)  unlimited
--End resource limits--
=======================<phase: check-sanity   >============================
===== env: NO_DEPENDS=yes USER=root UID=0 GID=0
===>  License GPLv3 accepted by the user
===========================================================================
=======================<phase: pkg-depends    >============================
===== env: USE_PACKAGE_DEPENDS_ONLY=1 USER=root UID=0 GID=0
===>   claws-mail-3.21.0_1 depends on file: /usr/local/sbin/pkg - not found
===>   Installing existing package /packages/All/pkg-2.2.1.pkg
[142arm64-quarterly-job-12] Installing pkg-2.2.1...
[142arm64-quarterly-job-12] Extracting pkg-2.2.1: .......... done
===>   claws-mail-3.21.0_1 depends on file: /usr/local/sbin/pkg - found
===>   Returning to build of claws-mail-3.21.0_1
===========================================================================
=======================<phase: fetch-depends  >============================
===== env: USE_PACKAGE_DEPENDS_ONLY=1 USER=root UID=0 GID=0
===========================================================================
=======================<phase: fetch          >============================
===== env: NO_DEPENDS=yes USER=root UID=0 GID=0
===>  License GPLv3 accepted by the user
===> Fetching all distfiles required by claws-mail-3.21.0_1 for building
===========================================================================
=======================<phase: checksum       >============================
===== env: NO_DEPENDS=yes USER=root UID=0 GID=0
===>  License GPLv3 accepted by the user
===> Fetching all distfiles required by claws-mail-3.21.0_1 for building
=> SHA256 Checksum OK for claws-mail-3.21.0.tar.xz.
===========================================================================
=======================<phase: extract-depends>============================
===== env: USE_PACKAGE_DEPENDS_ONLY=1 USER=root UID=0 GID=0
===========================================================================
=======================<phase: extract        >============================
===== env: NO_DEPENDS=yes USER=root UID=0 GID=0
===>  License GPLv3 accepted by the user
===> Fetching all distfiles required by claws-mail-3.21.0_1 for building
===>  Extracting for claws-mail-3.21.0_1
=> SHA256 Checksum OK for claws-mail-3.21.0.tar.xz.
===========================================================================
=======================<phase: patch-depends  >============================
===== env: USE_PACKAGE_DEPENDS_ONLY=1 USER=root UID=0 GID=0
===========================================================================
=======================<phase: patch          >============================
===== env: NO_DEPENDS=yes USER=root UID=0 GID=0
===>  Patching for claws-mail-3.21.0_1
===>  Applying FreeBSD patches for claws-mail-3.21.0_1 from /usr/ports/mail/claws-mail/files
===========================================================================
=======================<phase: build-depends  >============================
===== env: USE_PACKAGE_DEPENDS_ONLY=1 USER=root UID=0 GID=0
===>   claws-mail-3.21.0_1 depends on executable: update-desktop-database - not found
===>   Installing existing package /packages/All/desktop-file-utils-0.28.pkg
[142arm64-quarterly-job-12] Installing desktop-file-utils-0.28...
[142arm64-quarterly-job-12] `-- Installing gettext-runtime-0.23.1...
[142arm64-quarterly-job-12] |   `-- Installing indexinfo-0.3.1_1...
[142arm64-quarterly-job-12] |   `-- Extracting indexinfo-0.3.1_1: .... done
[142arm64-quarterly-job-12] `-- Extracting gettext-runtime-0.23.1: .......... done
[142arm64-quarterly-job-12] `-- Installing glib-2.84.1_2,2...
[142arm64-quarterly-job-12] |   `-- Installing libffi-3.5.1...
[142arm64-quarterly-job-12] |   `-- Extracting libffi-3.5.1: .......... done
[142arm64-quarterly-job-12] |   `-- Installing libiconv-1.17_1...
<snip>
/bin/sh ../libtool  --tag=CC   --mode=link cc -Wall -Wno-pointer-sign -O2 -pipe  -DLIBICONV_PLUG -fstack-protector-strong -fno-strict-aliasing   -fstack-protector-strong  -L/usr/local/lib -Wl,--export-dynamic -o claws-mail account.o action.o addrcache.o addr_compl.o addressadd.o addrgather.o addrharvest.o addritem.o advsearch.o alertpanel.o autofaces.o avatars.o compose.o crash.o customheader.o displayheader.o edittags.o enriched.o entity.o export.o file_checker.o filtering.o folder.o folder_item_prefs.o foldersel.o folderutils.o folderview.o grouplistdialog.o headerview.o html.o image_viewer.o imap.o imap_gtk.o import.o inc.o localfolder.o main.o mainwindow.o manual.o matcher.o matcher_parser_lex.o matcher_parser_parse.o mbox.o message_search.o messageview.o mh.o mh_gtk.o mimeview.o msgcache.o news.o news_gtk.o noticeview.o oauth2.o partial_download.o password.o password_gtk.o passwordstore.o pop.o prefs_account.o prefs_actions.o prefs_common.o prefs_compose_writing.o prefs
_customheader.o prefs_display_header.o prefs_ext_prog.o prefs_filtering_action.o prefs_filtering.o prefs_folder_item.o prefs_fonts.o prefs_gtk.o prefs_image_viewer.o prefs_logging.o prefs_matcher.o prefs_message.o prefs_migration.o prefs_msg_colors.o prefs_other.o prefs_proxy.o prefs_quote.o prefs_receive.o prefs_send.o prefs_spelling.o prefs_summaries.o prefs_summary_column.o prefs_summary_open.o prefs_folder_column.o prefs_template.o prefs_themes.o prefs_toolbar.o prefs_wrapping.o printing.o privacy.o procheader.o procmime.o procmsg.o quote_fmt.o quote_fmt_lex.o quote_fmt_parse.o recv.o remotefolder.o send_message.o setup.o sourcewindow.o ssl_manager.o statusbar.o stock_pixmap.o summary_search.o summaryview.o textview.o toolbar.o undo.o uri_opener.o wizard.o addrbook.o addrclip.o addrcustomattr.o addressbook.o addressbook_foldersel.o addrindex.o addrquery.o addrselect.o addrduplicates.o addrmerge.o browseldap.o editaddress.o editaddress_other_attributes_ldap.o editbook.o e
ditgroup.o editjpilot.o editldap_basedn.o editldap.o editvcard.o exphtmldlg.o expldifdlg.o exporthtml.o exportldif.o importldif.o importmutt.o importpine.o jpilot.o ldapctrl.o ldaplocate.o ldapquery.o ldapserver.o ldapupdate.o ldaputil.o ldif.o mutt.o pine.o vcard.o etpan/libclawsetpan.la gtk/libclawsgtk.la -L/usr/local/lib -lenchant -lgmodule-2.0 -pthread -lglib-2.0 -lintl -lintl -L/usr/local/lib -lgtk-x11-2.0 -lgdk-x11-2.0 -lpangocairo-1.0 -latk-1.0 -lgdk_pixbuf-2.0 -lpangoft2-1.0 -lpango-1.0 -lgio-2.0 -lcairo -lfontconfig -lharfbuzz -lfreetype -lgobject-2.0 -lglib-2.0 -lintl  -L/usr/local/lib -lgnutls -L/usr/local/lib -lnettle -lcompface  -lpthread -lSM -lICE  -L/usr/local/lib -lstartup-notification-1 -L/usr/local/lib -letpan  -L/usr/local/lib -lrsvg-2 -lgdk_pixbuf-2.0 -lgio-2.0 -lgobject-2.0 -lglib-2.0 -lintl -lcairo  -lexecinfo  -lm 
libtool: link: cc -Wall -Wno-pointer-sign -O2 -pipe -DLIBICONV_PLUG -fstack-protector-strong -fno-strict-aliasing -fstack-protector-strong -Wl,--export-dynamic -o claws-mail account.o action.o addrcache.o addr_compl.o addressadd.o addrgather.o addrharvest.o addritem.o advsearch.o alertpanel.o autofaces.o avatars.o compose.o crash.o customheader.o displayheader.o edittags.o enriched.o entity.o export.o file_checker.o filtering.o folder.o folder_item_prefs.o foldersel.o folderutils.o folderview.o grouplistdialog.o headerview.o html.o image_viewer.o imap.o imap_gtk.o import.o inc.o localfolder.o main.o mainwindow.o manual.o matcher.o matcher_parser_lex.o matcher_parser_parse.o mbox.o message_search.o messageview.o mh.o mh_gtk.o mimeview.o msgcache.o news.o news_gtk.o noticeview.o oauth2.o partial_download.o password.o password_gtk.o passwordstore.o pop.o prefs_account.o prefs_actions.o prefs_common.o prefs_compose_writing.o prefs_customheader.o prefs_display_header.o prefs_ext_
prog.o prefs_filtering_action.o prefs_filtering.o prefs_folder_item.o prefs_fonts.o prefs_gtk.o prefs_image_viewer.o prefs_logging.o prefs_matcher.o prefs_message.o prefs_migration.o prefs_msg_colors.o prefs_other.o prefs_proxy.o prefs_quote.o prefs_receive.o prefs_send.o prefs_spelling.o prefs_summaries.o prefs_summary_column.o prefs_summary_open.o prefs_folder_column.o prefs_template.o prefs_themes.o prefs_toolbar.o prefs_wrapping.o printing.o privacy.o procheader.o procmime.o procmsg.o quote_fmt.o quote_fmt_lex.o quote_fmt_parse.o recv.o remotefolder.o send_message.o setup.o sourcewindow.o ssl_manager.o statusbar.o stock_pixmap.o summary_search.o summaryview.o textview.o toolbar.o undo.o uri_opener.o wizard.o addrbook.o addrclip.o addrcustomattr.o addressbook.o addressbook_foldersel.o addrindex.o addrquery.o addrselect.o addrduplicates.o addrmerge.o browseldap.o editaddress.o editaddress_other_attributes_ldap.o editbook.o editgroup.o editjpilot.o editldap_basedn.o editlda
p.o editvcard.o exphtmldlg.o expldifdlg.o exporthtml.o exportldif.o importldif.o importmutt.o importpine.o jpilot.o ldapctrl.o ldaplocate.o ldapquery.o ldapserver.o ldapupdate.o ldaputil.o ldif.o mutt.o pine.o vcard.o  -L/usr/local/lib etpan/.libs/libclawsetpan.a gtk/.libs/libclawsgtk.a -lgthread-2.0 -lenchant -lgmodule-2.0 -lgtk-x11-2.0 -lgdk-x11-2.0 -lpangocairo-1.0 -latk-1.0 -lpangoft2-1.0 -lpango-1.0 -lfontconfig -lharfbuzz -lfreetype -lgnutls -lnettle -lcompface -lpthread -lSM -lICE -lstartup-notification-1 -letpan -lrsvg-2 -lgdk_pixbuf-2.0 -lgio-2.0 -lgobject-2.0 -lglib-2.0 -lintl -lcairo -lexecinfo -lm -pthread
ld: error: undefined symbol: gtk_ui_manager_get_accel_group
>>> referenced by action.c
>>>               action.o:(action_update_menu)
>>> referenced by addressbook.c
>>>               addressbook.o:(addressbook_create)
>>> referenced by summaryview.c
>>>               summaryview.o:(summary_colorlabel_menu_create)
>>> referenced 13 more times

ld: error: undefined symbol: gtk_widget_show
>>> referenced by action.c
>>>               action.o:(action_update_menu)
>>> referenced by action.c
>>>               action.o:(action_update_menu)
>>> referenced by action.c
>>>               action.o:(create_submenus)
>>> referenced 1594 more times

ld: error: undefined symbol: gtk_ui_manager_get_widget
>>> referenced by action.c
>>>               action.o:(action_update_menu)
>>> referenced by menu.c
>>>               menu.o:(cm_menu_set_sensitive_full) in archive gtk/.libs/libclawsgtk.a
>>> referenced by menu.c
>>>               menu.o:(cm_toggle_menu_set_active_full) in archive gtk/.libs/libclawsgtk.a
>>> referenced 51 more times

ld: error: undefined symbol: gtk_text_view_get_buffer
>>> referenced by action.c
>>>               action.o:(execute_actions)
>>> referenced by action.c
>>>               action.o:(execute_actions)
>>> referenced by action.c
>>>               action.o:(catch_output)
>>> referenced 146 more times

ld: error: undefined symbol: gtk_text_buffer_get_selection_bounds
>>> referenced by action.c
>>>               action.o:(execute_actions)
>>> referenced by gtkcmctree.c
>>>               gtkcmctree.o:(gtkut_text_view_get_selection) in archive gtk/.libs/libclawsgtk.a
>>> referenced by gtkaspell.c
>>>               gtkaspell.o:(gtkaspell_check_all) in archive gtk/.libs/libclawsgtk.a
>>> referenced 6 more times

ld: error: undefined symbol: gtk_text_buffer_get_text
>>> referenced by action.c
>>>               action.o:(execute_actions)
>>> referenced by action.c
>>>               action.o:(execute_actions)
>>> referenced by gtkcmctree.c
>>>               gtkcmctree.o:(gtkut_text_view_get_selection) in archive gtk/.libs/libclawsgtk.a
>>> referenced 24 more times

ld: error: undefined symbol: gtk_text_buffer_get_iter_at_offset
>>> referenced by action.c
>>>               action.o:(execute_actions)
>>> referenced by action.c
>>>               action.o:(catch_output)
>>> referenced by logwindow.c
>>>               logwindow.o:(log_window_append) in archive gtk/.libs/libclawsgtk.a
>>> referenced 108 more times

ld: error: undefined symbol: gtk_text_buffer_get_end_iter
>>> referenced by action.c
>>>               action.o:(execute_actions)
>>> referenced by pluginwindow.c
>>>               pluginwindow.o:(set_plugin_list) in archive gtk/.libs/libclawsgtk.a
>>> referenced by pluginwindow.c
>>>               pluginwindow.o:(pluginwindow_selected) in archive gtk/.libs/libclawsgtk.a
>>> referenced 30 more times

ld: error: undefined symbol: gtk_widget_grab_focus
>>> referenced by account.c
>>>               account.o:(account_edit_focus)
>>> referenced by action.c
>>>               action.o:(create_io_dialog)
>>> referenced by action.c
>>>               action.o:(wait_for_children)
>>> referenced 128 more times

ld: error: undefined symbol: gtk_widget_has_focus
>>> referenced by addr_compl.c
>>>               addr_compl.o:(address_completion_entry_key_pressed)
>>> referenced by gtkvscrollbutton.c
>>>               gtkvscrollbutton.o:(gtk_vscrollbutton_button_press) in archive gtk/.libs/libclawsgtk.a
>>> referenced by gtkvscrollbutton.c
>>>               gtkvscrollbutton.o:(gtk_vscrollbutton_button_release) in archive gtk/.libs/libclawsgtk.a
>>> referenced 30 more times

ld: error: undefined symbol: gtk_window_new
>>> referenced by addr_compl.c
>>>               addr_compl.o:(address_completion_entry_key_pressed)
>>> referenced by gtkcmctree.c
>>>               gtkcmctree.o:(label_window_create) in archive gtk/.libs/libclawsgtk.a
>>> referenced by gtkcmctree.c
>>>               gtkcmctree.o:(gtkut_window_new) in archive gtk/.libs/libclawsgtk.a
>>> referenced 1 more times

ld: error: undefined symbol: gtk_tree_view_new_with_model
>>> referenced by addr_compl.c
>>>               addr_compl.o:(address_completion_entry_key_pressed)
>>> referenced by account.c
>>>               account.o:(account_edit_open)
>>> referenced by progressdialog.c
>>>               progressdialog.o:(progress_dialog_create) in archive gtk/.libs/libclawsgtk.a
>>> referenced 32 more times

ld: error: undefined symbol: gtk_text_buffer_delete
>>> referenced by action.c
>>>               action.o:(execute_actions)
>>> referenced by action.c
>>>               action.o:(wait_for_children)
>>> referenced by pluginwindow.c
>>>               pluginwindow.o:(set_plugin_list) in archive gtk/.libs/libclawsgtk.a
>>> referenced 21 more times

ld: error: undefined symbol: gtk_tree_view_set_rules_hint
>>> referenced by addr_compl.c
>>>               addr_compl.o:(address_completion_entry_key_pressed)
>>> referenced by account.c
>>>               account.o:(account_edit_open)
>>> referenced by progressdialog.c
>>>               progressdialog.o:(progress_dialog_create) in archive gtk/.libs/libclawsgtk.a
>>> referenced 27 more times

ld: error: undefined symbol: gtk_tree_view_set_headers_visible
>>> referenced by addr_compl.c
>>>               addr_compl.o:(address_completion_entry_key_pressed)
>>> referenced by progressdialog.c
>>>               progressdialog.o:(progress_dialog_create) in archive gtk/.libs/libclawsgtk.a
>>> referenced by foldersort.c
>>>               foldersort.o:(foldersort_open) in archive gtk/.libs/libclawsgtk.a
>>> referenced 9 more times

ld: error: undefined symbol: gtk_tree_view_get_selection
>>> referenced by addr_compl.c
>>>               addr_compl.o:(address_completion_entry_key_pressed)
>>> referenced by account.c
>>>               account.o:(account_edit_open)
>>> referenced by addr_compl.c
>>>               addr_compl.o:(completion_window_key_press)
>>> referenced 164 more times

ld: error: undefined symbol: gtk_tree_selection_set_mode
>>> referenced by addr_compl.c
>>>               addr_compl.o:(address_completion_entry_key_pressed)
>>> referenced by account.c
>>>               account.o:(account_edit_open)
>>> referenced by progressdialog.c
>>>               progressdialog.o:(progress_dialog_create) in archive gtk/.libs/libclawsgtk.a
>>> referenced 32 more times

ld: error: undefined symbol: gtk_tree_selection_set_select_function
>>> referenced by addr_compl.c
>>>               addr_compl.o:(address_completion_entry_key_pressed)
>>> referenced by pluginwindow.c
>>>               pluginwindow.o:(pluginwindow_create) in archive gtk/.libs/libclawsgtk.a
>>> referenced by prefswindow.c
>>>               prefswindow.o:(prefswindow_open_full) in archive gtk/.libs/libclawsgtk.a
>>> referenced 5 more times

ld: error: undefined symbol: gtk_window_set_modal
>>> referenced by account.c
>>>               account.o:(account_edit_focus)
>>> referenced by action.c
>>>               action.o:(create_io_dialog)
>>> referenced by account.c
>>>               account.o:(account_edit_open)
>>> referenced 90 more times

ld: error: undefined symbol: gtk_tree_view_column_new_with_attributes
>>> referenced by addr_compl.c
>>>               addr_compl.o:(address_completion_entry_key_pressed)
>>> referenced by addr_compl.c
>>>               addr_compl.o:(address_completion_entry_key_pressed)
>>> referenced by account.c
>>>               account.o:(account_edit_open)
>>> referenced 48 more times

ld: error: too many errors emitted, stopping now (use --error-limit=0 to see all errors)
cc: error: linker command failed with exit code 1 (use -v to see invocation)
gmake[4]: *** [Makefile:1435: claws-mail] Error 1
gmake[4]: Leaving directory '/wrkdirs/usr/ports/mail/claws-mail/work/claws-mail-3.21.0/src'
gmake[3]: *** [Makefile:1662: all-recursive] Error 1
gmake[3]: Leaving directory '/wrkdirs/usr/ports/mail/claws-mail/work/claws-mail-3.21.0/src'
gmake[2]: *** [Makefile:1341: all] Error 2
gmake[2]: Leaving directory '/wrkdirs/usr/ports/mail/claws-mail/work/claws-mail-3.21.0/src'
gmake[1]: *** [Makefile:796: all-recursive] Error 1
gmake[1]: Leaving directory '/wrkdirs/usr/ports/mail/claws-mail/work/claws-mail-3.21.0'
gmake: *** [Makefile:570: all] Error 2
===> Compilation failed unexpectedly.
Try to set MAKE_JOBS_UNSAFE=yes and rebuild before reporting the failure to
the maintainer.
*** Error code 1

Stop.
make: stopped in /usr/ports/mail/claws-mail