[package - 142arm64-quarterly][x11-toolkits/gtksourceview2] Failed for gtksourceview2-2.10.5_10 in build
- Go to: [ bottom of page ] [ top of archives ] [ this month ]
Date: Tue, 05 Aug 2025 18:29:40 UTC
You are receiving this mail as a port that you maintain
is failing to build on the FreeBSD package build server.
Please investigate the failure and submit a PR to fix
build.
Maintainer: gnome@FreeBSD.org
Log URL: https://pkg-status.freebsd.org/ampere1/data/142arm64-quarterly/6f2d24d37f72/logs/gtksourceview2-2.10.5_10.log
Build URL: https://pkg-status.freebsd.org/ampere1/build.html?mastername=142arm64-quarterly&build=6f2d24d37f72
Log:
=>> Building x11-toolkits/gtksourceview2
build started at Tue Aug 5 18:25:52 UTC 2025
port directory: /usr/ports/x11-toolkits/gtksourceview2
package name: gtksourceview2-2.10.5_10
building for: FreeBSD 142arm64-quarterly-job-03 14.2-RELEASE-p4 FreeBSD 14.2-RELEASE-p4 arm64
maintained by: gnome@FreeBSD.org
Makefile datestamp: -rw-r--r-- 1 root wheel 605 Jul 3 01:02 /usr/ports/x11-toolkits/gtksourceview2/Makefile
Ports top last git commit: 6f2d24d37
Ports top unclean checkout: no
Port dir last git commit: d7951ee86
Port dir unclean checkout: no
Poudriere version: poudriere-git-3.4.3
Host OSVERSION: 1500052
Jail OSVERSION: 1402000
Job Id: 03
---Begin Environment---
SHELL=/bin/sh
OSVERSION=1402000
UNAME_v=FreeBSD 14.2-RELEASE-p4
UNAME_r=14.2-RELEASE-p4
BLOCKSIZE=K
MAIL=/var/mail/root
MM_CHARSET=UTF-8
LANG=C.UTF-8
STATUS=1
HOME=/root
PATH=/sbin:/bin:/usr/sbin:/usr/bin:/usr/local/sbin:/usr/local/bin:/root/bin
MAKE_OBJDIR_CHECK_WRITABLE=0
LOCALBASE=/usr/local
USER=root
POUDRIERE_NAME=poudriere-git
LIBEXECPREFIX=/usr/local/libexec/poudriere
POUDRIERE_VERSION=3.4.3
MASTERMNT=/usr/local/poudriere/data/.m/142arm64-quarterly/ref
LC_COLLATE=C
POUDRIERE_BUILD_TYPE=bulk
PACKAGE_BUILDING=yes
SAVED_TERM=
OUTPUT_REDIRECTED_STDERR=4
OUTPUT_REDIRECTED=1
PWD=/usr/local/poudriere/data/.m/142arm64-quarterly/03/.p
OUTPUT_REDIRECTED_STDOUT=3
P_PORTS_FEATURES=FLAVORS SUBPACKAGES SELECTED_OPTIONS
MASTERNAME=142arm64-quarterly
SCRIPTPREFIX=/usr/local/share/poudriere
SCRIPTNAME=bulk.sh
OLDPWD=/usr/local/poudriere/data/.m/142arm64-quarterly/ref/.p/pool
POUDRIERE_PKGNAME=poudriere-git-3.4.3
SCRIPTPATH=/usr/local/share/poudriere/bulk.sh
POUDRIEREPATH=/usr/local/bin/poudriere
---End Environment---
---Begin Poudriere Port Flags/Env---
PORT_FLAGS=
PKGENV=
FLAVOR=
MAKE_ARGS=
---End Poudriere Port Flags/Env---
---Begin OPTIONS List---
---End OPTIONS List---
--MAINTAINER--
gnome@FreeBSD.org
--End MAINTAINER--
--CONFIGURE_ARGS--
--enable-compile-warnings=no --enable-glade-catalog=no --disable-gtk-doc-html --localstatedir=/usr/local/share --with-html-dir=/usr/local/share/doc --disable-gtk-doc --with-gconf-source=xml:merged:/usr/local/etc/gconf/gconf.xml.defaults --prefix=/usr/local ${_LATE_CONFIGURE_ARGS}
--End CONFIGURE_ARGS--
--CONFIGURE_ENV--
MAKE=/usr/local/bin/gmake GTKDOC="false" PKG_CONFIG=pkgconf XDG_DATA_HOME=/wrkdirs/usr/ports/x11-toolkits/gtksourceview2/work XDG_CONFIG_HOME=/wrkdirs/usr/ports/x11-toolkits/gtksourceview2/work XDG_CACHE_HOME=/wrkdirs/usr/ports/x11-toolkits/gtksourceview2/work/.cache HOME=/wrkdirs/usr/ports/x11-toolkits/gtksourceview2/work TMPDIR="/tmp" PATH=/wrkdirs/usr/ports/x11-toolkits/gtksourceview2/work/.bin:/sbin:/bin:/usr/sbin:/usr/bin:/usr/local/sbin:/usr/local/bin:/root/bin PKG_CONFIG_LIBDIR=/wrkdirs/usr/ports/x11-toolkits/gtksourceview2/work/.pkgconfig:/usr/local/libdata/pkgconfig:/usr/local/share/pkgconfig:/usr/libdata/pkgconfig SHELL=/bin/sh CONFIG_SHELL=/bin/sh CMAKE_PREFIX_PATH="/usr/local" CONFIG_SITE=/usr/ports/Templates/config.site lt_cv_sys_max_cmd_len=524288
--End CONFIGURE_ENV--
--MAKE_ENV--
XDG_DATA_HOME=/wrkdirs/usr/ports/x11-toolkits/gtksourceview2/work XDG_CONFIG_HOME=/wrkdirs/usr/ports/x11-toolkits/gtksourceview2/work XDG_CACHE_HOME=/wrkdirs/usr/ports/x11-toolkits/gtksourceview2/work/.cache HOME=/wrkdirs/usr/ports/x11-toolkits/gtksourceview2/work TMPDIR="/tmp" PATH=/wrkdirs/usr/ports/x11-toolkits/gtksourceview2/work/.bin:/sbin:/bin:/usr/sbin:/usr/bin:/usr/local/sbin:/usr/local/bin:/root/bin PKG_CONFIG_LIBDIR=/wrkdirs/usr/ports/x11-toolkits/gtksourceview2/work/.pkgconfig:/usr/local/libdata/pkgconfig:/usr/local/share/pkgconfig:/usr/libdata/pkgconfig MK_DEBUG_FILES=no MK_KERNEL_SYMBOLS=no SHELL=/bin/sh NO_LINT=YES PREFIX=/usr/local LOCALBASE=/usr/local CC="cc" CFLAGS="-O2 -pipe -fstack-protector-strong -isystem /usr/local/include -fno-strict-aliasing " CPP="cpp" CPPFLAGS="-isystem /usr/local/include" LDFLAGS=" -fstack-protector-strong " LIBS="-L/usr/local/lib" CXX="c++" CXXFLAGS="-O2 -pipe -fstack-protector-strong -isystem /usr/local/include -fno-stri
ct-aliasing -isystem /usr/local/include " BSD_INSTALL_PROGRAM="install -s -m 555" BSD_INSTALL_LIB="install -s -m 0644" BSD_INSTALL_SCRIPT="install -m 555" BSD_INSTALL_DATA="install -m 0644" BSD_INSTALL_MAN="install -m 444"
--End MAKE_ENV--
--PLIST_SUB--
GTK2_VERSION="2.10.0" GTK3_VERSION="3.0.0" GTK4_VERSION="4.0.0" OSREL=14.2 PREFIX=%D LOCALBASE=/usr/local RESETPREFIX=/usr/local LIB32DIR=lib DOCSDIR="share/doc/gtksourceview2" EXAMPLESDIR="share/examples/gtksourceview2" DATADIR="share/gtksourceview2" WWWDIR="www/gtksourceview2" ETCDIR="etc/gtksourceview2"
--End PLIST_SUB--
--SUB_LIST--
PREFIX=/usr/local LOCALBASE=/usr/local DATADIR=/usr/local/share/gtksourceview2 DOCSDIR=/usr/local/share/doc/gtksourceview2 EXAMPLESDIR=/usr/local/share/examples/gtksourceview2 WWWDIR=/usr/local/www/gtksourceview2 ETCDIR=/usr/local/etc/gtksourceview2
--End SUB_LIST--
---Begin make.conf---
USE_PACKAGE_DEPENDS=yes
BATCH=yes
WRKDIRPREFIX=/wrkdirs
PORTSDIR=/usr/ports
PACKAGES=/packages
DISTDIR=/distfiles
PACKAGE_BUILDING=yes
PACKAGE_BUILDING_FLAVORS=yes
#### ####
# XXX: We really need this but cannot use it while 'make checksum' does not
# try the next mirror on checksum failure. It currently retries the same
# failed mirror and then fails rather then trying another. It *does*
# try the next if the size is mismatched though.
#MASTER_SITE_FREEBSD=yes
# Build ALLOW_MAKE_JOBS_PACKAGES with 3 jobs
MAKE_JOBS_NUMBER=3
#### Misc Poudriere ####
.include "/etc/make.conf.ports_env"
GID=0
UID=0
---End make.conf---
--Resource limits--
cpu time (seconds, -t) unlimited
file size (512-blocks, -f) unlimited
data seg size (kbytes, -d) 1048576
stack size (kbytes, -s) 1048576
core file size (512-blocks, -c) unlimited
max memory size (kbytes, -m) unlimited
locked memory (kbytes, -l) unlimited
max user processes (-u) 89999
open files (-n) 8192
virtual mem size (kbytes, -v) unlimited
swap limit (kbytes, -w) unlimited
socket buffer size (bytes, -b) unlimited
pseudo-terminals (-p) unlimited
kqueues (-k) unlimited
umtx shared locks (-o) unlimited
pipebuf (-y) unlimited
--End resource limits--
=======================<phase: check-sanity >============================
===== env: NO_DEPENDS=yes USER=root UID=0 GID=0
===========================================================================
=======================<phase: pkg-depends >============================
===== env: USE_PACKAGE_DEPENDS_ONLY=1 USER=root UID=0 GID=0
===> gtksourceview2-2.10.5_10 depends on file: /usr/local/sbin/pkg - not found
===> Installing existing package /packages/All/pkg-2.2.1.pkg
[142arm64-quarterly-job-03] Installing pkg-2.2.1...
[142arm64-quarterly-job-03] Extracting pkg-2.2.1: .......... done
===> gtksourceview2-2.10.5_10 depends on file: /usr/local/sbin/pkg - found
===> Returning to build of gtksourceview2-2.10.5_10
===========================================================================
=======================<phase: fetch-depends >============================
===== env: USE_PACKAGE_DEPENDS_ONLY=1 USER=root UID=0 GID=0
===========================================================================
=======================<phase: fetch >============================
===== env: NO_DEPENDS=yes USER=root UID=0 GID=0
===> Fetching all distfiles required by gtksourceview2-2.10.5_10 for building
===========================================================================
=======================<phase: checksum >============================
===== env: NO_DEPENDS=yes USER=root UID=0 GID=0
===> Fetching all distfiles required by gtksourceview2-2.10.5_10 for building
=> SHA256 Checksum OK for gnome2/gtksourceview-2.10.5.tar.bz2.
===========================================================================
=======================<phase: extract-depends>============================
===== env: USE_PACKAGE_DEPENDS_ONLY=1 USER=root UID=0 GID=0
===========================================================================
=======================<phase: extract >============================
===== env: NO_DEPENDS=yes USER=root UID=0 GID=0
===> Fetching all distfiles required by gtksourceview2-2.10.5_10 for building
===> Extracting for gtksourceview2-2.10.5_10
=> SHA256 Checksum OK for gnome2/gtksourceview-2.10.5.tar.bz2.
===========================================================================
=======================<phase: patch-depends >============================
===== env: USE_PACKAGE_DEPENDS_ONLY=1 USER=root UID=0 GID=0
===========================================================================
=======================<phase: patch >============================
===== env: NO_DEPENDS=yes USER=root UID=0 GID=0
===> Patching for gtksourceview2-2.10.5_10
===========================================================================
=======================<phase: build-depends >============================
===== env: USE_PACKAGE_DEPENDS_ONLY=1 USER=root UID=0 GID=0
===> gtksourceview2-2.10.5_10 depends on package: gettext-runtime>=0.22_1 - not found
===> Installing existing package /packages/All/gettext-runtime-0.23.1.pkg
[142arm64-quarterly-job-03] Installing gettext-runtime-0.23.1...
[142arm64-quarterly-job-03] `-- Installing indexinfo-0.3.1_1...
[142arm64-quarterly-job-03] `-- Extracting indexinfo-0.3.1_1: .... done
[142arm64-quarterly-job-03] Extracting gettext-runtime-0.23.1: .......... done
===> gtksourceview2-2.10.5_10 depends on package: gettext-runtime>=0.22_1 - found
===> Returning to build of gtksourceview2-2.10.5_10
===> gtksourceview2-2.10.5_10 depends on executable: msgfmt - not found
===> Installing existing package /packages/All/gettext-tools-0.23.1_1.pkg
[142arm64-quarterly-job-03] Installing gettext-tools-0.23.1_1...
[142arm64-quarterly-job-03] `-- Installing libtextstyle-0.23.1...
[142arm64-quarterly-job-03] `-- Extracting libtextstyle-0.23.1: .......... done
[142arm64-quarterly-job-03] Extracting gettext-tools-0.23.1_1: .......... done
===> gtksourceview2-2.10.5_10 depends on executable: msgfmt - found
===> Returning to build of gtksourceview2-2.10.5_10
===> gtksourceview2-2.10.5_10 depends on package: gmake>=4.4.1 - not found
===> Installing existing package /packages/All/gmake-4.4.1.pkg
[142arm64-quarterly-job-03] Installing gmake-4.4.1...
[142arm64-quarterly-job-03] Extracting gmake-4.4.1: .......... done
===> gtksourceview2-2.10.5_10 depends on package: gmake>=4.4.1 - found
===> Returning to build of gtksourceview2-2.10.5_10
===> gtksourceview2-2.10.5_10 depends on file: /usr/local/bin/intltool-extract - not found
===> Installing existing package /packages/All/intltool-0.51.0_2.pkg
[142arm64-quarterly-job-03] Installing intltool-0.51.0_2...
[142arm64-quarterly-job-03] `-- Installing p5-XML-Parser-2.47...
[142arm64-quarterly-job-03] | `-- Installing expat-2.7.1...
[142arm64-quarterly-job-03] | `-- Extracting expat-2.7.1: .......... done
[142arm64-quarterly-job-03] | `-- Installing perl5-5.40.2_2...
[142arm64-quarterly-job-03] | `-- Extracting perl5-5.40.2_2: .......... done
<snip>
ld: error: undefined symbol: gtk_window_resize
>>> referenced by test-completion.c
>>> test-completion.o:(main)
>>> did you mean: gdk_window_resize
>>> defined in: /usr/local/lib/libgdk-x11-2.0.so
ld: error: undefined symbol: gtk_vbox_new
>>> referenced by test-completion.c
>>> test-completion.o:(main)
ld: error: undefined symbol: gtk_scrolled_window_new
>>> referenced by test-completion.c
>>> test-completion.o:(main)
ld: error: undefined symbol: gtk_text_view_get_buffer
>>> referenced by test-completion.c
>>> test-completion.o:(main)
ld: error: undefined symbol: gtk_widget_show_all
>>> referenced by test-completion.c
>>> test-completion.o:(main)
ld: error: undefined symbol: gtk_toggle_button_get_active
>>> referenced by test-completion.c
>>> test-completion.o:(remember_toggled_cb)
>>> referenced by test-completion.c
>>> test-completion.o:(select_on_show_toggled_cb)
>>> referenced by test-completion.c
>>> test-completion.o:(show_headers_toggled_cb)
>>> referenced 1 more times
ld: error: undefined reference due to --no-allow-shlib-undefined: gtk_text_buffer_get_type
>>> referenced by ../gtksourceview/.libs/libgtksourceview-2.0.so
ld: error: undefined reference due to --no-allow-shlib-undefined: gtk_text_buffer_get_insert
>>> referenced by ../gtksourceview/.libs/libgtksourceview-2.0.so
ld: error: undefined reference due to --no-allow-shlib-undefined: gtk_text_buffer_get_iter_at_mark
>>> referenced by ../gtksourceview/.libs/libgtksourceview-2.0.so
ld: error: undefined reference due to --no-allow-shlib-undefined: gtk_text_iter_get_buffer
>>> referenced by ../gtksourceview/.libs/libgtksourceview-2.0.so
ld: error: undefined reference due to --no-allow-shlib-undefined: gtk_text_iter_forward_char
>>> referenced by ../gtksourceview/.libs/libgtksourceview-2.0.so
ld: error: undefined reference due to --no-allow-shlib-undefined: gtk_text_buffer_remove_tag
>>> referenced by ../gtksourceview/.libs/libgtksourceview-2.0.so
ld: error: undefined reference due to --no-allow-shlib-undefined: gtk_text_buffer_move_mark
>>> referenced by ../gtksourceview/.libs/libgtksourceview-2.0.so
ld: error: undefined reference due to --no-allow-shlib-undefined: gtk_text_iter_starts_line
>>> referenced by ../gtksourceview/.libs/libgtksourceview-2.0.so
ld: error: undefined reference due to --no-allow-shlib-undefined: gtk_text_buffer_create_mark
>>> referenced by ../gtksourceview/.libs/libgtksourceview-2.0.so
ld: error: undefined reference due to --no-allow-shlib-undefined: gtk_text_buffer_create_tag
>>> referenced by ../gtksourceview/.libs/libgtksourceview-2.0.so
ld: error: undefined reference due to --no-allow-shlib-undefined: gtk_text_buffer_apply_tag
>>> referenced by ../gtksourceview/.libs/libgtksourceview-2.0.so
ld: error: undefined reference due to --no-allow-shlib-undefined: gtk_text_iter_backward_char
>>> referenced by ../gtksourceview/.libs/libgtksourceview-2.0.so
ld: error: undefined reference due to --no-allow-shlib-undefined: gtk_text_buffer_add_mark
>>> referenced by ../gtksourceview/.libs/libgtksourceview-2.0.so
ld: error: too many errors emitted, stopping now (use --error-limit=0 to see all errors)
cc: error: linker command failed with exit code 1 (use -v to see invocation)
gmake[2]: *** [Makefile:367: test-completion] Error 1
libtool: link: cc -O2 -pipe -fstack-protector-strong -isystem /usr/local/include -fno-strict-aliasing -fstack-protector-strong -o .libs/test-widget test-widget.o ../gtksourceview/.libs/libgtksourceview-2.0.so -L/usr/local/lib -lgtk-x11-2.0 -lgdk-x11-2.0 -lpangocairo-1.0 -latk-1.0 -lgdk_pixbuf-2.0 -lpangoft2-1.0 -lpango-1.0 -lgio-2.0 -lcairo -lfontconfig -lharfbuzz -lfreetype -lgobject-2.0 -lglib-2.0 -lintl -lxml2 -Wl,-rpath -Wl,/usr/local/lib
ld: error: undefined symbol: gtk_ui_manager_insert_action_group
>>> referenced by test-widget.c
>>> test-widget.o:(main)
>>> referenced by test-widget.c
>>> test-widget.o:(create_view_window)
ld: error: undefined symbol: gtk_ui_manager_add_ui_from_string
>>> referenced by test-widget.c
>>> test-widget.o:(main)
>>> referenced by test-widget.c
>>> test-widget.o:(create_view_window)
ld: error: undefined symbol: gtk_ui_manager_get_action_groups
>>> referenced by test-widget.c
>>> test-widget.o:(main)
ld: error: undefined symbol: gtk_toggle_action_set_active
>>> referenced by test-widget.c
>>> test-widget.o:(main)
>>> referenced by test-widget.c
>>> test-widget.o:(main)
>>> referenced by test-widget.c
>>> test-widget.o:(main)
>>> referenced 14 more times
ld: error: undefined symbol: gtk_window_set_default_size
>>> referenced by test-widget.c
>>> test-widget.o:(main)
>>> referenced by test-widget.c
>>> test-widget.o:(new_view_cb)
ld: error: undefined symbol: gtk_widget_show
>>> referenced by test-widget.c
>>> test-widget.o:(main)
>>> referenced by test-widget.c
>>> test-widget.o:(new_view_cb)
ld: error: undefined symbol: gtk_widget_destroy
>>> referenced by test-widget.c
>>> test-widget.o:(main)
>>> referenced by test-widget.c
>>> test-widget.o:(main)
>>> referenced by test-widget.c
>>> test-widget.o:(error_dialog)
>>> referenced 3 more times
ld: error: undefined symbol: gtk_text_buffer_get_bounds
>>> referenced by test-widget.c
>>> test-widget.o:(open_file)
>>> referenced by test-widget.c
>>> test-widget.o:(open_file)
ld: error: undefined symbol: gtk_text_buffer_set_text
>>> referenced by test-widget.c
>>> test-widget.o:(open_file)
ld: error: undefined symbol: gtk_text_buffer_set_modified
>>> referenced by test-widget.c
>>> test-widget.o:(open_file)
ld: error: undefined symbol: gtk_text_buffer_get_start_iter
>>> referenced by test-widget.c
>>> test-widget.o:(open_file)
>>> referenced by test-widget.c
>>> test-widget.o:(open_file)
>>> referenced by test-widget.c
>>> test-widget.o:(open_file)
>>> referenced 1 more times
ld: error: undefined symbol: gtk_text_buffer_place_cursor
>>> referenced by test-widget.c
>>> test-widget.o:(open_file)
>>> referenced by test-widget.c
>>> test-widget.o:(forward_string_cb)
>>> referenced by test-widget.c
>>> test-widget.o:(backward_string_cb)
ld: error: undefined symbol: gtk_text_buffer_get_text
>>> referenced by test-widget.c
>>> test-widget.o:(open_file)
ld: error: undefined symbol: gtk_text_iter_forward_line
>>> referenced by test-widget.c
>>> test-widget.o:(open_file)
ld: error: undefined symbol: gtk_text_iter_get_slice
>>> referenced by test-widget.c
>>> test-widget.o:(open_file)
ld: error: undefined symbol: gtk_text_buffer_get_char_count
>>> referenced by test-widget.c
>>> test-widget.o:(open_file)
ld: error: undefined symbol: gtk_text_buffer_get_end_iter
>>> referenced by test-widget.c
>>> test-widget.o:(open_file)
ld: error: undefined symbol: gtk_text_buffer_get_iter_at_offset
>>> referenced by test-widget.c
>>> test-widget.o:(open_file)
>>> referenced by test-widget.c
>>> test-widget.o:(do_search_replace)
ld: error: undefined symbol: gtk_text_buffer_get_slice
>>> referenced by test-widget.c
>>> test-widget.o:(open_file)
ld: error: undefined symbol: gtk_window_new
>>> referenced by test-widget.c
>>> test-widget.o:(create_view_window)
ld: error: too many errors emitted, stopping now (use --error-limit=0 to see all errors)
cc: error: linker command failed with exit code 1 (use -v to see invocation)
gmake[2]: *** [Makefile:376: test-widget] Error 1
gmake[2]: Leaving directory '/wrkdirs/usr/ports/x11-toolkits/gtksourceview2/work/gtksourceview-2.10.5/tests'
gmake[1]: *** [Makefile:429: all-recursive] Error 1
gmake[1]: Leaving directory '/wrkdirs/usr/ports/x11-toolkits/gtksourceview2/work/gtksourceview-2.10.5'
gmake: *** [Makefile:334: all] Error 2
===> Compilation failed unexpectedly.
Try to set MAKE_JOBS_UNSAFE=yes and rebuild before reporting the failure to
the maintainer.
*** Error code 1
Stop.
make: stopped in /usr/ports/x11-toolkits/gtksourceview2