[package - 134i386-default][devel/gcc-arm-embedded] Failed for gcc-arm-embedded-aarch64-14.2r1_1 in build
- Go to: [ bottom of page ] [ top of archives ] [ this month ]
Date: Sun, 13 Apr 2025 03:09:47 UTC
You are receiving this mail as a port that you maintain
is failing to build on the FreeBSD package build server.
Please investigate the failure and submit a PR to fix
build.
Maintainer: lev@FreeBSD.org
Log URL: https://pkg-status.freebsd.org/beefy15/data/134i386-default/a0b63985d6be/logs/gcc-arm-embedded-aarch64-14.2r1_1.log
Build URL: https://pkg-status.freebsd.org/beefy15/build.html?mastername=134i386-default&build=a0b63985d6be
Log:
=>> Building devel/gcc-arm-embedded
build started at Sun Apr 13 02:34:02 UTC 2025
port directory: /usr/ports/devel/gcc-arm-embedded
package name: gcc-arm-embedded-aarch64-14.2r1_1
building for: FreeBSD 134i386-default-job-09 13.4-RELEASE-p4 FreeBSD 13.4-RELEASE-p4 i386
maintained by: lev@FreeBSD.org
Makefile datestamp: -rw-r--r-- 1 root wheel 3479 Apr 5 01:01 /usr/ports/devel/gcc-arm-embedded/Makefile
Ports top last git commit: a0b63985d6
Ports top unclean checkout: no
Port dir last git commit: 7c1a376484
Port dir unclean checkout: no
Poudriere version: poudriere-git-3.4.2-9-g05a460dc
Host OSVERSION: 1500035
Jail OSVERSION: 1304000
Job Id: 09
---Begin Environment---
SHELL=/bin/csh
BLOCKSIZE=K
MAIL=/var/mail/root
MM_CHARSET=UTF-8
LANG=C.UTF-8
OSVERSION=1304000
STATUS=1
HOME=/root
PATH=/sbin:/bin:/usr/sbin:/usr/bin:/usr/local/sbin:/usr/local/bin:/root/bin
MAKE_OBJDIR_CHECK_WRITABLE=0
UNAME_m=i386
UNAME_p=i386
UNAME_r=13.4-RELEASE-p4
LOCALBASE=/usr/local
UNAME_v=FreeBSD 13.4-RELEASE-p4
USER=root
POUDRIERE_NAME=poudriere-git
LIBEXECPREFIX=/usr/local/libexec/poudriere
POUDRIERE_VERSION=3.4.2-9-g05a460dc
MASTERMNT=/usr/local/poudriere/data/.m/134i386-default/ref
LC_COLLATE=C
POUDRIERE_BUILD_TYPE=bulk
PACKAGE_BUILDING=yes
SAVED_TERM=
OUTPUT_REDIRECTED_STDERR=4
OUTPUT_REDIRECTED=1
PWD=/usr/local/poudriere/data/.m/134i386-default/09/.p
OUTPUT_REDIRECTED_STDOUT=3
P_PORTS_FEATURES=FLAVORS SUBPACKAGES SELECTED_OPTIONS
MASTERNAME=134i386-default
SCRIPTPREFIX=/usr/local/share/poudriere
SCRIPTNAME=bulk.sh
OLDPWD=/usr/local/poudriere/data/.m/134i386-default/ref/.p/pool
POUDRIERE_PKGNAME=poudriere-git-3.4.2-9-g05a460dc
SCRIPTPATH=/usr/local/share/poudriere/bulk.sh
POUDRIEREPATH=/usr/local/bin/poudriere
---End Environment---
---Begin Poudriere Port Flags/Env---
PORT_FLAGS=
PKGENV=
FLAVOR=aarch64
MAKE_ARGS= FLAVOR=aarch64
---End Poudriere Port Flags/Env---
---Begin OPTIONS List---
===> The following configuration options are available for gcc-arm-embedded-aarch64-14.2r1_1:
APROFILE=on: Add support for Cortex-A profiles (valid only for default armv7 target)
PYGDB=on: Build and install python-enabled gdb in addition to standard one
SYMLINK=on: Make version-independent symlink /usr/local/gcc-arm-embedded
===> Use 'make config' to modify these settings
---End OPTIONS List---
--MAINTAINER--
lev@FreeBSD.org
--End MAINTAINER--
--CONFIGURE_ARGS--
--End CONFIGURE_ARGS--
--CONFIGURE_ENV--
MAKE=/usr/local/bin/gmake PYTHON="/usr/local/bin/python3.11" XDG_DATA_HOME=/wrkdirs/usr/ports/devel/gcc-arm-embedded/work-aarch64 XDG_CONFIG_HOME=/wrkdirs/usr/ports/devel/gcc-arm-embedded/work-aarch64 XDG_CACHE_HOME=/wrkdirs/usr/ports/devel/gcc-arm-embedded/work-aarch64/.cache HOME=/wrkdirs/usr/ports/devel/gcc-arm-embedded/work-aarch64 TMPDIR="/tmp" PATH=/wrkdirs/usr/ports/devel/gcc-arm-embedded/work-aarch64/.bin:/sbin:/bin:/usr/sbin:/usr/bin:/usr/local/sbin:/usr/local/bin:/root/bin PKG_CONFIG_LIBDIR=/wrkdirs/usr/ports/devel/gcc-arm-embedded/work-aarch64/.pkgconfig:/usr/local/libdata/pkgconfig:/usr/local/share/pkgconfig:/usr/libdata/pkgconfig SHELL=/bin/sh CONFIG_SHELL=/bin/sh
--End CONFIGURE_ENV--
--MAKE_ENV--
XDG_DATA_HOME=/wrkdirs/usr/ports/devel/gcc-arm-embedded/work-aarch64 XDG_CONFIG_HOME=/wrkdirs/usr/ports/devel/gcc-arm-embedded/work-aarch64 XDG_CACHE_HOME=/wrkdirs/usr/ports/devel/gcc-arm-embedded/work-aarch64/.cache HOME=/wrkdirs/usr/ports/devel/gcc-arm-embedded/work-aarch64 TMPDIR="/tmp" PATH=/wrkdirs/usr/ports/devel/gcc-arm-embedded/work-aarch64/.bin:/sbin:/bin:/usr/sbin:/usr/bin:/usr/local/sbin:/usr/local/bin:/root/bin PKG_CONFIG_LIBDIR=/wrkdirs/usr/ports/devel/gcc-arm-embedded/work-aarch64/.pkgconfig:/usr/local/libdata/pkgconfig:/usr/local/share/pkgconfig:/usr/libdata/pkgconfig MK_DEBUG_FILES=no MK_KERNEL_SYMBOLS=no SHELL=/bin/sh NO_LINT=YES PREFIX=/usr/local LOCALBASE=/usr/local CC="cc" CFLAGS="-O2 -pipe -fstack-protector-strong -fno-strict-aliasing " CPP="cpp" CPPFLAGS="" LDFLAGS=" -fstack-protector-strong " LIBS="" CXX="c++" CXXFLAGS="-O2 -pipe -fstack-protector-strong -fno-strict-aliasing " BSD_INSTALL_PROGRAM="install -s -m 555" BSD_INSTALL_LIB="install
-s -m 0644" BSD_INSTALL_SCRIPT="install -m 555" BSD_INSTALL_DATA="install -m 0644" BSD_INSTALL_MAN="install -m 444"
--End MAKE_ENV--
--PLIST_SUB--
GCC_VERSION=14.2.1 FULL_VERSION=14.2.rel1 TARGET=aarch64-none-elf APROFILE="" NO_APROFILE="@comment " PYGDB="" NO_PYGDB="@comment " SYMLINK="" NO_SYMLINK="@comment " PYTHON_INCLUDEDIR=include/python3.11 PYTHON_LIBDIR=lib/python3.11 PYTHON_PLATFORM=freebsd13 PYTHON_SITELIBDIR=lib/python3.11/site-packages PYTHON_SUFFIX=311 PYTHON_EXT_SUFFIX=.cpython-311 PYTHON_VER=3.11 PYTHON_VERSION=python3.11 PYTHON2="@comment " PYTHON3="" OSREL=13.4 PREFIX=%D LOCALBASE=/usr/local RESETPREFIX=/usr/local LIB32DIR=lib DOCSDIR="share/doc/gcc-arm-embedded" EXAMPLESDIR="share/examples/gcc-arm-embedded" DATADIR="share/gcc-arm-embedded" WWWDIR="www/gcc-arm-embedded" ETCDIR="etc/gcc-arm-embedded"
--End PLIST_SUB--
--SUB_LIST--
APROFILE="" NO_APROFILE="@comment " PYGDB="" NO_PYGDB="@comment " SYMLINK="" NO_SYMLINK="@comment " PYTHON_INCLUDEDIR=/usr/local/include/python3.11 PYTHON_LIBDIR=/usr/local/lib/python3.11 PYTHON_PLATFORM=freebsd13 PYTHON_SITELIBDIR=/usr/local/lib/python3.11/site-packages PYTHON_SUFFIX=311 PYTHON_EXT_SUFFIX=.cpython-311 PYTHON_VER=3.11 PYTHON_VERSION=python3.11 PYTHON2="@comment " PYTHON3="" PREFIX=/usr/local LOCALBASE=/usr/local DATADIR=/usr/local/share/gcc-arm-embedded DOCSDIR=/usr/local/share/doc/gcc-arm-embedded EXAMPLESDIR=/usr/local/share/examples/gcc-arm-embedded WWWDIR=/usr/local/www/gcc-arm-embedded ETCDIR=/usr/local/etc/gcc-arm-embedded
--End SUB_LIST--
---Begin make.conf---
USE_PACKAGE_DEPENDS=yes
BATCH=yes
WRKDIRPREFIX=/wrkdirs
PORTSDIR=/usr/ports
PACKAGES=/packages
DISTDIR=/distfiles
PACKAGE_BUILDING=yes
PACKAGE_BUILDING_FLAVORS=yes
MACHINE=i386
MACHINE_ARCH=i386
ARCH=${MACHINE_ARCH}
#### ####
# XXX: We really need this but cannot use it while 'make checksum' does not
# try the next mirror on checksum failure. It currently retries the same
# failed mirror and then fails rather then trying another. It *does*
# try the next if the size is mismatched though.
#MASTER_SITE_FREEBSD=yes
# Build ALLOW_MAKE_JOBS_PACKAGES with 3 jobs
MAKE_JOBS_NUMBER=3
#### Misc Poudriere ####
.include "/etc/make.conf.ports_env"
GID=0
UID=0
---End make.conf---
--Resource limits--
cpu time (seconds, -t) unlimited
file size (512-blocks, -f) unlimited
data seg size (kbytes, -d) 524288
stack size (kbytes, -s) 65536
core file size (512-blocks, -c) unlimited
max memory size (kbytes, -m) unlimited
locked memory (kbytes, -l) unlimited
max user processes (-u) 89999
open files (-n) 8192
virtual mem size (kbytes, -v) unlimited
swap limit (kbytes, -w) unlimited
socket buffer size (bytes, -b) unlimited
pseudo-terminals (-p) unlimited
kqueues (-k) unlimited
umtx shared locks (-o) unlimited
--End resource limits--
=======================<phase: check-sanity >============================
===== env: NO_DEPENDS=yes USER=root UID=0 GID=0
===> License GPLv2 LGPL20 LGPL21 GPLv3 LGPL3 accepted by the user
===========================================================================
=======================<phase: pkg-depends >============================
===== env: USE_PACKAGE_DEPENDS_ONLY=1 USER=root UID=0 GID=0
===> gcc-arm-embedded-aarch64-14.2r1_1 depends on file: /usr/local/sbin/pkg - not found
===> Installing existing package /packages/All/pkg-2.1.0.pkg
[134i386-default-job-09] Installing pkg-2.1.0...
[134i386-default-job-09] Extracting pkg-2.1.0: .......... done
===> gcc-arm-embedded-aarch64-14.2r1_1 depends on file: /usr/local/sbin/pkg - found
===> Returning to build of gcc-arm-embedded-aarch64-14.2r1_1
===========================================================================
=======================<phase: fetch-depends >============================
===== env: USE_PACKAGE_DEPENDS_ONLY=1 USER=root UID=0 GID=0
===========================================================================
=======================<phase: fetch >============================
===== env: NO_DEPENDS=yes USER=root UID=0 GID=0
===> License GPLv2 LGPL20 LGPL21 GPLv3 LGPL3 accepted by the user
===> Fetching all distfiles required by gcc-arm-embedded-aarch64-14.2r1_1 for building
===========================================================================
=======================<phase: checksum >============================
===== env: NO_DEPENDS=yes USER=root UID=0 GID=0
===> License GPLv2 LGPL20 LGPL21 GPLv3 LGPL3 accepted by the user
===> Fetching all distfiles required by gcc-arm-embedded-aarch64-14.2r1_1 for building
=> SHA256 Checksum OK for arm-gnu-toolchain-src-snapshot-14.2.rel1.tar.xz.
=> SHA256 Checksum OK for gnu-devtools-for-arm-v1.3.0.tar.bz2.
===========================================================================
=======================<phase: extract-depends>============================
===== env: USE_PACKAGE_DEPENDS_ONLY=1 USER=root UID=0 GID=0
===========================================================================
=======================<phase: extract >============================
===== env: NO_DEPENDS=yes USER=root UID=0 GID=0
===> License GPLv2 LGPL20 LGPL21 GPLv3 LGPL3 accepted by the user
===> Fetching all distfiles required by gcc-arm-embedded-aarch64-14.2r1_1 for building
===> Extracting for gcc-arm-embedded-aarch64-14.2r1_1
=> SHA256 Checksum OK for arm-gnu-toolchain-src-snapshot-14.2.rel1.tar.xz.
=> SHA256 Checksum OK for gnu-devtools-for-arm-v1.3.0.tar.bz2.
===========================================================================
=======================<phase: patch-depends >============================
===== env: USE_PACKAGE_DEPENDS_ONLY=1 USER=root UID=0 GID=0
===========================================================================
=======================<phase: patch >============================
===== env: NO_DEPENDS=yes USER=root UID=0 GID=0
===> Patching for gcc-arm-embedded-aarch64-14.2r1_1
===> Applying FreeBSD patches for gcc-arm-embedded-aarch64-14.2r1_1 from /usr/ports/devel/gcc-arm-embedded/files
===========================================================================
=======================<phase: build-depends >============================
===== env: USE_PACKAGE_DEPENDS_ONLY=1 USER=root UID=0 GID=0
===> gcc-arm-embedded-aarch64-14.2r1_1 depends on executable: bash - not found
===> Installing existing package /packages/All/bash-5.2.37.pkg
[134i386-default-job-09] Installing bash-5.2.37...
[134i386-default-job-09] `-- Installing gettext-runtime-0.23.1...
[134i386-default-job-09] | `-- Installing indexinfo-0.3.1_1...
[134i386-default-job-09] | `-- Extracting indexinfo-0.3.1_1: .... done
[134i386-default-job-09] `-- Extracting gettext-runtime-0.23.1: .......... done
[134i386-default-job-09] `-- Installing readline-8.2.13_2...
[134i386-default-job-09] `-- Extracting readline-8.2.13_2: .......... done
[134i386-default-job-09] Extracting bash-5.2.37: .......... done
===> gcc-arm-embedded-aarch64-14.2r1_1 depends on executable: bash - found
===> Returning to build of gcc-arm-embedded-aarch64-14.2r1_1
===> gcc-arm-embedded-aarch64-14.2r1_1 depends on executable: gfind - not found
===> Installing existing package /packages/All/findutils-4.10.0.pkg
<snip>
1698 | for_user)) cgraph_edge
| ^
/wrkdirs/usr/ports/devel/gcc-arm-embedded/work-aarch64/src/gcc/gcc/cgraph.h:2641:32: note: did you mean class here?
2641 | void initialize_inline_failed (struct cgraph_edge *);
| ^~~~~~
| class
/wrkdirs/usr/ports/devel/gcc-arm-embedded/work-aarch64/src/gcc/gcc/cgraph.h:2642:28: warning: struct 'cgraph_edge' was previously declared as a class; this is valid, but may result in linker errors under the Microsoft C++ ABI [-Wmismatched-tags]
2642 | bool speculation_useful_p (struct cgraph_edge *e, bool anticipate_inlining);
| ^
/wrkdirs/usr/ports/devel/gcc-arm-embedded/work-aarch64/src/gcc/gcc/cgraph.h:1698:16: note: previous use is here
1698 | for_user)) cgraph_edge
| ^
/wrkdirs/usr/ports/devel/gcc-arm-embedded/work-aarch64/src/gcc/gcc/cgraph.h:2642:28: note: did you mean class here?
2642 | bool speculation_useful_p (struct cgraph_edge *e, bool anticipate_inlining);
| ^~~~~~
| class
In file included from /wrkdirs/usr/ports/devel/gcc-arm-embedded/work-aarch64/src/gcc/gcc/varpool.cc:33:
/wrkdirs/usr/ports/devel/gcc-arm-embedded/work-aarch64/src/gcc/gcc/output.h:129:6: warning: '__format__' attribute argument not supported: asm_fprintf [-Wignored-attributes]
129 | ATTRIBUTE_ASM_FPRINTF(2, 3);
| ^
/wrkdirs/usr/ports/devel/gcc-arm-embedded/work-aarch64/src/gcc/gcc/output.h:119:53: note: expanded from macro 'ATTRIBUTE_ASM_FPRINTF'
119 | #define ATTRIBUTE_ASM_FPRINTF(m, n) __attribute__ ((__format__ (__asm_fprintf__, m, n))) ATTRIBUTE_NONNULL(m)
| ^
8 warnings generated.
c++ -fno-PIE -c -O2 -DIN_GCC -DCROSS_DIRECTORY_STRUCTURE -fno-strict-aliasing -fno-exceptions -fno-rtti -fasynchronous-unwind-tables -W -Wall -Wno-narrowing -Wwrite-strings -Wcast-qual -Wmissing-format-attribute -Wconditionally-supported -Woverloaded-virtual -pedantic -Wno-long-long -Wno-variadic-macros -Wno-overlength-strings -DHAVE_CONFIG_H -fno-PIE -I. -I. -I/wrkdirs/usr/ports/devel/gcc-arm-embedded/work-aarch64/src/gcc/gcc -I/wrkdirs/usr/ports/devel/gcc-arm-embedded/work-aarch64/src/gcc/gcc/. -I/wrkdirs/usr/ports/devel/gcc-arm-embedded/work-aarch64/src/gcc/gcc/../include -I/wrkdirs/usr/ports/devel/gcc-arm-embedded/work-aarch64/src/gcc/gcc/../libcpp/include -I/wrkdirs/usr/ports/devel/gcc-arm-embedded/work-aarch64/src/gcc/gcc/../libcody -I/wrkdirs/usr/ports/devel/gcc-arm-embedded/work-aarch64/build/host-tools/include -I/wrkdirs/usr/ports/devel/gcc-arm-embedded/work-aarch64/build/host-tools/include -I/wrkdirs/usr/ports/devel/gcc-arm-embedded/work-aarch64/build/host
-tools/include -I/wrkdirs/usr/ports/devel/gcc-arm-embedded/work-aarch64/src/gcc/gcc/../libdecnumber -I/wrkdirs/usr/ports/devel/gcc-arm-embedded/work-aarch64/src/gcc/gcc/../libdecnumber/bid -I../libdecnumber -I/wrkdirs/usr/ports/devel/gcc-arm-embedded/work-aarch64/src/gcc/gcc/../libbacktrace -o vec-perm-indices.o -MT vec-perm-indices.o -MMD -MP -MF ./.deps/vec-perm-indices.TPo /wrkdirs/usr/ports/devel/gcc-arm-embedded/work-aarch64/src/gcc/gcc/vec-perm-indices.cc
warning: unknown warning option '-Wconditionally-supported' [-Wunknown-warning-option]
In file included from /wrkdirs/usr/ports/devel/gcc-arm-embedded/work-aarch64/src/gcc/gcc/vec-perm-indices.cc:22:
In file included from /wrkdirs/usr/ports/devel/gcc-arm-embedded/work-aarch64/src/gcc/gcc/coretypes.h:487:
/wrkdirs/usr/ports/devel/gcc-arm-embedded/work-aarch64/src/gcc/gcc/poly-int.h:373:1: warning: 'poly_int' defined as a struct template here but previously declared as a class template; this is valid, but may result in linker errors under the Microsoft C++ ABI [-Wmismatched-tags]
373 | struct poly_int
| ^
/wrkdirs/usr/ports/devel/gcc-arm-embedded/work-aarch64/src/gcc/gcc/poly-int.h:32:38: note: did you mean struct here?
32 | template<unsigned int N, typename T> class poly_int;
| ^~~~~
| struct
In file included from /wrkdirs/usr/ports/devel/gcc-arm-embedded/work-aarch64/src/gcc/gcc/vec-perm-indices.cc:22:
In file included from /wrkdirs/usr/ports/devel/gcc-arm-embedded/work-aarch64/src/gcc/gcc/coretypes.h:498:
In file included from /wrkdirs/usr/ports/devel/gcc-arm-embedded/work-aarch64/src/gcc/gcc/hash-table.h:250:
/wrkdirs/usr/ports/devel/gcc-arm-embedded/work-aarch64/src/gcc/gcc/inchash.h:91:30: warning: class 'real_value' was previously declared as a struct; this is valid, but may result in linker errors under the Microsoft C++ ABI [-Wmismatched-tags]
91 | void add_real_value (const class real_value &v);
| ^
/wrkdirs/usr/ports/devel/gcc-arm-embedded/work-aarch64/src/gcc/gcc/real.h:39:16: note: previous use is here
39 | struct GTY(()) real_value {
| ^
/wrkdirs/usr/ports/devel/gcc-arm-embedded/work-aarch64/src/gcc/gcc/inchash.h:91:30: note: did you mean struct here?
91 | void add_real_value (const class real_value &v);
| ^~~~~
| struct
3 warnings generated.
c++ -fno-PIE -c -O2 -DIN_GCC -DCROSS_DIRECTORY_STRUCTURE -fno-strict-aliasing -fno-exceptions -fno-rtti -fasynchronous-unwind-tables -W -Wall -Wno-narrowing -Wwrite-strings -Wcast-qual -Wmissing-format-attribute -Wconditionally-supported -Woverloaded-virtual -pedantic -Wno-long-long -Wno-variadic-macros -Wno-overlength-strings -DHAVE_CONFIG_H -fno-PIE -I. -I. -I/wrkdirs/usr/ports/devel/gcc-arm-embedded/work-aarch64/src/gcc/gcc -I/wrkdirs/usr/ports/devel/gcc-arm-embedded/work-aarch64/src/gcc/gcc/. -I/wrkdirs/usr/ports/devel/gcc-arm-embedded/work-aarch64/src/gcc/gcc/../include -I/wrkdirs/usr/ports/devel/gcc-arm-embedded/work-aarch64/src/gcc/gcc/../libcpp/include -I/wrkdirs/usr/ports/devel/gcc-arm-embedded/work-aarch64/src/gcc/gcc/../libcody -I/wrkdirs/usr/ports/devel/gcc-arm-embedded/work-aarch64/build/host-tools/include -I/wrkdirs/usr/ports/devel/gcc-arm-embedded/work-aarch64/build/host-tools/include -I/wrkdirs/usr/ports/devel/gcc-arm-embedded/work-aarch64/build/host
-tools/include -I/wrkdirs/usr/ports/devel/gcc-arm-embedded/work-aarch64/src/gcc/gcc/../libdecnumber -I/wrkdirs/usr/ports/devel/gcc-arm-embedded/work-aarch64/src/gcc/gcc/../libdecnumber/bid -I../libdecnumber -I/wrkdirs/usr/ports/devel/gcc-arm-embedded/work-aarch64/src/gcc/gcc/../libbacktrace -o vmsdbgout.o -MT vmsdbgout.o -MMD -MP -MF ./.deps/vmsdbgout.TPo /wrkdirs/usr/ports/devel/gcc-arm-embedded/work-aarch64/src/gcc/gcc/vmsdbgout.cc
warning: unknown warning option '-Wconditionally-supported' [-Wunknown-warning-option]
In file included from /wrkdirs/usr/ports/devel/gcc-arm-embedded/work-aarch64/src/gcc/gcc/vmsdbgout.cc:24:
In file included from /wrkdirs/usr/ports/devel/gcc-arm-embedded/work-aarch64/src/gcc/gcc/coretypes.h:487:
/wrkdirs/usr/ports/devel/gcc-arm-embedded/work-aarch64/src/gcc/gcc/poly-int.h:373:1: warning: 'poly_int' defined as a struct template here but previously declared as a class template; this is valid, but may result in linker errors under the Microsoft C++ ABI [-Wmismatched-tags]
373 | struct poly_int
| ^
/wrkdirs/usr/ports/devel/gcc-arm-embedded/work-aarch64/src/gcc/gcc/poly-int.h:32:38: note: did you mean struct here?
32 | template<unsigned int N, typename T> class poly_int;
| ^~~~~
| struct
In file included from /wrkdirs/usr/ports/devel/gcc-arm-embedded/work-aarch64/src/gcc/gcc/vmsdbgout.cc:24:
In file included from /wrkdirs/usr/ports/devel/gcc-arm-embedded/work-aarch64/src/gcc/gcc/coretypes.h:498:
In file included from /wrkdirs/usr/ports/devel/gcc-arm-embedded/work-aarch64/src/gcc/gcc/hash-table.h:250:
/wrkdirs/usr/ports/devel/gcc-arm-embedded/work-aarch64/src/gcc/gcc/inchash.h:91:30: warning: class 'real_value' was previously declared as a struct; this is valid, but may result in linker errors under the Microsoft C++ ABI [-Wmismatched-tags]
91 | void add_real_value (const class real_value &v);
| ^
/wrkdirs/usr/ports/devel/gcc-arm-embedded/work-aarch64/src/gcc/gcc/real.h:39:16: note: previous use is here
39 | struct GTY(()) real_value {
| ^
/wrkdirs/usr/ports/devel/gcc-arm-embedded/work-aarch64/src/gcc/gcc/inchash.h:91:30: note: did you mean struct here?
91 | void add_real_value (const class real_value &v);
| ^~~~~
| struct
5 warnings generated.
c++ -fno-PIE -c -O2 -DIN_GCC -DCROSS_DIRECTORY_STRUCTURE -fno-strict-aliasing -fno-exceptions -fno-rtti -fasynchronous-unwind-tables -W -Wall -Wno-narrowing -Wwrite-strings -Wcast-qual -Wmissing-format-attribute -Wconditionally-supported -Woverloaded-virtual -pedantic -Wno-long-long -Wno-variadic-macros -Wno-overlength-strings -DHAVE_CONFIG_H -fno-PIE -I. -I. -I/wrkdirs/usr/ports/devel/gcc-arm-embedded/work-aarch64/src/gcc/gcc -I/wrkdirs/usr/ports/devel/gcc-arm-embedded/work-aarch64/src/gcc/gcc/. -I/wrkdirs/usr/ports/devel/gcc-arm-embedded/work-aarch64/src/gcc/gcc/../include -I/wrkdirs/usr/ports/devel/gcc-arm-embedded/work-aarch64/src/gcc/gcc/../libcpp/include -I/wrkdirs/usr/ports/devel/gcc-arm-embedded/work-aarch64/src/gcc/gcc/../libcody -I/wrkdirs/usr/ports/devel/gcc-arm-embedded/work-aarch64/build/host-tools/include -I/wrkdirs/usr/ports/devel/gcc-arm-embedded/work-aarch64/build/host-tools/include -I/wrkdirs/usr/ports/devel/gcc-arm-embedded/work-aarch64/build/host
-tools/include -I/wrkdirs/usr/ports/devel/gcc-arm-embedded/work-aarch64/src/gcc/gcc/../libdecnumber -I/wrkdirs/usr/ports/devel/gcc-arm-embedded/work-aarch64/src/gcc/gcc/../libdecnumber/bid -I../libdecnumber -I/wrkdirs/usr/ports/devel/gcc-arm-embedded/work-aarch64/src/gcc/gcc/../libbacktrace -o vr-values.o -MT vr-values.o -MMD -MP -MF ./.deps/vr-values.TPo /wrkdirs/usr/ports/devel/gcc-arm-embedded/work-aarch64/src/gcc/gcc/vr-values.cc
warning: unknown warning option '-Wconditionally-supported' [-Wunknown-warning-option]
In file included from /wrkdirs/usr/ports/devel/gcc-arm-embedded/work-aarch64/src/gcc/gcc/vr-values.cc:22:
In file included from /wrkdirs/usr/ports/devel/gcc-arm-embedded/work-aarch64/src/gcc/gcc/coretypes.h:487:
/wrkdirs/usr/ports/devel/gcc-arm-embedded/work-aarch64/src/gcc/gcc/poly-int.h:373:1: warning: 'poly_int' defined as a struct template here but previously declared as a class template; this is valid, but may result in linker errors under the Microsoft C++ ABI [-Wmismatched-tags]
373 | struct poly_int
| ^
/wrkdirs/usr/ports/devel/gcc-arm-embedded/work-aarch64/src/gcc/gcc/poly-int.h:32:38: note: did you mean struct here?
32 | template<unsigned int N, typename T> class poly_int;
| ^~~~~
| struct
3 warnings generated.
c++ -fno-PIE -c -O2 -DIN_GCC -DCROSS_DIRECTORY_STRUCTURE -fno-strict-aliasing -fno-exceptions -fno-rtti -fasynchronous-unwind-tables -W -Wall -Wno-narrowing -Wwrite-strings -Wcast-qual -Wmissing-format-attribute -Wconditionally-supported -Woverloaded-virtual -pedantic -Wno-long-long -Wno-variadic-macros -Wno-overlength-strings -DHAVE_CONFIG_H -fno-PIE -I. -I. -I/wrkdirs/usr/ports/devel/gcc-arm-embedded/work-aarch64/src/gcc/gcc -I/wrkdirs/usr/ports/devel/gcc-arm-embedded/work-aarch64/src/gcc/gcc/. -I/wrkdirs/usr/ports/devel/gcc-arm-embedded/work-aarch64/src/gcc/gcc/../include -I/wrkdirs/usr/ports/devel/gcc-arm-embedded/work-aarch64/src/gcc/gcc/../libcpp/include -I/wrkdirs/usr/ports/devel/gcc-arm-embedded/work-aarch64/src/gcc/gcc/../libcody -I/wrkdirs/usr/ports/devel/gcc-arm-embedded/work-aarch64/build/host-tools/include -I/wrkdirs/usr/ports/devel/gcc-arm-embedded/work-aarch64/build/host-tools/include -I/wrkdirs/usr/ports/devel/gcc-arm-embedded/work-aarch64/build/host
-tools/include -I/wrkdirs/usr/ports/devel/gcc-arm-embedded/work-aarch64/src/gcc/gcc/../libdecnumber -I/wrkdirs/usr/ports/devel/gcc-arm-embedded/work-aarch64/src/gcc/gcc/../libdecnumber/bid -I../libdecnumber -I/wrkdirs/usr/ports/devel/gcc-arm-embedded/work-aarch64/src/gcc/gcc/../libbacktrace -o vtable-verify.o -MT vtable-verify.o -MMD -MP -MF ./.deps/vtable-verify.TPo /wrkdirs/usr/ports/devel/gcc-arm-embedded/work-aarch64/src/gcc/gcc/vtable-verify.cc
warning: unknown warning option '-Wconditionally-supported' [-Wunknown-warning-option]
In file included from /wrkdirs/usr/ports/devel/gcc-arm-embedded/work-aarch64/src/gcc/gcc/vr-values.cc:22:
In file included from /wrkdirs/usr/ports/devel/gcc-arm-embedded/work-aarch64/src/gcc/gcc/coretypes.h:498:
In file included from /wrkdirs/usr/ports/devel/gcc-arm-embedded/work-aarch64/src/gcc/gcc/hash-table.h:250:
/wrkdirs/usr/ports/devel/gcc-arm-embedded/work-aarch64/src/gcc/gcc/inchash.h:91:30: warning: class 'real_value' was previously declared as a struct; this is valid, but may result in linker errors under the Microsoft C++ ABI [-Wmismatched-tags]
91 | void add_real_value (const class real_value &v);
| ^
/wrkdirs/usr/ports/devel/gcc-arm-embedded/work-aarch64/src/gcc/gcc/real.h:39:16: note: previous use is here
39 | struct GTY(()) real_value {
| ^
/wrkdirs/usr/ports/devel/gcc-arm-embedded/work-aarch64/src/gcc/gcc/inchash.h:91:30: note: did you mean struct here?
91 | void add_real_value (const class real_value &v);
| ^~~~~
| struct
33 warnings generated.
c++ -fno-PIE -c -O2 -DIN_GCC -DCROSS_DIRECTORY_STRUCTURE -fno-strict-aliasing -fno-exceptions -fno-rtti -fasynchronous-unwind-tables -W -Wall -Wno-narrowing -Wwrite-strings -Wcast-qual -Wmissing-format-attribute -Wconditionally-supported -Woverloaded-virtual -pedantic -Wno-long-long -Wno-variadic-macros -Wno-overlength-strings -DHAVE_CONFIG_H -fno-PIE -I. -I. -I/wrkdirs/usr/ports/devel/gcc-arm-embedded/work-aarch64/src/gcc/gcc -I/wrkdirs/usr/ports/devel/gcc-arm-embedded/work-aarch64/src/gcc/gcc/. -I/wrkdirs/usr/ports/devel/gcc-arm-embedded/work-aarch64/src/gcc/gcc/../include -I/wrkdirs/usr/ports/devel/gcc-arm-embedded/work-aarch64/src/gcc/gcc/../libcpp/include -I/wrkdirs/usr/ports/devel/gcc-arm-embedded/work-aarch64/src/gcc/gcc/../libcody -I/wrkdirs/usr/ports/devel/gcc-arm-embedded/work-aarch64/build/host-tools/include -I/wrkdirs/usr/ports/devel/gcc-arm-embedded/work-aarch64/build/host-tools/include -I/wrkdirs/usr/ports/devel/gcc-arm-embedded/work-aarch64/build/host
-tools/include -I/wrkdirs/usr/ports/devel/gcc-arm-embedded/work-aarch64/src/gcc/gcc/../libdecnumber -I/wrkdirs/usr/ports/devel/gcc-arm-embedded/work-aarch64/src/gcc/gcc/../libdecnumber/bid -I../libdecnumber -I/wrkdirs/usr/ports/devel/gcc-arm-embedded/work-aarch64/src/gcc/gcc/../libbacktrace -o warning-control.o -MT warning-control.o -MMD -MP -MF ./.deps/warning-control.TPo /wrkdirs/usr/ports/devel/gcc-arm-embedded/work-aarch64/src/gcc/gcc/warning-control.cc
warning: unknown warning option '-Wconditionally-supported' [-Wunknown-warning-option]
In file included from /wrkdirs/usr/ports/devel/gcc-arm-embedded/work-aarch64/src/gcc/gcc/vtable-verify.cc:137:
In file included from /wrkdirs/usr/ports/devel/gcc-arm-embedded/work-aarch64/src/gcc/gcc/coretypes.h:487:
/wrkdirs/usr/ports/devel/gcc-arm-embedded/work-aarch64/src/gcc/gcc/poly-int.h:373:1: warning: 'poly_int' defined as a struct template here but previously declared as a class template; this is valid, but may result in linker errors under the Microsoft C++ ABI [-Wmismatched-tags]
373 | struct poly_int
| ^
/wrkdirs/usr/ports/devel/gcc-arm-embedded/work-aarch64/src/gcc/gcc/poly-int.h:32:38: note: did you mean struct here?
32 | template<unsigned int N, typename T> class poly_int;
| ^~~~~
| struct
PLEASE submit a bug report to https://bugs.freebsd.org/submit/ and include the crash backtrace, preprocessed source, and associated run script.
Stack dump:
0. Program arguments: c++ -fno-PIE -c -O2 -DIN_GCC -DCROSS_DIRECTORY_STRUCTURE -fno-strict-aliasing -fno-exceptions -fno-rtti -fasynchronous-unwind-tables -W -Wall -Wno-narrowing -Wwrite-strings -Wcast-qual -Wmissing-format-attribute -Wconditionally-supported -Woverloaded-virtual -pedantic -Wno-long-long -Wno-variadic-macros -Wno-overlength-strings -DHAVE_CONFIG_H -fno-PIE -I. -I. -I/wrkdirs/usr/ports/devel/gcc-arm-embedded/work-aarch64/src/gcc/gcc -I/wrkdirs/usr/ports/devel/gcc-arm-embedded/work-aarch64/src/gcc/gcc/. -I/wrkdirs/usr/ports/devel/gcc-arm-embedded/work-aarch64/src/gcc/gcc/../include -I/wrkdirs/usr/ports/devel/gcc-arm-embedded/work-aarch64/src/gcc/gcc/../libcpp/include -I/wrkdirs/usr/ports/devel/gcc-arm-embedded/work-aarch64/src/gcc/gcc/../libcody -I/wrkdirs/usr/ports/devel/gcc-arm-embedded/work-aarch64/build/host-tools/include -I/wrkdirs/usr/ports/devel/gcc-arm-embedded/work-aarch64/build/host-tools/include -I/wrkdirs/usr/ports/devel/gcc-arm-embedded/work-aarch
64/build/host-tools/include -I/wrkdirs/usr/ports/devel/gcc-arm-embedded/work-aarch64/src/gcc/gcc/../libdecnumber -I/wrkdirs/usr/ports/devel/gcc-arm-embedded/work-aarch64/src/gcc/gcc/../libdecnumber/bid -I../libdecnumber -I/wrkdirs/usr/ports/devel/gcc-arm-embedded/work-aarch64/src/gcc/gcc/../libbacktrace -o warning-control.o -MT warning-control.o -MMD -MP -MF ./.deps/warning-control.TPo /wrkdirs/usr/ports/devel/gcc-arm-embedded/work-aarch64/src/gcc/gcc/warning-control.cc
1. /usr/include/math.h:384:1: current parser token 'long'
#0 0x04eeb0e4 (/usr/bin/c+++0x4eeb0e4)
#1 0x04eeb5b0 (/usr/bin/c+++0x4eeb5b0)
#2 0x04ee90fe (/usr/bin/c+++0x4ee90fe)
#3 0x04eb060b (/usr/bin/c+++0x4eb060b)
#4 0x268aac59 (/lib/libthr.so.3+0x18c59)
#5 0x268aa109 (/lib/libthr.so.3+0x18109)
#6 0xffffea14 ([vdso]+0x294)
#7 0x032ba1d9 (/usr/bin/c+++0x32ba1d9)
#8 0x032b9455 (/usr/bin/c+++0x32b9455)
#9 0x032fce91 (/usr/bin/c+++0x32fce91)
#10 0x032ba777 (/usr/bin/c+++0x32ba777)
#11 0x032ba1d2 (/usr/bin/c+++0x32ba1d2)
#12 0x032b9455 (/usr/bin/c+++0x32b9455)
#13 0x032b7303 (/usr/bin/c+++0x32b7303)
#14 0x032b1968 (/usr/bin/c+++0x32b1968)
#15 0x02ce1a29 (/usr/bin/c+++0x2ce1a29)
#16 0x02a3a281 (/usr/bin/c+++0x2a3a281)
#17 0x02ce1442 (/usr/bin/c+++0x2ce1442)
#18 0x02c1886c (/usr/bin/c+++0x2c1886c)
#19 0x02d8d24b (/usr/bin/c+++0x2d8d24b)
#20 0x020be21f (/usr/bin/c+++0x20be21f)
#21 0x020cd101 (/usr/bin/c+++0x20cd101)
#22 0x02aaec59 (/usr/bin/c+++0x2aaec59)
#23 0x04eb0416 (/usr/bin/c+++0x4eb0416)
#24 0x02aae54a (/usr/bin/c+++0x2aae54a)
#25 0x02a748db (/usr/bin/c+++0x2a748db)
#26 0x02a74b27 (/usr/bin/c+++0x2a74b27)
#27 0x02a904db (/usr/bin/c+++0x2a904db)
#28 0x020cc848 (/usr/bin/c+++0x20cc848)
c++: error: clang frontend command failed with exit code 139 (use -v to see invocation)
FreeBSD clang version 18.1.6 (https://github.com/llvm/llvm-project.git llvmorg-18.1.6-0-g1118c2e05e67)
Target: i386-unknown-freebsd13.4
Thread model: posix
InstalledDir: /usr/bin
In file included from /wrkdirs/usr/ports/devel/gcc-arm-embedded/work-aarch64/src/gcc/gcc/vtable-verify.cc:137:
In file included from /wrkdirs/usr/ports/devel/gcc-arm-embedded/work-aarch64/src/gcc/gcc/coretypes.h:498:
In file included from /wrkdirs/usr/ports/devel/gcc-arm-embedded/work-aarch64/src/gcc/gcc/hash-table.h:250:
/wrkdirs/usr/ports/devel/gcc-arm-embedded/work-aarch64/src/gcc/gcc/inchash.h:91:30: warning: class 'real_value' was previously declared as a struct; this is valid, but may result in linker errors under the Microsoft C++ ABI [-Wmismatched-tags]
91 | void add_real_value (const class real_value &v);
| ^
/wrkdirs/usr/ports/devel/gcc-arm-embedded/work-aarch64/src/gcc/gcc/real.h:39:16: note: previous use is here
39 | struct GTY(()) real_value {
| ^
/wrkdirs/usr/ports/devel/gcc-arm-embedded/work-aarch64/src/gcc/gcc/inchash.h:91:30: note: did you mean struct here?
91 | void add_real_value (const class real_value &v);
| ^~~~~
| struct
c++: note: diagnostic msg:
********************
PLEASE ATTACH THE FOLLOWING FILES TO THE BUG REPORT:
Preprocessed source(s) and associated run script(s) are located at:
c++: note: diagnostic msg: /tmp/warning-control-b23c68.cpp
c++: note: diagnostic msg: /tmp/warning-control-b23c68.sh
c++: note: diagnostic msg:
********************
gmake[2]: *** [Makefile:1199: warning-control.o] Error 1
gmake[2]: *** Waiting for unfinished jobs....
In file included from /wrkdirs/usr/ports/devel/gcc-arm-embedded/work-aarch64/src/gcc/gcc/vr-values.cc:43:
/wrkdirs/usr/ports/devel/gcc-arm-embedded/work-aarch64/src/gcc/gcc/tree-ssa-propagate.h:105:16: warning: 'value_of_expr' overrides a member function but is not marked 'override' [-Winconsistent-missing-override]
105 | virtual tree value_of_expr (tree expr, gimple * = NULL) = 0;
| ^
/wrkdirs/usr/ports/devel/gcc-arm-embedded/work-aarch64/src/gcc/gcc/value-query.h:60:16: note: overridden virtual function is here
60 | virtual tree value_of_expr (tree expr, gimple * = NULL);
| ^
In file included from /wrkdirs/usr/ports/devel/gcc-arm-embedded/work-aarch64/src/gcc/gcc/vr-values.cc:43:
/wrkdirs/usr/ports/devel/gcc-arm-embedded/work-aarch64/src/gcc/gcc/tree-ssa-propagate.h:108:16: warning: 'range_of_expr' overrides a member function but is not marked 'override' [-Winconsistent-missing-override]
108 | virtual bool range_of_expr (vrange &r, tree expr, gimple * = NULL);
| ^
/wrkdirs/usr/ports/devel/gcc-arm-embedded/work-aarch64/src/gcc/gcc/value-query.h:70:16: note: overridden virtual function is here
70 | virtual bool range_of_expr (vrange &r, tree expr, gimple * = NULL) = 0;
| ^
3 warnings generated.
5 warnings generated.
rm gfdl.pod gcc.pod gcov-dump.pod gcov-tool.pod fsf-funding.pod gpl.pod cpp.pod gcov.pod lto-dump.pod
gmake[2]: Leaving directory '/wrkdirs/usr/ports/devel/gcc-arm-embedded/work-aarch64/build/obj/gcc1/gcc'
gmake[1]: *** [Makefile:4674: all-gcc] Error 2
gmake[1]: Leaving directory '/wrkdirs/usr/ports/devel/gcc-arm-embedded/work-aarch64/build/obj/gcc1'
*** Error code 2
Stop.
make: stopped in /usr/ports/devel/gcc-arm-embedded