[package - main-arm64-default][devel/flatbuffers205] Failed for flatbuffers205-2.0.5 in build
- Go to: [ bottom of page ] [ top of archives ] [ this month ]
Date: Thu, 31 Oct 2024 07:49:05 UTC
You are receiving this mail as a port that you maintain
is failing to build on the FreeBSD package build server.
Please investigate the failure and submit a PR to fix
build.
Maintainer: yuri@FreeBSD.org
Log URL: https://pkg-status.freebsd.org/ampere2/data/main-arm64-default/p711a2f7f1ca4_s0d965bc0342/logs/flatbuffers205-2.0.5.log
Build URL: https://pkg-status.freebsd.org/ampere2/build.html?mastername=main-arm64-default&build=p711a2f7f1ca4_s0d965bc0342
Log:
=>> Building devel/flatbuffers205
build started at Thu Oct 31 07:48:46 UTC 2024
port directory: /usr/ports/devel/flatbuffers205
package name: flatbuffers205-2.0.5
building for: FreeBSD main-arm64-default-job-02 15.0-CURRENT FreeBSD 15.0-CURRENT 1500026 arm64
maintained by: yuri@FreeBSD.org
Makefile datestamp: -rw-r--r-- 1 root wheel 807 Oct 6 01:01 /usr/ports/devel/flatbuffers205/Makefile
Ports top last git commit: 711a2f7f1ca
Ports top unclean checkout: no
Port dir last git commit: 4485bd8221c
Port dir unclean checkout: no
Poudriere version: poudriere-git-3.4.2
Host OSVERSION: 1500023
Jail OSVERSION: 1500026
Job Id: 02
!!! Jail is newer than host. (Jail: 1500026, Host: 1500023) !!!
!!! This is not supported. !!!
!!! Host kernel must be same or newer than jail. !!!
!!! Expect build failures. !!!
---Begin Environment---
SHELL=/bin/sh
OSVERSION=1500026
UNAME_v=FreeBSD 15.0-CURRENT 1500026
UNAME_r=15.0-CURRENT
BLOCKSIZE=K
MAIL=/var/mail/root
MM_CHARSET=UTF-8
LANG=C.UTF-8
STATUS=1
HOME=/root
PATH=/sbin:/bin:/usr/sbin:/usr/bin:/usr/local/sbin:/usr/local/bin:/root/bin
MAKE_OBJDIR_CHECK_WRITABLE=0
LOCALBASE=/usr/local
USER=root
POUDRIERE_NAME=poudriere-git
LIBEXECPREFIX=/usr/local/libexec/poudriere
POUDRIERE_VERSION=3.4.2
MASTERMNT=/usr/local/poudriere/data/.m/main-arm64-default/ref
LC_COLLATE=C
POUDRIERE_BUILD_TYPE=bulk
PACKAGE_BUILDING=yes
SAVED_TERM=
OUTPUT_REDIRECTED_STDERR=4
OUTPUT_REDIRECTED=1
PWD=/usr/local/poudriere/data/.m/main-arm64-default/02/.p
OUTPUT_REDIRECTED_STDOUT=3
P_PORTS_FEATURES=FLAVORS SUBPACKAGES SELECTED_OPTIONS
MASTERNAME=main-arm64-default
SCRIPTPREFIX=/usr/local/share/poudriere
SCRIPTNAME=bulk.sh
OLDPWD=/usr/local/poudriere/data/.m/main-arm64-default/ref/.p/pool
POUDRIERE_PKGNAME=poudriere-git-3.4.2
SCRIPTPATH=/usr/local/share/poudriere/bulk.sh
POUDRIEREPATH=/usr/local/bin/poudriere
---End Environment---
---Begin Poudriere Port Flags/Env---
PORT_FLAGS=
PKGENV=
FLAVOR=
MAKE_ARGS=
---End Poudriere Port Flags/Env---
---Begin OPTIONS List---
---End OPTIONS List---
--MAINTAINER--
yuri@FreeBSD.org
--End MAINTAINER--
--CONFIGURE_ARGS--
--End CONFIGURE_ARGS--
--CONFIGURE_ENV--
PYTHON="/usr/local/bin/python3.11" XDG_DATA_HOME=/wrkdirs/usr/ports/devel/flatbuffers205/work XDG_CONFIG_HOME=/wrkdirs/usr/ports/devel/flatbuffers205/work XDG_CACHE_HOME=/wrkdirs/usr/ports/devel/flatbuffers205/work/.cache HOME=/wrkdirs/usr/ports/devel/flatbuffers205/work TMPDIR="/tmp" PATH=/wrkdirs/usr/ports/devel/flatbuffers205/work/.bin:/sbin:/bin:/usr/sbin:/usr/bin:/usr/local/sbin:/usr/local/bin:/root/bin PKG_CONFIG_LIBDIR=/wrkdirs/usr/ports/devel/flatbuffers205/work/.pkgconfig:/usr/local/libdata/pkgconfig:/usr/local/share/pkgconfig:/usr/libdata/pkgconfig SHELL=/bin/sh CONFIG_SHELL=/bin/sh
--End CONFIGURE_ENV--
--MAKE_ENV--
NINJA_STATUS="[%p %s/%t] " XDG_DATA_HOME=/wrkdirs/usr/ports/devel/flatbuffers205/work XDG_CONFIG_HOME=/wrkdirs/usr/ports/devel/flatbuffers205/work XDG_CACHE_HOME=/wrkdirs/usr/ports/devel/flatbuffers205/work/.cache HOME=/wrkdirs/usr/ports/devel/flatbuffers205/work TMPDIR="/tmp" PATH=/wrkdirs/usr/ports/devel/flatbuffers205/work/.bin:/sbin:/bin:/usr/sbin:/usr/bin:/usr/local/sbin:/usr/local/bin:/root/bin PKG_CONFIG_LIBDIR=/wrkdirs/usr/ports/devel/flatbuffers205/work/.pkgconfig:/usr/local/libdata/pkgconfig:/usr/local/share/pkgconfig:/usr/libdata/pkgconfig MK_DEBUG_FILES=no MK_KERNEL_SYMBOLS=no SHELL=/bin/sh NO_LINT=YES DESTDIR=/wrkdirs/usr/ports/devel/flatbuffers205/work/stage PREFIX=/usr/local LOCALBASE=/usr/local CC="cc" CFLAGS="-O2 -pipe -fstack-protector-strong -fno-strict-aliasing " CPP="cpp" CPPFLAGS="" LDFLAGS=" -fstack-protector-strong " LIBS="" CXX="c++" CXXFLAGS="-O2 -pipe -fstack-protector-strong -fno-strict-aliasing -Wno-error=unused-command-line-argument "
BSD_INSTALL_PROGRAM="install -s -m 555" BSD_INSTALL_LIB="install -s -m 0644" BSD_INSTALL_SCRIPT="install -m 555" BSD_INSTALL_DATA="install -m 0644" BSD_INSTALL_MAN="install -m 444"
--End MAKE_ENV--
--PLIST_SUB--
CMAKE_BUILD_TYPE="release" PYTHON_INCLUDEDIR=include/python3.11 PYTHON_LIBDIR=lib/python3.11 PYTHON_PLATFORM=freebsd15 PYTHON_SITELIBDIR=lib/python3.11/site-packages PYTHON_SUFFIX=311 PYTHON_EXT_SUFFIX=.cpython-311 PYTHON_VER=3.11 PYTHON_VERSION=python3.11 PYTHON2="@comment " PYTHON3="" OSREL=15.0 PREFIX=%D LOCALBASE=/usr/local RESETPREFIX=/usr/local LIB32DIR=lib DOCSDIR="share/doc/flatbuffers" EXAMPLESDIR="share/examples/flatbuffers" DATADIR="share/flatbuffers" WWWDIR="www/flatbuffers" ETCDIR="etc/flatbuffers"
--End PLIST_SUB--
--SUB_LIST--
PYTHON_INCLUDEDIR=/usr/local/include/python3.11 PYTHON_LIBDIR=/usr/local/lib/python3.11 PYTHON_PLATFORM=freebsd15 PYTHON_SITELIBDIR=/usr/local/lib/python3.11/site-packages PYTHON_SUFFIX=311 PYTHON_EXT_SUFFIX=.cpython-311 PYTHON_VER=3.11 PYTHON_VERSION=python3.11 PYTHON2="@comment " PYTHON3="" PREFIX=/usr/local LOCALBASE=/usr/local DATADIR=/usr/local/share/flatbuffers DOCSDIR=/usr/local/share/doc/flatbuffers EXAMPLESDIR=/usr/local/share/examples/flatbuffers WWWDIR=/usr/local/www/flatbuffers ETCDIR=/usr/local/etc/flatbuffers
--End SUB_LIST--
---Begin make.conf---
# XXX: We really need this but cannot use it while 'make checksum' does not
# try the next mirror on checksum failure. It currently retries the same
# failed mirror and then fails rather then trying another. It *does*
# try the next if the size is mismatched though.
#MASTER_SITE_FREEBSD=yes
# Build ALLOW_MAKE_JOBS_PACKAGES with 3 jobs
MAKE_JOBS_NUMBER=3
USE_PACKAGE_DEPENDS=yes
BATCH=yes
WRKDIRPREFIX=/wrkdirs
PORTSDIR=/usr/ports
PACKAGES=/packages
DISTDIR=/distfiles
PACKAGE_BUILDING=yes
PACKAGE_BUILDING_FLAVORS=yes
#### ####
# XXX: We really need this but cannot use it while 'make checksum' does not
# try the next mirror on checksum failure. It currently retries the same
# failed mirror and then fails rather then trying another. It *does*
# try the next if the size is mismatched though.
#MASTER_SITE_FREEBSD=yes
# Build ALLOW_MAKE_JOBS_PACKAGES with 3 jobs
MAKE_JOBS_NUMBER=3
#### Misc Poudriere ####
.include "/etc/make.conf.ports_env"
GID=0
UID=0
---End make.conf---
--Resource limits--
ulimit: can't get limit: Invalid argument
cpu time (seconds, -t) unlimited
file size (512-blocks, -f) unlimited
data seg size (kbytes, -d) 1048576
stack size (kbytes, -s) 1048576
core file size (512-blocks, -c) unlimited
max memory size (kbytes, -m) unlimited
locked memory (kbytes, -l) unlimited
max user processes (-u) 89999
open files (-n) 8192
virtual mem size (kbytes, -v) unlimited
swap limit (kbytes, -w) unlimited
socket buffer size (bytes, -b) unlimited
pseudo-terminals (-p) unlimited
kqueues (-k) unlimited
umtx shared locks (-o) unlimited
--End resource limits--
=======================<phase: check-sanity >============================
===== env: NO_DEPENDS=yes USER=root UID=0 GID=0
===> License APACHE20 accepted by the user
===========================================================================
=======================<phase: pkg-depends >============================
===== env: USE_PACKAGE_DEPENDS_ONLY=1 USER=root UID=0 GID=0
===> flatbuffers205-2.0.5 depends on file: /usr/local/sbin/pkg - not found
===> Installing existing package /packages/All/pkg-1.21.3.pkg
[main-arm64-default-job-02] Installing pkg-1.21.3...
[main-arm64-default-job-02] Extracting pkg-1.21.3: .......... done
===> flatbuffers205-2.0.5 depends on file: /usr/local/sbin/pkg - found
===> Returning to build of flatbuffers205-2.0.5
===========================================================================
=======================<phase: fetch-depends >============================
===== env: USE_PACKAGE_DEPENDS_ONLY=1 USER=root UID=0 GID=0
===========================================================================
=======================<phase: fetch >============================
===== env: NO_DEPENDS=yes USER=root UID=0 GID=0
===> License APACHE20 accepted by the user
===> Fetching all distfiles required by flatbuffers205-2.0.5 for building
===========================================================================
=======================<phase: checksum >============================
===== env: NO_DEPENDS=yes USER=root UID=0 GID=0
===> License APACHE20 accepted by the user
===> Fetching all distfiles required by flatbuffers205-2.0.5 for building
=> SHA256 Checksum OK for google-flatbuffers-v2.0.5_GH0.tar.gz.
===========================================================================
=======================<phase: extract-depends>============================
===== env: USE_PACKAGE_DEPENDS_ONLY=1 USER=root UID=0 GID=0
===========================================================================
=======================<phase: extract >============================
===== env: NO_DEPENDS=yes USER=root UID=0 GID=0
===> License APACHE20 accepted by the user
===> Fetching all distfiles required by flatbuffers205-2.0.5 for building
===> Extracting for flatbuffers205-2.0.5
=> SHA256 Checksum OK for google-flatbuffers-v2.0.5_GH0.tar.gz.
===========================================================================
=======================<phase: patch-depends >============================
===== env: USE_PACKAGE_DEPENDS_ONLY=1 USER=root UID=0 GID=0
===========================================================================
=======================<phase: patch >============================
===== env: NO_DEPENDS=yes USER=root UID=0 GID=0
===> Patching for flatbuffers205-2.0.5
===========================================================================
=======================<phase: build-depends >============================
===== env: USE_PACKAGE_DEPENDS_ONLY=1 USER=root UID=0 GID=0
===> flatbuffers205-2.0.5 depends on file: /usr/local/bin/cmake - not found
===> Installing existing package /packages/All/cmake-core-3.30.5.pkg
[main-arm64-default-job-02] Installing cmake-core-3.30.5...
[main-arm64-default-job-02] `-- Installing expat-2.6.3...
[main-arm64-default-job-02] `-- Extracting expat-2.6.3: .......... done
[main-arm64-default-job-02] `-- Installing jsoncpp-1.9.6_1...
[main-arm64-default-job-02] `-- Extracting jsoncpp-1.9.6_1: .......... done
[main-arm64-default-job-02] `-- Installing libuv-1.49.1...
[main-arm64-default-job-02] `-- Extracting libuv-1.49.1: .......... done
[main-arm64-default-job-02] `-- Installing rhash-1.4.4_1...
[main-arm64-default-job-02] | `-- Installing gettext-runtime-0.22.5...
[main-arm64-default-job-02] | | `-- Installing indexinfo-0.3.1...
[main-arm64-default-job-02] | | `-- Extracting indexinfo-0.3.1: .... done
[main-arm64-default-job-02] | `-- Extracting gettext-runtime-0.22.5: .......... done
[main-arm64-default-job-02] `-- Extracting rhash-1.4.4_1: .......... done
[main-arm64-default-job-02] Extracting cmake-core-3.30.5: .......... done
===> flatbuffers205-2.0.5 depends on file: /usr/local/bin/cmake - found
===> Returning to build of flatbuffers205-2.0.5
===> flatbuffers205-2.0.5 depends on executable: ninja - not found
===> Installing existing package /packages/All/ninja-1.11.1,4.pkg
[main-arm64-default-job-02] Installing ninja-1.11.1,4...
[main-arm64-default-job-02] `-- Installing python311-3.11.10...
[main-arm64-default-job-02] | `-- Installing libffi-3.4.6...
[main-arm64-default-job-02] | `-- Extracting libffi-3.4.6: .......... done
[main-arm64-default-job-02] | `-- Installing mpdecimal-4.0.0...
[main-arm64-default-job-02] | `-- Extracting mpdecimal-4.0.0: .......... done
[main-arm64-default-job-02] | `-- Installing readline-8.2.13_2...
[main-arm64-default-job-02] | `-- Extracting readline-8.2.13_2: .......... done
[main-arm64-default-job-02] `-- Extracting python311-3.11.10: .......... done
[main-arm64-default-job-02] Extracting ninja-1.11.1,4: ........ done
=====
Message from python311-3.11.10:
--
Note that some standard Python modules are provided as separate ports
as they require additional dependencies. They are available as:
py311-gdbm databases/py-gdbm@py311
py311-sqlite3 databases/py-sqlite3@py311
py311-tkinter x11-toolkits/py-tkinter@py311
===> flatbuffers205-2.0.5 depends on executable: ninja - found
===> Returning to build of flatbuffers205-2.0.5
===> flatbuffers205-2.0.5 depends on file: /usr/local/bin/python3.11 - found
===========================================================================
=======================<phase: lib-depends >============================
===== env: USE_PACKAGE_DEPENDS_ONLY=1 USER=root UID=0 GID=0
===========================================================================
=======================<phase: configure >============================
===== env: NO_DEPENDS=yes USER=root UID=0 GID=0
===> Configuring for flatbuffers205-2.0.5
===> Performing out-of-source build
/bin/mkdir -p /wrkdirs/usr/ports/devel/flatbuffers205/work/.build
CMake Deprecation Warning at CMakeLists.txt:1 (cmake_minimum_required):
Compatibility with CMake < 3.5 will be removed from a future version of
CMake.
Update the VERSION argument <min> value or use a ...<max> suffix to tell
CMake that the project does not need compatibility with older versions.
-- The CXX compiler identification is Clang 19.1.2
-- Detecting CXX compiler ABI info
-- Detecting CXX compiler ABI info - done
-- Check for working CXX compiler: /usr/bin/c++ - skipped
-- Detecting CXX compile features
-- Detecting CXX compile features - done
CMake Warning at CMake/Version.cmake:22 (message):
git describe failed with exit code: 1
Call Stack (most recent call first):
CMakeLists.txt:13 (include)
-- Proceeding with version: 2.0.5.0
-- Looking for strtof_l
-- Looking for strtof_l - not found
-- Looking for strtoull_l
-- Looking for strtoull_l - not found
-- CMAKE_CXX_FLAGS: -O2 -pipe -fstack-protector-strong -fno-strict-aliasing -Wno-error=unused-command-line-argument -std=c++0x -Wall -pedantic -Werror -Wextra -Wno-unused-parameter -stdlib=libc++ -fsigned-char
CMake Warning (dev) at CMakeLists.txt:520 (find_package):
Policy CMP0148 is not set: The FindPythonInterp and FindPythonLibs modules
are removed. Run "cmake --help-policy CMP0148" for policy details. Use
the cmake_policy command to set the policy and suppress this warning.
This warning is for project developers. Use -Wno-dev to suppress it.
-- Found PythonInterp: /wrkdirs/usr/ports/devel/flatbuffers205/work/.bin/python3 (found suitable version "3.11.10", minimum required is "3")
-- Configuring done (1.1s)
-- Generating done (0.0s)
CMake Warning:
Manually-specified variables were not used by the project:
BOOST_PYTHON_SUFFIX
CMAKE_COLOR_MAKEFILE
CMAKE_C_COMPILER
CMAKE_C_FLAGS
CMAKE_C_FLAGS_DEBUG
CMAKE_C_FLAGS_RELEASE
CMAKE_MODULE_LINKER_FLAGS
CMAKE_VERBOSE_MAKEFILE
FETCHCONTENT_FULLY_DISCONNECTED
Python3_EXECUTABLE
Python_EXECUTABLE
THREADS_HAVE_PTHREAD_ARG
-- Build files have been written to: /wrkdirs/usr/ports/devel/flatbuffers205/work/.build
===========================================================================
=======================<phase: build >============================
===== env: NO_DEPENDS=yes USER=root UID=0 GID=0
===> Building for flatbuffers205-2.0.5
[ 2% 3/39] /usr/bin/c++ -DFLATBUFFERS_LOCALE_INDEPENDENT=0 -I/wrkdirs/usr/ports/devel/flatbuffers205/work/flatbuffers-2.0.5/include -I/wrkdirs/usr/ports/devel/flatbuffers205/work/flatbuffers-2.0.5/grpc -O2 -pipe -fstack-protector-strong -fno-strict-aliasing -Wno-error=unused-command-line-argument -std=c++0x -Wall -pedantic -Werror -Wextra -Wno-unused-parameter -stdlib=libc++ -fsigned-char -O2 -pipe -fstack-protector-strong -fno-strict-aliasing -Wno-error=unused-command-line-argument -DNDEBUG -Wold-style-cast -Wimplicit-fallthrough -Wextra-semi -Werror=unused-private-field -MD -MT CMakeFiles/flatc.dir/src/reflection.cpp.o -MF CMakeFiles/flatc.dir/src/reflection.cpp.o.d -o CMakeFiles/flatc.dir/src/reflection.cpp.o -c /wrkdirs/usr/ports/devel/flatbuffers205/work/flatbuffers-2.0.5/src/reflection.cpp
FAILED: CMakeFiles/flatc.dir/src/reflection.cpp.o
/usr/bin/c++ -DFLATBUFFERS_LOCALE_INDEPENDENT=0 -I/wrkdirs/usr/ports/devel/flatbuffers205/work/flatbuffers-2.0.5/include -I/wrkdirs/usr/ports/devel/flatbuffers205/work/flatbuffers-2.0.5/grpc -O2 -pipe -fstack-protector-strong -fno-strict-aliasing -Wno-error=unused-command-line-argument -std=c++0x -Wall -pedantic -Werror -Wextra -Wno-unused-parameter -stdlib=libc++ -fsigned-char -O2 -pipe -fstack-protector-strong -fno-strict-aliasing -Wno-error=unused-command-line-argument -DNDEBUG -Wold-style-cast -Wimplicit-fallthrough -Wextra-semi -Werror=unused-private-field -MD -MT CMakeFiles/flatc.dir/src/reflection.cpp.o -MF CMakeFiles/flatc.dir/src/reflection.cpp.o.d -o CMakeFiles/flatc.dir/src/reflection.cpp.o -c /wrkdirs/usr/ports/devel/flatbuffers205/work/flatbuffers-2.0.5/src/reflection.cpp
In file included from /wrkdirs/usr/ports/devel/flatbuffers205/work/flatbuffers-2.0.5/src/reflection.cpp:17:
In file included from /wrkdirs/usr/ports/devel/flatbuffers205/work/flatbuffers-2.0.5/include/flatbuffers/reflection.h:25:
In file included from /wrkdirs/usr/ports/devel/flatbuffers205/work/flatbuffers-2.0.5/include/flatbuffers/reflection_generated.h:7:
In file included from /wrkdirs/usr/ports/devel/flatbuffers205/work/flatbuffers-2.0.5/include/flatbuffers/flatbuffers.h:22:
In file included from /wrkdirs/usr/ports/devel/flatbuffers205/work/flatbuffers-2.0.5/include/flatbuffers/array.h:21:
/wrkdirs/usr/ports/devel/flatbuffers205/work/flatbuffers-2.0.5/include/flatbuffers/stl_emulation.h:386:12: error: cannot assign to non-static data member 'count_' with const-qualified type 'const size_type' (aka 'const unsigned long')
386 | count_ = other.count_;
| ~~~~~~ ^
/wrkdirs/usr/ports/devel/flatbuffers205/work/flatbuffers-2.0.5/include/flatbuffers/stl_emulation.h:465:19: note: non-static data member 'count_' declared const here
465 | const size_type count_;
| ~~~~~~~~~~~~~~~~^~~~~~
1 error generated.
[ 5% 3/39] /usr/bin/c++ -DFLATBUFFERS_LOCALE_INDEPENDENT=0 -I/wrkdirs/usr/ports/devel/flatbuffers205/work/flatbuffers-2.0.5/include -I/wrkdirs/usr/ports/devel/flatbuffers205/work/flatbuffers-2.0.5/grpc -O2 -pipe -fstack-protector-strong -fno-strict-aliasing -Wno-error=unused-command-line-argument -std=c++0x -Wall -pedantic -Werror -Wextra -Wno-unused-parameter -stdlib=libc++ -fsigned-char -O2 -pipe -fstack-protector-strong -fno-strict-aliasing -Wno-error=unused-command-line-argument -DNDEBUG -Wold-style-cast -Wimplicit-fallthrough -Wextra-semi -Werror=unused-private-field -MD -MT CMakeFiles/flatc.dir/src/idl_gen_text.cpp.o -MF CMakeFiles/flatc.dir/src/idl_gen_text.cpp.o.d -o CMakeFiles/flatc.dir/src/idl_gen_text.cpp.o -c /wrkdirs/usr/ports/devel/flatbuffers205/work/flatbuffers-2.0.5/src/idl_gen_text.cpp
FAILED: CMakeFiles/flatc.dir/src/idl_gen_text.cpp.o
/usr/bin/c++ -DFLATBUFFERS_LOCALE_INDEPENDENT=0 -I/wrkdirs/usr/ports/devel/flatbuffers205/work/flatbuffers-2.0.5/include -I/wrkdirs/usr/ports/devel/flatbuffers205/work/flatbuffers-2.0.5/grpc -O2 -pipe -fstack-protector-strong -fno-strict-aliasing -Wno-error=unused-command-line-argument -std=c++0x -Wall -pedantic -Werror -Wextra -Wno-unused-parameter -stdlib=libc++ -fsigned-char -O2 -pipe -fstack-protector-strong -fno-strict-aliasing -Wno-error=unused-command-line-argument -DNDEBUG -Wold-style-cast -Wimplicit-fallthrough -Wextra-semi -Werror=unused-private-field -MD -MT CMakeFiles/flatc.dir/src/idl_gen_text.cpp.o -MF CMakeFiles/flatc.dir/src/idl_gen_text.cpp.o.d -o CMakeFiles/flatc.dir/src/idl_gen_text.cpp.o -c /wrkdirs/usr/ports/devel/flatbuffers205/work/flatbuffers-2.0.5/src/idl_gen_text.cpp
In file included from /wrkdirs/usr/ports/devel/flatbuffers205/work/flatbuffers-2.0.5/src/idl_gen_text.cpp:19:
In file included from /wrkdirs/usr/ports/devel/flatbuffers205/work/flatbuffers-2.0.5/include/flatbuffers/flatbuffers.h:22:
In file included from /wrkdirs/usr/ports/devel/flatbuffers205/work/flatbuffers-2.0.5/include/flatbuffers/array.h:21:
/wrkdirs/usr/ports/devel/flatbuffers205/work/flatbuffers-2.0.5/include/flatbuffers/stl_emulation.h:386:12: error: cannot assign to non-static data member 'count_' with const-qualified type 'const size_type' (aka 'const unsigned long')
386 | count_ = other.count_;
| ~~~~~~ ^
/wrkdirs/usr/ports/devel/flatbuffers205/work/flatbuffers-2.0.5/include/flatbuffers/stl_emulation.h:465:19: note: non-static data member 'count_' declared const here
465 | const size_type count_;
| ~~~~~~~~~~~~~~~~^~~~~~
1 error generated.
[ 7% 3/39] /usr/bin/c++ -DFLATBUFFERS_LOCALE_INDEPENDENT=0 -I/wrkdirs/usr/ports/devel/flatbuffers205/work/flatbuffers-2.0.5/include -I/wrkdirs/usr/ports/devel/flatbuffers205/work/flatbuffers-2.0.5/grpc -O2 -pipe -fstack-protector-strong -fno-strict-aliasing -Wno-error=unused-command-line-argument -std=c++0x -Wall -pedantic -Werror -Wextra -Wno-unused-parameter -stdlib=libc++ -fsigned-char -O2 -pipe -fstack-protector-strong -fno-strict-aliasing -Wno-error=unused-command-line-argument -DNDEBUG -Wold-style-cast -Wimplicit-fallthrough -Wextra-semi -Werror=unused-private-field -MD -MT CMakeFiles/flatc.dir/src/idl_parser.cpp.o -MF CMakeFiles/flatc.dir/src/idl_parser.cpp.o.d -o CMakeFiles/flatc.dir/src/idl_parser.cpp.o -c /wrkdirs/usr/ports/devel/flatbuffers205/work/flatbuffers-2.0.5/src/idl_parser.cpp
FAILED: CMakeFiles/flatc.dir/src/idl_parser.cpp.o
/usr/bin/c++ -DFLATBUFFERS_LOCALE_INDEPENDENT=0 -I/wrkdirs/usr/ports/devel/flatbuffers205/work/flatbuffers-2.0.5/include -I/wrkdirs/usr/ports/devel/flatbuffers205/work/flatbuffers-2.0.5/grpc -O2 -pipe -fstack-protector-strong -fno-strict-aliasing -Wno-error=unused-command-line-argument -std=c++0x -Wall -pedantic -Werror -Wextra -Wno-unused-parameter -stdlib=libc++ -fsigned-char -O2 -pipe -fstack-protector-strong -fno-strict-aliasing -Wno-error=unused-command-line-argument -DNDEBUG -Wold-style-cast -Wimplicit-fallthrough -Wextra-semi -Werror=unused-private-field -MD -MT CMakeFiles/flatc.dir/src/idl_parser.cpp.o -MF CMakeFiles/flatc.dir/src/idl_parser.cpp.o.d -o CMakeFiles/flatc.dir/src/idl_parser.cpp.o -c /wrkdirs/usr/ports/devel/flatbuffers205/work/flatbuffers-2.0.5/src/idl_parser.cpp
In file included from /wrkdirs/usr/ports/devel/flatbuffers205/work/flatbuffers-2.0.5/src/idl_parser.cpp:24:
In file included from /wrkdirs/usr/ports/devel/flatbuffers205/work/flatbuffers-2.0.5/include/flatbuffers/idl.h:26:
In file included from /wrkdirs/usr/ports/devel/flatbuffers205/work/flatbuffers-2.0.5/include/flatbuffers/flatbuffers.h:22:
In file included from /wrkdirs/usr/ports/devel/flatbuffers205/work/flatbuffers-2.0.5/include/flatbuffers/array.h:21:
/wrkdirs/usr/ports/devel/flatbuffers205/work/flatbuffers-2.0.5/include/flatbuffers/stl_emulation.h:386:12: error: cannot assign to non-static data member 'count_' with const-qualified type 'const size_type' (aka 'const unsigned long')
386 | count_ = other.count_;
| ~~~~~~ ^
/wrkdirs/usr/ports/devel/flatbuffers205/work/flatbuffers-2.0.5/include/flatbuffers/stl_emulation.h:465:19: note: non-static data member 'count_' declared const here
465 | const size_type count_;
| ~~~~~~~~~~~~~~~~^~~~~~
1 error generated.
ninja: build stopped: subcommand failed.
===> Compilation failed unexpectedly.
Try to set MAKE_JOBS_UNSAFE=yes and rebuild before reporting the failure to
the maintainer.
*** Error code 1
Stop.
make: stopped making "build" in /usr/ports/devel/flatbuffers205