[package - 133i386-quarterly][devel/libfaketime] Failed for libfaketime-0.9.10_1 in build
- Go to: [ bottom of page ] [ top of archives ] [ this month ]
Date: Thu, 07 Nov 2024 01:40:20 UTC
You are receiving this mail as a port that you maintain
is failing to build on the FreeBSD package build server.
Please investigate the failure and submit a PR to fix
build.
Maintainer: bofh@FreeBSD.org
Log URL: https://pkg-status.freebsd.org/beefy13/data/133i386-quarterly/b122cdefecd2/logs/libfaketime-0.9.10_1.log
Build URL: https://pkg-status.freebsd.org/beefy13/build.html?mastername=133i386-quarterly&build=b122cdefecd2
Log:
=>> Building devel/libfaketime
build started at Thu Nov 7 01:40:15 UTC 2024
port directory: /usr/ports/devel/libfaketime
package name: libfaketime-0.9.10_1
building for: FreeBSD 133i386-quarterly-job-09 13.3-RELEASE-p8 FreeBSD 13.3-RELEASE-p8 i386
maintained by: bofh@FreeBSD.org
Makefile datestamp: -rw-r--r-- 1 root wheel 1071 Oct 8 01:02 /usr/ports/devel/libfaketime/Makefile
Ports top last git commit: b122cdefe
Ports top unclean checkout: no
Port dir last git commit: 19fbadfb9
Port dir unclean checkout: no
Poudriere version: poudriere-git-3.4.2
Host OSVERSION: 1500023
Jail OSVERSION: 1303001
Job Id: 09
---Begin Environment---
SHELL=/bin/csh
BLOCKSIZE=K
MAIL=/var/mail/root
MM_CHARSET=UTF-8
LANG=C.UTF-8
OSVERSION=1303001
STATUS=1
HOME=/root
PATH=/sbin:/bin:/usr/sbin:/usr/bin:/usr/local/sbin:/usr/local/bin:/root/bin
MAKE_OBJDIR_CHECK_WRITABLE=0
UNAME_m=i386
UNAME_p=i386
UNAME_r=13.3-RELEASE-p8
LOCALBASE=/usr/local
UNAME_v=FreeBSD 13.3-RELEASE-p8
USER=root
POUDRIERE_NAME=poudriere-git
LIBEXECPREFIX=/usr/local/libexec/poudriere
POUDRIERE_VERSION=3.4.2
MASTERMNT=/usr/local/poudriere/data/.m/133i386-quarterly/ref
LC_COLLATE=C
POUDRIERE_BUILD_TYPE=bulk
PACKAGE_BUILDING=yes
SAVED_TERM=
OUTPUT_REDIRECTED_STDERR=4
OUTPUT_REDIRECTED=1
PWD=/usr/local/poudriere/data/.m/133i386-quarterly/09/.p
OUTPUT_REDIRECTED_STDOUT=3
P_PORTS_FEATURES=FLAVORS SUBPACKAGES SELECTED_OPTIONS
MASTERNAME=133i386-quarterly
SCRIPTPREFIX=/usr/local/share/poudriere
SCRIPTNAME=bulk.sh
OLDPWD=/usr/local/poudriere/data/.m/133i386-quarterly/ref/.p/pool
POUDRIERE_PKGNAME=poudriere-git-3.4.2
SCRIPTPATH=/usr/local/share/poudriere/bulk.sh
POUDRIEREPATH=/usr/local/bin/poudriere
---End Environment---
---Begin Poudriere Port Flags/Env---
PORT_FLAGS=
PKGENV=
FLAVOR=
MAKE_ARGS=
---End Poudriere Port Flags/Env---
---Begin OPTIONS List---
---End OPTIONS List---
--MAINTAINER--
bofh@FreeBSD.org
--End MAINTAINER--
--CONFIGURE_ARGS--
--End CONFIGURE_ARGS--
--CONFIGURE_ENV--
MAKE=gmake XDG_DATA_HOME=/wrkdirs/usr/ports/devel/libfaketime/work XDG_CONFIG_HOME=/wrkdirs/usr/ports/devel/libfaketime/work XDG_CACHE_HOME=/wrkdirs/usr/ports/devel/libfaketime/work/.cache HOME=/wrkdirs/usr/ports/devel/libfaketime/work TMPDIR="/tmp" PATH=/wrkdirs/usr/ports/devel/libfaketime/work/.bin:/sbin:/bin:/usr/sbin:/usr/bin:/usr/local/sbin:/usr/local/bin:/root/bin PKG_CONFIG_LIBDIR=/wrkdirs/usr/ports/devel/libfaketime/work/.pkgconfig:/usr/local/libdata/pkgconfig:/usr/local/share/pkgconfig:/usr/libdata/pkgconfig SHELL=/bin/sh CONFIG_SHELL=/bin/sh
--End CONFIGURE_ENV--
--MAKE_ENV--
FEATS="-DFAKE_SLEEP -DFAKE_TIMERS -DFAKE_INTERNAL_CALLS" WARNS="-Wall" XDG_DATA_HOME=/wrkdirs/usr/ports/devel/libfaketime/work XDG_CONFIG_HOME=/wrkdirs/usr/ports/devel/libfaketime/work XDG_CACHE_HOME=/wrkdirs/usr/ports/devel/libfaketime/work/.cache HOME=/wrkdirs/usr/ports/devel/libfaketime/work TMPDIR="/tmp" PATH=/wrkdirs/usr/ports/devel/libfaketime/work/.bin:/sbin:/bin:/usr/sbin:/usr/bin:/usr/local/sbin:/usr/local/bin:/root/bin PKG_CONFIG_LIBDIR=/wrkdirs/usr/ports/devel/libfaketime/work/.pkgconfig:/usr/local/libdata/pkgconfig:/usr/local/share/pkgconfig:/usr/libdata/pkgconfig MK_DEBUG_FILES=no MK_KERNEL_SYMBOLS=no SHELL=/bin/sh NO_LINT=YES PREFIX=/usr/local LOCALBASE=/usr/local CC="cc" CFLAGS="-O2 -pipe -fstack-protector-strong -fno-strict-aliasing " CPP="cpp" CPPFLAGS="" LDFLAGS=" -fstack-protector-strong " LIBS="" CXX="c++" CXXFLAGS="-O2 -pipe -fstack-protector-strong -fno-strict-aliasing " BSD_INSTALL_PROGRAM="install -s -m 555" BSD_INSTALL_LIB="install -s -
m 0644" BSD_INSTALL_SCRIPT="install -m 555" BSD_INSTALL_DATA="install -m 0644" BSD_INSTALL_MAN="install -m 444"
--End MAKE_ENV--
--PLIST_SUB--
OSREL=13.3 PREFIX=%D LOCALBASE=/usr/local RESETPREFIX=/usr/local LIB32DIR=lib DOCSDIR="share/doc/libfaketime" EXAMPLESDIR="share/examples/libfaketime" DATADIR="share/libfaketime" WWWDIR="www/libfaketime" ETCDIR="etc/libfaketime"
--End PLIST_SUB--
--SUB_LIST--
PREFIX=/usr/local LOCALBASE=/usr/local DATADIR=/usr/local/share/libfaketime DOCSDIR=/usr/local/share/doc/libfaketime EXAMPLESDIR=/usr/local/share/examples/libfaketime WWWDIR=/usr/local/www/libfaketime ETCDIR=/usr/local/etc/libfaketime
--End SUB_LIST--
---Begin make.conf---
USE_PACKAGE_DEPENDS=yes
BATCH=yes
WRKDIRPREFIX=/wrkdirs
PORTSDIR=/usr/ports
PACKAGES=/packages
DISTDIR=/distfiles
PACKAGE_BUILDING=yes
PACKAGE_BUILDING_FLAVORS=yes
MACHINE=i386
MACHINE_ARCH=i386
ARCH=${MACHINE_ARCH}
#### ####
# XXX: We really need this but cannot use it while 'make checksum' does not
# try the next mirror on checksum failure. It currently retries the same
# failed mirror and then fails rather then trying another. It *does*
# try the next if the size is mismatched though.
#MASTER_SITE_FREEBSD=yes
# Build ALLOW_MAKE_JOBS_PACKAGES with 3 jobs
MAKE_JOBS_NUMBER=3
#### Misc Poudriere ####
.include "/etc/make.conf.ports_env"
GID=0
UID=0
---End make.conf---
--Resource limits--
cpu time (seconds, -t) unlimited
file size (512-blocks, -f) unlimited
data seg size (kbytes, -d) 524288
stack size (kbytes, -s) 65536
core file size (512-blocks, -c) unlimited
max memory size (kbytes, -m) unlimited
locked memory (kbytes, -l) unlimited
max user processes (-u) 89999
open files (-n) 8192
virtual mem size (kbytes, -v) unlimited
swap limit (kbytes, -w) unlimited
socket buffer size (bytes, -b) unlimited
pseudo-terminals (-p) unlimited
kqueues (-k) unlimited
umtx shared locks (-o) unlimited
--End resource limits--
=======================<phase: check-sanity >============================
===== env: NO_DEPENDS=yes USER=root UID=0 GID=0
===> License GPLv2 accepted by the user
===========================================================================
=======================<phase: pkg-depends >============================
===== env: USE_PACKAGE_DEPENDS_ONLY=1 USER=root UID=0 GID=0
===> libfaketime-0.9.10_1 depends on file: /usr/local/sbin/pkg - not found
===> Installing existing package /packages/All/pkg-1.21.3.pkg
[133i386-quarterly-job-09] Installing pkg-1.21.3...
[133i386-quarterly-job-09] Extracting pkg-1.21.3: .......... done
===> libfaketime-0.9.10_1 depends on file: /usr/local/sbin/pkg - found
===> Returning to build of libfaketime-0.9.10_1
===========================================================================
=======================<phase: fetch-depends >============================
===== env: USE_PACKAGE_DEPENDS_ONLY=1 USER=root UID=0 GID=0
===========================================================================
=======================<phase: fetch >============================
===== env: NO_DEPENDS=yes USER=root UID=0 GID=0
===> License GPLv2 accepted by the user
===> Fetching all distfiles required by libfaketime-0.9.10_1 for building
===========================================================================
=======================<phase: checksum >============================
===== env: NO_DEPENDS=yes USER=root UID=0 GID=0
===> License GPLv2 accepted by the user
===> Fetching all distfiles required by libfaketime-0.9.10_1 for building
=> SHA256 Checksum OK for wolfcw-libfaketime-v0.9.10-da77808_GH0.tar.gz.
===========================================================================
=======================<phase: extract-depends>============================
===== env: USE_PACKAGE_DEPENDS_ONLY=1 USER=root UID=0 GID=0
===========================================================================
=======================<phase: extract >============================
===== env: NO_DEPENDS=yes USER=root UID=0 GID=0
===> License GPLv2 accepted by the user
===> Fetching all distfiles required by libfaketime-0.9.10_1 for building
===> Extracting for libfaketime-0.9.10_1
=> SHA256 Checksum OK for wolfcw-libfaketime-v0.9.10-da77808_GH0.tar.gz.
===========================================================================
=======================<phase: patch-depends >============================
===== env: USE_PACKAGE_DEPENDS_ONLY=1 USER=root UID=0 GID=0
===========================================================================
=======================<phase: patch >============================
===== env: NO_DEPENDS=yes USER=root UID=0 GID=0
===> Patching for libfaketime-0.9.10_1
===> Applying FreeBSD patches for libfaketime-0.9.10_1 from /usr/ports/devel/libfaketime/files
===========================================================================
=======================<phase: build-depends >============================
===== env: USE_PACKAGE_DEPENDS_ONLY=1 USER=root UID=0 GID=0
===> libfaketime-0.9.10_1 depends on package: gmake>=4.4.1 - not found
===> Installing existing package /packages/All/gmake-4.4.1.pkg
[133i386-quarterly-job-09] Installing gmake-4.4.1...
[133i386-quarterly-job-09] `-- Installing gettext-runtime-0.22.5...
[133i386-quarterly-job-09] | `-- Installing indexinfo-0.3.1...
[133i386-quarterly-job-09] | `-- Extracting indexinfo-0.3.1: .... done
[133i386-quarterly-job-09] `-- Extracting gettext-runtime-0.22.5: .......... done
[133i386-quarterly-job-09] Extracting gmake-4.4.1: .......... done
===> libfaketime-0.9.10_1 depends on package: gmake>=4.4.1 - found
===> Returning to build of libfaketime-0.9.10_1
===========================================================================
=======================<phase: lib-depends >============================
===== env: USE_PACKAGE_DEPENDS_ONLY=1 USER=root UID=0 GID=0
===========================================================================
=======================<phase: configure >============================
===== env: NO_DEPENDS=yes USER=root UID=0 GID=0
===> Configuring for libfaketime-0.9.10_1
===========================================================================
=======================<phase: build >============================
===== env: NO_DEPENDS=yes USER=root UID=0 GID=0
===> Building for libfaketime-0.9.10_1
gmake -C src all
gmake[1]: Entering directory '/wrkdirs/usr/ports/devel/libfaketime/work/libfaketime-da77808/src'
cc -o libfaketime.o -c -std=gnu99 -fPIC -Wall -DFAKE_SLEEP -DFAKE_TIMERS -DFAKE_INTERNAL_CALLS -DPREFIX='"'/usr/local'"' -DLIBDIRNAME='"'/lib/faketime'"' -O2 -pipe -fstack-protector-strong -fno-strict-aliasing libfaketime.c
cc -o libfaketimeMT.o -c -std=gnu99 -fPIC -Wall -DFAKE_SLEEP -DFAKE_TIMERS -DFAKE_INTERNAL_CALLS -DPREFIX='"'/usr/local'"' -DLIBDIRNAME='"'/lib/faketime'"' -O2 -pipe -fstack-protector-strong -fno-strict-aliasing -DPTHREAD -DPTHREAD_SINGLETHREADED_TIME libfaketime.c
cc -o faketime -std=gnu99 -fPIC -Wall -DFAKE_SLEEP -DFAKE_TIMERS -DFAKE_INTERNAL_CALLS -DPREFIX='"'/usr/local'"' -DLIBDIRNAME='"'/lib/faketime'"' -O2 -pipe -fstack-protector-strong -fno-strict-aliasing faketime.c -fstack-protector-strong -lpthread -Wl,--version-script=libfaketime.map -lrt
In file included from libfaketime.c:55:
./time_ops.h:97:9: In file included from warning: 'timespecisset' macro redefined [-Wmacro-redefined]
libfaketime.c 97: | 55#:
d./time_ops.h:e97f:i9n:e warning: t'timespecisset' macro redefined [-Wmacro-redefined]i
m 97e | s#pdeecfisisent(tev tpi) tmimeersipsesceistse2t((tvtp,vn)p)
time r| i ^s
s/usr/include/sys/time.het:2(396tv:p,9n): note:
previous definition is here
| ^
396/usr/include/sys/time.h | :#396d:e9fi:n enote: previous definition is heretimesp
e c396 | i#sdld: error: version script assignment of 'GLIBC_2.2' to symbol 'timer_gettime' failed: symbol not defined
esfld: error: version script assignment of 'GLIBC_2.2' to symbol 'timer_settime' failed: symbol not defined
ild: error: version script assignment of 'GLIBC_2.3.3' to symbol 'timer_gettime' failed: symbol not defined
enld: error: version script assignment of 'GLIBC_2.3.3' to symbol 'timer_settime' failed: symbol not defined
te(t vp)tcci: m error: (linker command failed with exit code 1 (use -v to see invocation)
(tvp)e-s>ptgmake[1]: *** [Makefile:106: faketime] Error 1
evgmake[1]: *** Waiting for unfinished jobs....
c_seicsset(t v|p)| ((tvp)->(tvtvp)_sec -|>|t v(_nsec)
| tv ^p
)In file included from -libfaketime.c>:t55v_nse:
c./time_ops.h)
| ^
:In file included from libfaketime.c98::559:
:./time_ops.h :warning: 98'timespecclear' macro redefined [-Wmacro-redefined]
: 998 | :# defiwarning: n'timespecclear' macro redefined [-Wmacro-redefined]
98 | #ed etfiimnees petcicmespeclcleeaarr((ttvvp)p t)i timmerclereclaear2(rtvp2,(tvp ,n )n)
| | ^
^
/usr/include/sys/time.h:/usr/include/sys/time.h395::3959::9 : note: previous definition is here
note: previous definition is here
395 | 395 | ##ddeeffiinnee timetsipemcclespeear(tvcp)c le(ar((ttvvpp)->)tv_s e((tvcp =) ->(ttvv_p)-s>etv_ncs e=c (tvp)=->t v_nsec0 =)
0 )|
^|
^In file included from libfaketime.c
:In file included from 55libfaketime.c:
:55./time_ops.h:
:./time_ops.h99::99:99:: warning: warning: 'timespeccmp' macro redefined [-Wmacro-redefined]'timespeccmp' macro redefined [-Wmacro-redefined]
9999 | | ##ddeeffiinnee ttimiesmpeescpecccmmpp((aa,, bb, ,C MCPM)P )t itmiemrecrmcp2m(ap,2 (ab, C,M Pb,, nC)M
P ,| ^
n/usr/include/sys/time.h):
| 397 ^:
9/usr/include/sys/time.h:: 397note: :previous definition is here9
: note: 397 | previous definition is here#
d e397f | i#ndee ftiniem teismpeseccpmep(ctvpc,m pu(vtpv,p ,c mupv)p , cmp )\
\
| | ^
^In file included from
libfaketime.c:In file included from libfaketime.c:5555:
./time_ops.h:100:9: warning: 'timespecadd' macro redefined [-Wmacro-redefined]
:
./time_ops.h:100100 | #:d9efine ti: warning: 'timespecadd' macro redefined [-Wmacro-redefined]
m especadd(a, b, result) 100timeradd2( | a#,d be, resuflitne ,ti n)
| ^
m/usr/include/sys/time.hespecadd(:402:9:a, b, renote: sult) previous definition is here
t im402 | #deraddef2ine( ati, b,me srpecadesdu(lt, n)t
s p| , ^ usp, vsp)
\/usr/include/sys/time.h:402:9
: | ^
note: In file included from previous definition is here
libfaketime.c :40255 | :
#./time_ops.hdefin:e101 :9: warning: t'timespecsub' macro redefined [-Wmacro-redefined]i
m e101s | p#defeicnaed tdi(mtessppe,c suusbp(,a , vbs,p )r e su l t \)
t i| ^me
rIn file included from slibfaketime.cub:55:
2./time_ops.h(:101:a9,: bwarning: ,'timespecsub' macro redefined [-Wmacro-redefined]
r e101s | u#ldte,f inne)
t | ^
i/usr/include/sys/time.hm:e411s:9p:e cnote: previous definition is heres
u b(411a | , #bd,e frienseu ltt)i timmeespresucb2s(uab,( tb,s pr,e suuslpt,, nv)s
p )| ^
/usr/include/sys/time.h : 411\:
9 :| ^
note: previous definition is here
411 | #deIn file included from flibfaketime.ci:n63e:
/usr/include/sys/timeb.ht:i43m:e2s:p ewarning: c"this file includes <sys/timeb.h> which is deprecated" [-W#warnings]s
u b43(ts | p#w,a runsipn,g v"tshpis f)i l e i n c\l
u de| s ^
<sys/In file included from tlibfaketime.ci:m63e:
b/usr/include/sys/timeb.h.:h43:2: warning: >"this file includes <sys/timeb.h> which is deprecated" [-W#warnings]
which43 is | d#ewarpning "this file includes <sys/timeb.hr>ecated"
| ^
which libfaketime.c:129:72: warning: declaration of 'struct stat64' will not be visible outside of this function [-Wvisibility]
i 129 | static inst deprecated"
| ^
(*relibfaketime.ca:l_stat64) (129i:72: nwarning: declaration of 'struct stat64' will not be visible outside of this function [-Wvisibility]t
, con st 129char * | , strucst stat64 *)tati;c
| ^
ilibfaketime.cn:130:64: warning: declaration of 'struct stat64' will not be visible outside of this function [-Wvisibility]t
130 | s(*realt_atic sitnt a t(6*4r) e al_ f (ints,t act6o4nst char *, s) (int, int , struct stat64 *);
| truct sta ^t64 *);
| ^
libfaketime.clibfaketime.c:131:78: warning: declaration of 'struct stat64' will not be visible outside of this function [-Wvisibility]
: 131 | 130static :64: warning: indeclaration of 'struct stat64' will not be visible outside of this function [-Wvisibility]
t (*real_fstatat64) (int ,130 | sitatic int n t , const char *, struct stat64 *, int);
| ^
libfaketime.c:132:72 : warning: (declaration of 'struct stat64' will not be visible outside of this function [-Wvisibility]
*real_fstat64) 132 | stat(int, int , struct stat64 *);
| ^i
clibfaketime.c :int (*real_lstat61314) : 78: warning: declaration of 'struct stat64' will not be visible outside of this function [-Wvisibility] (i
n t131, | const cshtara t*i, strcu icntt stat6 4 * ) ;(
| ^
*real_fslibfaketime.ct:336a:72t:at 6warning: 4while loop has empty body [-Wempty-body])
336 | D O N(Ti_nFtA,K Ei_nTtI M,E (c(o*nresatl c_hcalro ck*_get,tim set)r(CLOuCcK_RtEA LTIsMtE,a &ts6y4s time->*, rienatl)));
| ^;
libfaketime.c | : ^336:72: note:
put the semicolon on a separate line to silence this warning
libfaketime.clibfaketime.c:337:72: :warning: 132:while loop has empty body [-Wempty-body]72:
warning: declaration of 'struct stat64' will not be visible outside of this function [-Wvisibility]
132 | static337 | i n t (*DrOeal_lstNaTt_64) (intF, conAstK E_cThaIMr *E,( (s*rtreuaclt_cl ock_gettstat64 *);
| ^i
me)(CLOCK_MONOTlibfaketime.cONIC, &systim:336e:->72: mon))warning: ;
while loop has empty body [-Wempty-body] |
^
336libfaketime.c | :337:72: note: put the semicolon on a separate line to silence this warning
DONT_FAKE_TIME((*real_clock_gettime)(CLOCK_REALTIME, &systime->real));
| ^
libfaketime.c:336:72: note: put the semicolon on a separate line to silence this warning
libfaketime.c:337:72: warning: while loop has empty body [-Wempty-body]
337 | DONT_FAKE_TIME((*real_clock_gettime)(CLOCK_MONOTONIC, &systime->mon));
| ^
libfaketime.c:337:72: note: put the semicolon on a separate line to silence this warning
12 warnings generated.
12 warnings generated.
gmake[1]: Leaving directory '/wrkdirs/usr/ports/devel/libfaketime/work/libfaketime-da77808/src'
gmake: *** [Makefile:7: all] Error 2
===> Compilation failed unexpectedly.
Try to set MAKE_JOBS_UNSAFE=yes and rebuild before reporting the failure to
the maintainer.
*** Error code 1
Stop.
make: stopped in /usr/ports/devel/libfaketime