[package - main-amd64-default][editors/vscode] Failed for vscode-1.94.2 in build
- Go to: [ bottom of page ] [ top of archives ] [ this month ]
Date: Sun, 03 Nov 2024 08:39:02 UTC
You are receiving this mail as a port that you maintain
is failing to build on the FreeBSD package build server.
Please investigate the failure and submit a PR to fix
build.
Maintainer: tagattie@FreeBSD.org
Log URL: https://pkg-status.freebsd.org/beefy18/data/main-amd64-default/p009a7c198ee2_s8d6feaaaa26/logs/vscode-1.94.2.log
Build URL: https://pkg-status.freebsd.org/beefy18/build.html?mastername=main-amd64-default&build=p009a7c198ee2_s8d6feaaaa26
Log:
=>> Building editors/vscode
build started at Sun Nov 3 08:33:33 UTC 2024
port directory: /usr/ports/editors/vscode
package name: vscode-1.94.2
building for: FreeBSD main-amd64-default-job-03 15.0-CURRENT FreeBSD 15.0-CURRENT 1500026 amd64
maintained by: tagattie@FreeBSD.org
Makefile datestamp: -rw-r--r-- 1 root wheel 13968 Oct 15 01:01 /usr/ports/editors/vscode/Makefile
Ports top last git commit: 009a7c198ee
Ports top unclean checkout: no
Port dir last git commit: e4c5da5342c
Port dir unclean checkout: no
Poudriere version: poudriere-git-3.4.2
Host OSVERSION: 1500023
Jail OSVERSION: 1500026
Job Id: 03
!!! Jail is newer than host. (Jail: 1500026, Host: 1500023) !!!
!!! This is not supported. !!!
!!! Host kernel must be same or newer than jail. !!!
!!! Expect build failures. !!!
---Begin Environment---
SHELL=/bin/sh
OSVERSION=1500026
UNAME_v=FreeBSD 15.0-CURRENT 1500026
UNAME_r=15.0-CURRENT
BLOCKSIZE=K
MAIL=/var/mail/root
MM_CHARSET=UTF-8
LANG=C.UTF-8
STATUS=1
HOME=/root
PATH=/sbin:/bin:/usr/sbin:/usr/bin:/usr/local/sbin:/usr/local/bin:/root/bin
MAKE_OBJDIR_CHECK_WRITABLE=0
LOCALBASE=/usr/local
USER=root
POUDRIERE_NAME=poudriere-git
LIBEXECPREFIX=/usr/local/libexec/poudriere
POUDRIERE_VERSION=3.4.2
MASTERMNT=/usr/local/poudriere/data/.m/main-amd64-default/ref
LC_COLLATE=C
POUDRIERE_BUILD_TYPE=bulk
PACKAGE_BUILDING=yes
SAVED_TERM=
OUTPUT_REDIRECTED_STDERR=4
OUTPUT_REDIRECTED=1
PWD=/usr/local/poudriere/data/.m/main-amd64-default/03/.p
OUTPUT_REDIRECTED_STDOUT=3
P_PORTS_FEATURES=FLAVORS SUBPACKAGES SELECTED_OPTIONS
MASTERNAME=main-amd64-default
SCRIPTPREFIX=/usr/local/share/poudriere
SCRIPTNAME=bulk.sh
OLDPWD=/usr/local/poudriere/data/.m/main-amd64-default/ref/.p/pool
POUDRIERE_PKGNAME=poudriere-git-3.4.2
SCRIPTPATH=/usr/local/share/poudriere/bulk.sh
POUDRIEREPATH=/usr/local/bin/poudriere
---End Environment---
---Begin Poudriere Port Flags/Env---
PORT_FLAGS=
PKGENV=
FLAVOR=
MAKE_ARGS=
---End Poudriere Port Flags/Env---
---Begin OPTIONS List---
---End OPTIONS List---
--MAINTAINER--
tagattie@FreeBSD.org
--End MAINTAINER--
--CONFIGURE_ARGS--
--End CONFIGURE_ARGS--
--CONFIGURE_ENV--
MAKE=gmake PKG_CONFIG=pkgconf PYTHON="/usr/local/bin/python3.11" XDG_DATA_HOME=/wrkdirs/usr/ports/editors/vscode/work XDG_CONFIG_HOME=/wrkdirs/usr/ports/editors/vscode/work XDG_CACHE_HOME=/wrkdirs/usr/ports/editors/vscode/work/.cache HOME=/wrkdirs/usr/ports/editors/vscode/work TMPDIR="/wrkdirs/usr/ports/editors/vscode/work" PATH=/wrkdirs/usr/ports/editors/vscode/work/.bin:/sbin:/bin:/usr/sbin:/usr/bin:/usr/local/sbin:/usr/local/bin:/root/bin PKG_CONFIG_LIBDIR=/wrkdirs/usr/ports/editors/vscode/work/.pkgconfig:/usr/local/libdata/pkgconfig:/usr/local/share/pkgconfig:/usr/libdata/pkgconfig SHELL=/bin/sh CONFIG_SHELL=/bin/sh CMAKE_PREFIX_PATH="/usr/local"
--End CONFIGURE_ENV--
--MAKE_ENV--
BUILD_SOURCEVERSION=384ff7382de624fb94dbaf6da11977bba1ecd427 ELECTRON_SKIP_BINARY_DOWNLOAD=1 PLAYWRIGHT_BROWSERS_PATH=/wrkdirs/usr/ports/editors/vscode/work/pw-browsers PLAYWRIGHT_SKIP_BROWSER_DOWNLOAD=1 PYTHONDONTWRITEBYTECODE=1 XDG_DATA_HOME=/wrkdirs/usr/ports/editors/vscode/work XDG_CONFIG_HOME=/wrkdirs/usr/ports/editors/vscode/work XDG_CACHE_HOME=/wrkdirs/usr/ports/editors/vscode/work/.cache HOME=/wrkdirs/usr/ports/editors/vscode/work TMPDIR="/wrkdirs/usr/ports/editors/vscode/work" PATH=/wrkdirs/usr/ports/editors/vscode/work/.bin:/sbin:/bin:/usr/sbin:/usr/bin:/usr/local/sbin:/usr/local/bin:/root/bin PKG_CONFIG_LIBDIR=/wrkdirs/usr/ports/editors/vscode/work/.pkgconfig:/usr/local/libdata/pkgconfig:/usr/local/share/pkgconfig:/usr/libdata/pkgconfig MK_DEBUG_FILES=no MK_KERNEL_SYMBOLS=no SHELL=/bin/sh NO_LINT=YES PREFIX=/usr/local LOCALBASE=/usr/local CC="cc" CFLAGS="-O2 -pipe -fstack-protector-strong -isystem /usr/local/include -fno-strict-aliasing " CPP="cpp" CPPFLAG
S="-isystem /usr/local/include" LDFLAGS=" -fstack-protector-strong -L/usr/local/lib " LIBS="" CXX="c++" CXXFLAGS="-O2 -pipe -fstack-protector-strong -isystem /usr/local/include -fno-strict-aliasing -isystem /usr/local/include " BSD_INSTALL_PROGRAM="install -s -m 555" BSD_INSTALL_LIB="install -s -m 0644" BSD_INSTALL_SCRIPT="install -m 555" BSD_INSTALL_DATA="install -m 0644" BSD_INSTALL_MAN="install -m 444"
--End MAKE_ENV--
--PLIST_SUB--
GTK2_VERSION="2.10.0" GTK3_VERSION="3.0.0" GTK4_VERSION="4.0.0" PYTHON_INCLUDEDIR=include/python3.11 PYTHON_LIBDIR=lib/python3.11 PYTHON_PLATFORM=freebsd15 PYTHON_SITELIBDIR=lib/python3.11/site-packages PYTHON_SUFFIX=311 PYTHON_EXT_SUFFIX=.cpython-311 PYTHON_VER=3.11 PYTHON_VERSION=python3.11 PYTHON2="@comment " PYTHON3="" OSREL=15.0 PREFIX=%D LOCALBASE=/usr/local RESETPREFIX=/usr/local LIB32DIR=lib DOCSDIR="share/doc/vscode" EXAMPLESDIR="share/examples/vscode" DATADIR="share/code-oss" WWWDIR="www/vscode" ETCDIR="etc/vscode"
--End PLIST_SUB--
--SUB_LIST--
PYTHON_INCLUDEDIR=/usr/local/include/python3.11 PYTHON_LIBDIR=/usr/local/lib/python3.11 PYTHON_PLATFORM=freebsd15 PYTHON_SITELIBDIR=/usr/local/lib/python3.11/site-packages PYTHON_SUFFIX=311 PYTHON_EXT_SUFFIX=.cpython-311 PYTHON_VER=3.11 PYTHON_VERSION=python3.11 PYTHON2="@comment " PYTHON3="" PREFIX=/usr/local LOCALBASE=/usr/local DATADIR=/usr/local/share/code-oss DOCSDIR=/usr/local/share/doc/vscode EXAMPLESDIR=/usr/local/share/examples/vscode WWWDIR=/usr/local/www/vscode ETCDIR=/usr/local/etc/vscode
--End SUB_LIST--
---Begin make.conf---
# XXX: We really need this but cannot use it while 'make checksum' does not
# try the next mirror on checksum failure. It currently retries the same
# failed mirror and then fails rather then trying another. It *does*
# try the next if the size is mismatched though.
#MASTER_SITE_FREEBSD=yes
# Build ALLOW_MAKE_JOBS_PACKAGES with 3 jobs
MAKE_JOBS_NUMBER=3
USE_PACKAGE_DEPENDS=yes
BATCH=yes
WRKDIRPREFIX=/wrkdirs
PORTSDIR=/usr/ports
PACKAGES=/packages
DISTDIR=/distfiles
PACKAGE_BUILDING=yes
PACKAGE_BUILDING_FLAVORS=yes
#### ####
# XXX: We really need this but cannot use it while 'make checksum' does not
# try the next mirror on checksum failure. It currently retries the same
# failed mirror and then fails rather then trying another. It *does*
# try the next if the size is mismatched though.
#MASTER_SITE_FREEBSD=yes
# Build ALLOW_MAKE_JOBS_PACKAGES with 3 jobs
MAKE_JOBS_NUMBER=3
#### Misc Poudriere ####
.include "/etc/make.conf.ports_env"
GID=0
UID=0
---End make.conf---
--Resource limits--
ulimit: can't get limit: Invalid argument
cpu time (seconds, -t) unlimited
file size (512-blocks, -f) unlimited
data seg size (kbytes, -d) 33554432
stack size (kbytes, -s) 524288
core file size (512-blocks, -c) unlimited
max memory size (kbytes, -m) unlimited
locked memory (kbytes, -l) unlimited
max user processes (-u) 89999
open files (-n) 8192
virtual mem size (kbytes, -v) unlimited
swap limit (kbytes, -w) unlimited
socket buffer size (bytes, -b) unlimited
pseudo-terminals (-p) unlimited
kqueues (-k) unlimited
umtx shared locks (-o) unlimited
--End resource limits--
=======================<phase: check-sanity >============================
===== env: NO_DEPENDS=yes USER=root UID=0 GID=0
The limit imposed by poudriere(8) for the maximum number of files allowed to be
opened by a jail (default 1024) is exceeded during the build of vscode.
To successfully build vscode with poudriere(8), you must add the following
line to poudriere.conf:
MAX_FILES_vscode=8192
===> License MIT accepted by the user
===========================================================================
=======================<phase: pkg-depends >============================
===== env: USE_PACKAGE_DEPENDS_ONLY=1 USER=root UID=0 GID=0
===> vscode-1.94.2 depends on file: /usr/local/sbin/pkg - not found
===> Installing existing package /packages/All/pkg-1.21.3.pkg
[main-amd64-default-job-03] Installing pkg-1.21.3...
[main-amd64-default-job-03] Extracting pkg-1.21.3: .......... done
===> vscode-1.94.2 depends on file: /usr/local/sbin/pkg - found
===> Returning to build of vscode-1.94.2
===========================================================================
=======================<phase: fetch-depends >============================
===== env: USE_PACKAGE_DEPENDS_ONLY=1 USER=root UID=0 GID=0
===========================================================================
=======================<phase: fetch >============================
===== env: NO_DEPENDS=yes USER=root UID=0 GID=0
The limit imposed by poudriere(8) for the maximum number of files allowed to be
opened by a jail (default 1024) is exceeded during the build of vscode.
To successfully build vscode with poudriere(8), you must add the following
line to poudriere.conf:
MAX_FILES_vscode=8192
===> License MIT accepted by the user
===> Fetching all distfiles required by vscode-1.94.2 for building
===========================================================================
=======================<phase: checksum >============================
===== env: NO_DEPENDS=yes USER=root UID=0 GID=0
The limit imposed by poudriere(8) for the maximum number of files allowed to be
opened by a jail (default 1024) is exceeded during the build of vscode.
To successfully build vscode with poudriere(8), you must add the following
line to poudriere.conf:
MAX_FILES_vscode=8192
===> License MIT accepted by the user
===> Fetching all distfiles required by vscode-1.94.2 for building
=> SHA256 Checksum OK for vscode/vscode-node-modules-1.94.2.tar.gz.
=> SHA256 Checksum OK for vscode/vscode-marketplace-exts-1.94.2.tar.gz.
=> SHA256 Checksum OK for vscode/microsoft-vscode-1.94.2_GH0.tar.gz.
===========================================================================
=======================<phase: extract-depends>============================
===== env: USE_PACKAGE_DEPENDS_ONLY=1 USER=root UID=0 GID=0
===> vscode-1.94.2 depends on executable: jq - not found
===> Installing existing package /packages/All/jq-1.7.1.pkg
[main-amd64-default-job-03] Installing jq-1.7.1...
<snip>
| ^
../src/node.cc:482:31: note: in instantiation of template class 'std::basic_string<unsigned short>' requested here
482 | std::basic_string<TSSymbol> symbols;
| ^
/usr/include/c++/v1/__fwd/string.h:23:29: note: template is declared here
23 | struct _LIBCPP_TEMPLATE_VIS char_traits;
| ^
In file included from ../src/node.cc:1:
In file included from ../src/./node.h:4:
In file included from ../../nan/nan.h:62:
In file included from /usr/local/include/node/node.h:73:
In file included from /usr/local/include/node/v8.h:26:
In file included from /usr/local/include/node/v8-context.h:10:
In file included from /usr/include/c++/v1/vector:325:
In file included from /usr/include/c++/v1/__format/formatter_bool.h:16:
In file included from /usr/include/c++/v1/__format/concepts.h:16:
In file included from /usr/include/c++/v1/__format/format_parse_context.h:16:
/usr/include/c++/v1/string_view:300:42: error: implicit instantiation of undefined template 'std::char_traits<unsigned short>'
300 | static_assert(is_same<_CharT, typename traits_type::char_type>::value,
| ^
/usr/include/c++/v1/__type_traits/is_convertible.h:30:99: note: in instantiation of template class 'std::basic_string_view<unsigned short>' requested here
30 | struct _LIBCPP_TEMPLATE_VIS is_convertible : public integral_constant<bool, __is_convertible(_T1, _T2)> {};
| ^
/usr/include/c++/v1/string:745:29: note: in instantiation of template class 'std::is_convertible<const std::basic_string<unsigned short> &, std::basic_string_view<unsigned short>>' requested here
745 | : public _BoolConstant< is_convertible<const _Tp&, basic_string_view<_CharT, _Traits> >::value &&
| ^
/usr/include/c++/v1/string:1151:27: note: in instantiation of template class 'std::__can_be_converted_to_string_view<unsigned short, std::char_traits<unsigned short>, std::basic_string<unsigned short>>' requested here
1151 | __enable_if_t<__can_be_converted_to_string_view<_CharT, _Traits, _Tp>::value &&
| ^
/usr/include/c++/v1/string:1154:93: note: while substituting prior template arguments into non-type template parameter [with _Tp = std::basic_string<unsigned short>]
1154 | _LIBCPP_METHOD_TEMPLATE_IMPLICIT_INSTANTIATION_VIS _LIBCPP_CONSTEXPR_SINCE_CXX20 explicit basic_string(const _Tp& __t)
| ^~~~~~~~~~~~~~~~~~~~~~~~~~~~
1155 | : __r_(__default_init_tag(), __default_init_tag()) {
| ~~~~~~~~~~~~~~~~~~~~~~~~~~~~~~~~~~~~~~~~~~~~~~~~~~~~
1156 | __self_view __sv = __t;
| ~~~~~~~~~~~~~~~~~~~~~~~
1157 | __init(__sv.data(), __sv.size());
| ~~~~~~~~~~~~~~~~~~~~~~~~~~~~~~~~~
1158 | }
| ~
/usr/include/c++/v1/string:752:7: note: while substituting deduced template arguments into function template 'basic_string' [with _Tp = std::basic_string<unsigned short>, $1 = (no value)]
752 | class basic_string {
| ^
../src/node.cc:481:8: note: while declaring the implicit copy constructor for 'SymbolSet'
481 | struct SymbolSet {
| ^
/usr/include/c++/v1/__fwd/string.h:23:29: note: template is declared here
23 | struct _LIBCPP_TEMPLATE_VIS char_traits;
| ^
In file included from ../src/node.cc:1:
In file included from ../src/./node.h:4:
In file included from ../../nan/nan.h:62:
In file included from /usr/local/include/node/node.h:73:
In file included from /usr/local/include/node/v8.h:24:
In file included from /usr/local/include/node/v8-array-buffer.h:13:
In file included from /usr/local/include/node/v8-object.h:10:
/usr/local/include/node/v8-persistent-handle.h:526:37: warning: cast from 'typename WeakCallbackInfo<ObjectWrap>::Callback' (aka 'void (*)(const WeakCallbackInfo<ObjectWrap> &)') to 'Callback' (aka 'void (*)(const WeakCallbackInfo<void> &)') converts to incompatible function type [-Wcast-function-type-mismatch]
526 | parameter, reinterpret_cast<Callback>(callback), type);
| ^~~~~~~~~~~~~~~~~~~~~~~~~~~~~~~~~~~~
/usr/local/include/node/node_object_wrap.h:85:18: note: in instantiation of function template specialization 'v8::PersistentBase<v8::Object>::SetWeak<node::ObjectWrap>' requested here
85 | persistent().SetWeak(this, WeakCallback, v8::WeakCallbackType::kParameter);
| ^
In file included from ../src/node.cc:1:
In file included from ../src/./node.h:4:
In file included from ../../nan/nan.h:62:
In file included from /usr/local/include/node/node.h:73:
In file included from /usr/local/include/node/v8.h:24:
In file included from /usr/local/include/node/v8-array-buffer.h:13:
In file included from /usr/local/include/node/v8-object.h:10:
/usr/local/include/node/v8-persistent-handle.h:526:37: warning: cast from 'typename WeakCallbackInfo<ObjectWrap>::Callback' (aka 'void (*)(const WeakCallbackInfo<ObjectWrap> &)') to 'Callback' (aka 'void (*)(const WeakCallbackInfo<void> &)') converts to incompatible function type [-Wcast-function-type-mismatch]
526 | parameter, reinterpret_cast<Callback>(callback), type);
| ^~~~~~~~~~~~~~~~~~~~~~~~~~~~~~~~~~~~
../../nan/nan_object_wrap.h:64:50: note: in instantiation of function template specialization 'v8::PersistentBase<v8::Object>::SetWeak<Nan::ObjectWrap>' requested here
64 | persistent().v8::PersistentBase<v8::Object>::SetWeak(
| ^
In file included from ../src/node.cc:1:
In file included from ../src/./node.h:4:
In file included from ../../nan/nan.h:62:
In file included from /usr/local/include/node/node.h:73:
In file included from /usr/local/include/node/v8.h:26:
In file included from /usr/local/include/node/v8-context.h:10:
In file included from /usr/include/c++/v1/vector:325:
In file included from /usr/include/c++/v1/__format/formatter_bool.h:19:
In file included from /usr/include/c++/v1/__format/formatter_integral.h:21:
In file included from /usr/include/c++/v1/__format/formatter_output.h:22:
In file included from /usr/include/c++/v1/__format/parser_std_format_spec.h:39:
/usr/include/c++/v1/string:2911:3: error: implicit instantiation of undefined template 'std::char_traits<unsigned short>'
2911 | traits_type::assign(*__p, __c);
| ^
/usr/include/c++/v1/string:1365:5: note: in instantiation of member function 'std::basic_string<unsigned short>::push_back' requested here
1365 | push_back(__c);
| ^
../src/node.cc:483:39: note: in instantiation of member function 'std::basic_string<unsigned short>::operator+=' requested here
483 | void add(TSSymbol symbol) { symbols += symbol; }
| ^
/usr/include/c++/v1/__fwd/string.h:23:29: note: template is declared here
23 | struct _LIBCPP_TEMPLATE_VIS char_traits;
| ^
In file included from ../src/node.cc:1:
In file included from ../src/./node.h:4:
In file included from ../../nan/nan.h:62:
In file included from /usr/local/include/node/node.h:73:
In file included from /usr/local/include/node/v8.h:26:
In file included from /usr/local/include/node/v8-context.h:10:
In file included from /usr/include/c++/v1/vector:325:
In file included from /usr/include/c++/v1/__format/formatter_bool.h:19:
In file included from /usr/include/c++/v1/__format/formatter_integral.h:21:
In file included from /usr/include/c++/v1/__format/formatter_output.h:22:
In file included from /usr/include/c++/v1/__format/parser_std_format_spec.h:39:
/usr/include/c++/v1/string:2912:3: error: implicit instantiation of undefined template 'std::char_traits<unsigned short>'
2912 | traits_type::assign(*++__p, value_type());
| ^
/usr/include/c++/v1/__fwd/string.h:23:29: note: template is declared here
23 | struct _LIBCPP_TEMPLATE_VIS char_traits;
| ^
In file included from ../src/node.cc:1:
In file included from ../src/./node.h:4:
In file included from ../../nan/nan.h:62:
In file included from /usr/local/include/node/node.h:73:
In file included from /usr/local/include/node/v8.h:26:
In file included from /usr/local/include/node/v8-context.h:10:
In file included from /usr/include/c++/v1/vector:325:
In file included from /usr/include/c++/v1/__format/formatter_bool.h:19:
In file included from /usr/include/c++/v1/__format/formatter_integral.h:21:
In file included from /usr/include/c++/v1/__format/formatter_output.h:22:
In file included from /usr/include/c++/v1/__format/parser_std_format_spec.h:39:
/usr/include/c++/v1/string:2535:5: error: implicit instantiation of undefined template 'std::char_traits<unsigned short>'
2535 | traits_type::copy(std::__to_address(__p), std::__to_address(__old_p), __n_copy);
| ^
/usr/include/c++/v1/string:2556:3: note: in instantiation of member function 'std::basic_string<unsigned short>::__grow_by' requested here
2556 | __grow_by(__old_cap, __delta_cap, __old_sz, __n_copy, __n_del, __n_add);
| ^
/usr/include/c++/v1/string:2898:5: note: in instantiation of member function 'std::basic_string<unsigned short>::__grow_by_without_replace' requested here
2898 | __grow_by_without_replace(__cap, 1, __sz, __sz, 0);
| ^
/usr/include/c++/v1/string:1365:5: note: in instantiation of member function 'std::basic_string<unsigned short>::push_back' requested here
1365 | push_back(__c);
| ^
../src/node.cc:483:39: note: in instantiation of member function 'std::basic_string<unsigned short>::operator+=' requested here
483 | void add(TSSymbol symbol) { symbols += symbol; }
| ^
/usr/include/c++/v1/__fwd/string.h:23:29: note: template is declared here
23 | struct _LIBCPP_TEMPLATE_VIS char_traits;
| ^
In file included from ../src/node.cc:1:
In file included from ../src/./node.h:4:
In file included from ../../nan/nan.h:62:
In file included from /usr/local/include/node/node.h:73:
In file included from /usr/local/include/node/v8.h:26:
In file included from /usr/local/include/node/v8-context.h:10:
In file included from /usr/include/c++/v1/vector:325:
In file included from /usr/include/c++/v1/__format/formatter_bool.h:19:
In file included from /usr/include/c++/v1/__format/formatter_integral.h:21:
In file included from /usr/include/c++/v1/__format/formatter_output.h:22:
In file included from /usr/include/c++/v1/__format/parser_std_format_spec.h:39:
/usr/include/c++/v1/string:2538:5: error: implicit instantiation of undefined template 'std::char_traits<unsigned short>'
2538 | traits_type::copy(
| ^
/usr/include/c++/v1/__fwd/string.h:23:29: note: template is declared here
23 | struct _LIBCPP_TEMPLATE_VIS char_traits;
| ^
In file included from ../src/node.cc:1:
In file included from ../src/./node.h:4:
In file included from ../../nan/nan.h:62:
In file included from /usr/local/include/node/node.h:73:
In file included from /usr/local/include/node/v8.h:26:
In file included from /usr/local/include/node/v8-context.h:10:
In file included from /usr/include/c++/v1/vector:325:
In file included from /usr/include/c++/v1/__format/formatter_bool.h:16:
In file included from /usr/include/c++/v1/__format/concepts.h:16:
In file included from /usr/include/c++/v1/__format/format_parse_context.h:16:
In file included from /usr/include/c++/v1/string_view:226:
/usr/include/c++/v1/__string/char_traits.h:359:23: error: implicit instantiation of undefined template 'std::char_traits<unsigned short>'
359 | const _CharT* __r = _Traits::find(__p + __pos, __sz - __pos, __c);
| ^
/usr/include/c++/v1/string:3501:15: note: in instantiation of function template specialization 'std::__str_find<unsigned short, unsigned long, std::char_traits<unsigned short>, 18446744073709551615UL>' requested here
3501 | return std::__str_find<value_type, size_type, traits_type, npos>(data(), size(), __c, __pos);
| ^
../src/node.cc:484:51: note: in instantiation of member function 'std::basic_string<unsigned short>::find' requested here
484 | bool contains(TSSymbol symbol) { return symbols.find(symbol) != symbols.npos; }
| ^
/usr/include/c++/v1/__fwd/string.h:23:29: note: template is declared here
23 | struct _LIBCPP_TEMPLATE_VIS char_traits;
| ^
2 warnings and 7 errors generated.
gmake[1]: *** [tree_sitter_runtime_binding.target.mk:122: Release/obj.target/tree_sitter_runtime_binding/src/node.o] Error 1
gmake[1]: Leaving directory '/wrkdirs/usr/ports/editors/vscode/work/vscode-1.94.2/build/node_modules/tree-sitter/build'
gyp ERR! build error
gyp ERR! stack Error: `gmake` failed with exit code: 2
gyp ERR! stack at ChildProcess.<anonymous> (/usr/local/lib/node_modules/npm/node_modules/node-gyp/lib/build.js:216:23)
gyp ERR! System FreeBSD 15.0-CURRENT
gyp ERR! command "/usr/local/bin/node" "/usr/local/bin/node-gyp" "--userconfig=/wrkdirs/usr/ports/editors/vscode/work/vscode-1.94.2/build/.npmrc" "rebuild"
gyp ERR! cwd /wrkdirs/usr/ports/editors/vscode/work/vscode-1.94.2/build/node_modules/tree-sitter
gyp ERR! node -v v20.18.0
gyp ERR! node-gyp -v v10.2.0
gyp ERR! not ok
*** Error code 1
Stop.
make: stopped making "build" in /usr/ports/editors/vscode