[package - main-amd64-default][math/openfst-vosk] Failed for openfst-vosk-20210207 in build
- Go to: [ bottom of page ] [ top of archives ] [ this month ]
Date: Sat, 02 Nov 2024 01:15:39 UTC
You are receiving this mail as a port that you maintain
is failing to build on the FreeBSD package build server.
Please investigate the failure and submit a PR to fix
build.
Maintainer: yuri@FreeBSD.org
Log URL: https://pkg-status.freebsd.org/beefy18/data/main-amd64-default/p009a7c198ee2_s8d6feaaaa26/logs/openfst-vosk-20210207.log
Build URL: https://pkg-status.freebsd.org/beefy18/build.html?mastername=main-amd64-default&build=p009a7c198ee2_s8d6feaaaa26
Log:
=>> Building math/openfst-vosk
build started at Sat Nov 2 01:15:14 UTC 2024
port directory: /usr/ports/math/openfst-vosk
package name: openfst-vosk-20210207
building for: FreeBSD main-amd64-default-job-04 15.0-CURRENT FreeBSD 15.0-CURRENT 1500026 amd64
maintained by: yuri@FreeBSD.org
Makefile datestamp: -rw-r--r-- 1 root wheel 612 Dec 26 2023 /usr/ports/math/openfst-vosk/Makefile
Ports top last git commit: 009a7c198ee
Ports top unclean checkout: no
Port dir last git commit: 4df77d75c25
Port dir unclean checkout: no
Poudriere version: poudriere-git-3.4.2
Host OSVERSION: 1500023
Jail OSVERSION: 1500026
Job Id: 04
!!! Jail is newer than host. (Jail: 1500026, Host: 1500023) !!!
!!! This is not supported. !!!
!!! Host kernel must be same or newer than jail. !!!
!!! Expect build failures. !!!
---Begin Environment---
SHELL=/bin/sh
OSVERSION=1500026
UNAME_v=FreeBSD 15.0-CURRENT 1500026
UNAME_r=15.0-CURRENT
BLOCKSIZE=K
MAIL=/var/mail/root
MM_CHARSET=UTF-8
LANG=C.UTF-8
STATUS=1
HOME=/root
PATH=/sbin:/bin:/usr/sbin:/usr/bin:/usr/local/sbin:/usr/local/bin:/root/bin
MAKE_OBJDIR_CHECK_WRITABLE=0
LOCALBASE=/usr/local
USER=root
POUDRIERE_NAME=poudriere-git
LIBEXECPREFIX=/usr/local/libexec/poudriere
POUDRIERE_VERSION=3.4.2
MASTERMNT=/usr/local/poudriere/data/.m/main-amd64-default/ref
LC_COLLATE=C
POUDRIERE_BUILD_TYPE=bulk
PACKAGE_BUILDING=yes
SAVED_TERM=
OUTPUT_REDIRECTED_STDERR=4
OUTPUT_REDIRECTED=1
PWD=/usr/local/poudriere/data/.m/main-amd64-default/04/.p
OUTPUT_REDIRECTED_STDOUT=3
P_PORTS_FEATURES=FLAVORS SUBPACKAGES SELECTED_OPTIONS
MASTERNAME=main-amd64-default
SCRIPTPREFIX=/usr/local/share/poudriere
SCRIPTNAME=bulk.sh
OLDPWD=/usr/local/poudriere/data/.m/main-amd64-default/ref/.p/pool
POUDRIERE_PKGNAME=poudriere-git-3.4.2
SCRIPTPATH=/usr/local/share/poudriere/bulk.sh
POUDRIEREPATH=/usr/local/bin/poudriere
---End Environment---
---Begin Poudriere Port Flags/Env---
PORT_FLAGS=
PKGENV=
FLAVOR=
MAKE_ARGS=
---End Poudriere Port Flags/Env---
---Begin OPTIONS List---
---End OPTIONS List---
--MAINTAINER--
yuri@FreeBSD.org
--End MAINTAINER--
--CONFIGURE_ARGS--
--enable-shared --enable-far --enable-ngram-fsts --enable-lookahead-fsts --with-pic --disable-bin --prefix=/usr/local ${_LATE_CONFIGURE_ARGS}
--End CONFIGURE_ARGS--
--CONFIGURE_ENV--
MAKE=gmake XDG_DATA_HOME=/wrkdirs/usr/ports/math/openfst-vosk/work XDG_CONFIG_HOME=/wrkdirs/usr/ports/math/openfst-vosk/work XDG_CACHE_HOME=/wrkdirs/usr/ports/math/openfst-vosk/work/.cache HOME=/wrkdirs/usr/ports/math/openfst-vosk/work TMPDIR="/tmp" PATH=/wrkdirs/usr/ports/math/openfst-vosk/work/.bin:/sbin:/bin:/usr/sbin:/usr/bin:/usr/local/sbin:/usr/local/bin:/root/bin PKG_CONFIG_LIBDIR=/wrkdirs/usr/ports/math/openfst-vosk/work/.pkgconfig:/usr/local/libdata/pkgconfig:/usr/local/share/pkgconfig:/usr/libdata/pkgconfig SHELL=/bin/sh CONFIG_SHELL=/bin/sh DEFAULT_AUTOCONF=2.72 CONFIG_SITE=/usr/ports/Templates/config.site lt_cv_sys_max_cmd_len=524288
--End CONFIGURE_ENV--
--MAKE_ENV--
XDG_DATA_HOME=/wrkdirs/usr/ports/math/openfst-vosk/work XDG_CONFIG_HOME=/wrkdirs/usr/ports/math/openfst-vosk/work XDG_CACHE_HOME=/wrkdirs/usr/ports/math/openfst-vosk/work/.cache HOME=/wrkdirs/usr/ports/math/openfst-vosk/work TMPDIR="/tmp" PATH=/wrkdirs/usr/ports/math/openfst-vosk/work/.bin:/sbin:/bin:/usr/sbin:/usr/bin:/usr/local/sbin:/usr/local/bin:/root/bin PKG_CONFIG_LIBDIR=/wrkdirs/usr/ports/math/openfst-vosk/work/.pkgconfig:/usr/local/libdata/pkgconfig:/usr/local/share/pkgconfig:/usr/libdata/pkgconfig MK_DEBUG_FILES=no MK_KERNEL_SYMBOLS=no SHELL=/bin/sh NO_LINT=YES DEFAULT_AUTOCONF=2.72 PREFIX=/usr/local LOCALBASE=/usr/local CC="cc" CFLAGS="-O2 -pipe -fstack-protector-strong -fno-strict-aliasing " CPP="cpp" CPPFLAGS="" LDFLAGS=" -fstack-protector-strong " LIBS="" CXX="c++" CXXFLAGS="-O2 -pipe -fstack-protector-strong -fno-strict-aliasing " BSD_INSTALL_PROGRAM="install -s -m 555" BSD_INSTALL_LIB="install -s -m 0644" BSD_INSTALL_SCRIPT="install -m 555" BSD
_INSTALL_DATA="install -m 0644" BSD_INSTALL_MAN="install -m 444"
--End MAKE_ENV--
--PLIST_SUB--
OSREL=15.0 PREFIX=%D LOCALBASE=/usr/local RESETPREFIX=/usr/local LIB32DIR=lib DOCSDIR="share/doc/openfst" EXAMPLESDIR="share/examples/openfst" DATADIR="share/openfst" WWWDIR="www/openfst" ETCDIR="etc/openfst"
--End PLIST_SUB--
--SUB_LIST--
PREFIX=/usr/local LOCALBASE=/usr/local DATADIR=/usr/local/share/openfst DOCSDIR=/usr/local/share/doc/openfst EXAMPLESDIR=/usr/local/share/examples/openfst WWWDIR=/usr/local/www/openfst ETCDIR=/usr/local/etc/openfst
--End SUB_LIST--
---Begin make.conf---
# XXX: We really need this but cannot use it while 'make checksum' does not
# try the next mirror on checksum failure. It currently retries the same
# failed mirror and then fails rather then trying another. It *does*
# try the next if the size is mismatched though.
#MASTER_SITE_FREEBSD=yes
# Build ALLOW_MAKE_JOBS_PACKAGES with 3 jobs
MAKE_JOBS_NUMBER=3
USE_PACKAGE_DEPENDS=yes
BATCH=yes
WRKDIRPREFIX=/wrkdirs
PORTSDIR=/usr/ports
PACKAGES=/packages
DISTDIR=/distfiles
PACKAGE_BUILDING=yes
PACKAGE_BUILDING_FLAVORS=yes
#### ####
# XXX: We really need this but cannot use it while 'make checksum' does not
# try the next mirror on checksum failure. It currently retries the same
# failed mirror and then fails rather then trying another. It *does*
# try the next if the size is mismatched though.
#MASTER_SITE_FREEBSD=yes
# Build ALLOW_MAKE_JOBS_PACKAGES with 3 jobs
MAKE_JOBS_NUMBER=3
#### Misc Poudriere ####
.include "/etc/make.conf.ports_env"
GID=0
UID=0
---End make.conf---
--Resource limits--
ulimit: can't get limit: Invalid argument
cpu time (seconds, -t) unlimited
file size (512-blocks, -f) unlimited
data seg size (kbytes, -d) 33554432
stack size (kbytes, -s) 524288
core file size (512-blocks, -c) unlimited
max memory size (kbytes, -m) unlimited
locked memory (kbytes, -l) unlimited
max user processes (-u) 89999
open files (-n) 8192
virtual mem size (kbytes, -v) unlimited
swap limit (kbytes, -w) unlimited
socket buffer size (bytes, -b) unlimited
pseudo-terminals (-p) unlimited
kqueues (-k) unlimited
umtx shared locks (-o) unlimited
--End resource limits--
=======================<phase: check-sanity >============================
===== env: NO_DEPENDS=yes USER=root UID=0 GID=0
===> License APACHE20 accepted by the user
===========================================================================
=======================<phase: pkg-depends >============================
===== env: USE_PACKAGE_DEPENDS_ONLY=1 USER=root UID=0 GID=0
===> openfst-vosk-20210207 depends on file: /usr/local/sbin/pkg - not found
===> Installing existing package /packages/All/pkg-1.21.3.pkg
[main-amd64-default-job-04] Installing pkg-1.21.3...
[main-amd64-default-job-04] Extracting pkg-1.21.3: .......... done
===> openfst-vosk-20210207 depends on file: /usr/local/sbin/pkg - found
===> Returning to build of openfst-vosk-20210207
===========================================================================
=======================<phase: fetch-depends >============================
===== env: USE_PACKAGE_DEPENDS_ONLY=1 USER=root UID=0 GID=0
===========================================================================
=======================<phase: fetch >============================
===== env: NO_DEPENDS=yes USER=root UID=0 GID=0
===> License APACHE20 accepted by the user
===> Fetching all distfiles required by openfst-vosk-20210207 for building
===========================================================================
=======================<phase: checksum >============================
===== env: NO_DEPENDS=yes USER=root UID=0 GID=0
===> License APACHE20 accepted by the user
===> Fetching all distfiles required by openfst-vosk-20210207 for building
=> SHA256 Checksum OK for alphacep-openfst-20210207-7dfd808_GH0.tar.gz.
===========================================================================
=======================<phase: extract-depends>============================
===== env: USE_PACKAGE_DEPENDS_ONLY=1 USER=root UID=0 GID=0
===========================================================================
=======================<phase: extract >============================
===== env: NO_DEPENDS=yes USER=root UID=0 GID=0
===> License APACHE20 accepted by the user
===> Fetching all distfiles required by openfst-vosk-20210207 for building
===> Extracting for openfst-vosk-20210207
=> SHA256 Checksum OK for alphacep-openfst-20210207-7dfd808_GH0.tar.gz.
===========================================================================
=======================<phase: patch-depends >============================
===== env: USE_PACKAGE_DEPENDS_ONLY=1 USER=root UID=0 GID=0
===========================================================================
=======================<phase: patch >============================
===== env: NO_DEPENDS=yes USER=root UID=0 GID=0
===> Patching for openfst-vosk-20210207
===========================================================================
=======================<phase: build-depends >============================
===== env: USE_PACKAGE_DEPENDS_ONLY=1 USER=root UID=0 GID=0
===> openfst-vosk-20210207 depends on package: gmake>=4.4.1 - not found
===> Installing existing package /packages/All/gmake-4.4.1.pkg
[main-amd64-default-job-04] Installing gmake-4.4.1...
[main-amd64-default-job-04] `-- Installing gettext-runtime-0.22.5...
[main-amd64-default-job-04] | `-- Installing indexinfo-0.3.1...
[main-amd64-default-job-04] | `-- Extracting indexinfo-0.3.1: .... done
[main-amd64-default-job-04] `-- Extracting gettext-runtime-0.22.5: .......... done
[main-amd64-default-job-04] Extracting gmake-4.4.1: .......... done
===> openfst-vosk-20210207 depends on package: gmake>=4.4.1 - found
<snip>
config.status: creating src/extensions/Makefile
config.status: creating src/extensions/compact/Makefile
config.status: creating src/extensions/compress/Makefile
config.status: creating src/extensions/const/Makefile
config.status: creating src/extensions/far/Makefile
config.status: creating src/extensions/linear/Makefile
config.status: creating src/extensions/lookahead/Makefile
config.status: creating src/extensions/mpdt/Makefile
config.status: creating src/extensions/ngram/Makefile
config.status: creating src/extensions/pdt/Makefile
config.status: creating src/extensions/python/Makefile
config.status: creating src/extensions/special/Makefile
config.status: creating src/script/Makefile
config.status: creating config.h
config.status: creating src/include/fst/config.h
config.status: src/include/fst/config.h is unchanged
config.status: executing depfiles commands
config.status: executing libtool commands
===========================================================================
=======================<phase: build >============================
===== env: NO_DEPENDS=yes USER=root UID=0 GID=0
===> Building for openfst-vosk-20210207
gmake all-recursive
gmake[1]: Entering directory '/wrkdirs/usr/ports/math/openfst-vosk/work/openfst-7dfd808'
Making all in src
gmake[2]: Entering directory '/wrkdirs/usr/ports/math/openfst-vosk/work/openfst-7dfd808/src'
Making all in include
gmake[3]: Entering directory '/wrkdirs/usr/ports/math/openfst-vosk/work/openfst-7dfd808/src/include'
gmake[3]: Nothing to be done for 'all'.
gmake[3]: Leaving directory '/wrkdirs/usr/ports/math/openfst-vosk/work/openfst-7dfd808/src/include'
Making all in lib
gmake[3]: Entering directory '/wrkdirs/usr/ports/math/openfst-vosk/work/openfst-7dfd808/src/lib'
depbase=`echo compat.lo | sed 's|[^/]*$|.deps/&|;s|\.lo$||'`;\
/bin/sh ../../libtool --tag=CXX --mode=compile c++ -std=c++17 -fno-exceptions -Wno-deprecated-declarations -DHAVE_CONFIG_H -I./../include -O2 -pipe -fstack-protector-strong -fno-strict-aliasing -MT compat.lo -MD -MP -MF $depbase.Tpo -c -o compat.lo compat.cc &&\
mv -f $depbase.Tpo $depbase.Plo
depbase=`echo encode.lo | sed 's|[^/]*$|.deps/&|;s|\.lo$||'`;\
/bin/sh ../../libtool --tag=CXX --mode=compile c++ -std=c++17 -fno-exceptions -Wno-deprecated-declarations -DHAVE_CONFIG_H -I./../include -O2 -pipe -fstack-protector-strong -fno-strict-aliasing -MT encode.lo -MD -MP -MF $depbase.Tpo -c -o encode.lo encode.cc &&\
mv -f $depbase.Tpo $depbase.Plo
depbase=`echo flags.lo | sed 's|[^/]*$|.deps/&|;s|\.lo$||'`;\
/bin/sh ../../libtool --tag=CXX --mode=compile c++ -std=c++17 -fno-exceptions -Wno-deprecated-declarations -DHAVE_CONFIG_H -I./../include -O2 -pipe -fstack-protector-strong -fno-strict-aliasing -MT flags.lo -MD -MP -MF $depbase.Tpo -c -o flags.lo flags.cc &&\
mv -f $depbase.Tpo $depbase.Plo
libtool: compile: c++ -std=c++17 -fno-exceptions -Wno-deprecated-declarations -DHAVE_CONFIG_H -I./../include -O2 -pipe -fstack-protector-strong -fno-strict-aliasing -MT encode.lo -MD -MP -MF .deps/encode.Tpo -c encode.cc -fPIC -DPIC -o .libs/encode.o
libtool: compile: c++ -std=c++17 -fno-exceptions -Wno-deprecated-declarations -DHAVE_CONFIG_H -I./../include -O2 -pipe -fstack-protector-strong -fno-strict-aliasing -MT compat.lo -MD -MP -MF .deps/compat.Tpo -c compat.cc -fPIC -DPIC -o .libs/compat.o
libtool: compile: c++ -std=c++17 -fno-exceptions -Wno-deprecated-declarations -DHAVE_CONFIG_H -I./../include -O2 -pipe -fstack-protector-strong -fno-strict-aliasing -MT flags.lo -MD -MP -MF .deps/flags.Tpo -c flags.cc -fPIC -DPIC -o .libs/flags.o
depbase=`echo fst.lo | sed 's|[^/]*$|.deps/&|;s|\.lo$||'`;\
/bin/sh ../../libtool --tag=CXX --mode=compile c++ -std=c++17 -fno-exceptions -Wno-deprecated-declarations -DHAVE_CONFIG_H -I./../include -O2 -pipe -fstack-protector-strong -fno-strict-aliasing -MT fst.lo -MD -MP -MF $depbase.Tpo -c -o fst.lo fst.cc &&\
mv -f $depbase.Tpo $depbase.Plo
libtool: compile: c++ -std=c++17 -fno-exceptions -Wno-deprecated-declarations -DHAVE_CONFIG_H -I./../include -O2 -pipe -fstack-protector-strong -fno-strict-aliasing -MT fst.lo -MD -MP -MF .deps/fst.Tpo -c fst.cc -fPIC -DPIC -o .libs/fst.o
In file included from encode.cc:20:
In file included from ./../include/fst/encode.h:32:
In file included from ./../include/fst/arc-map.h:32:
In file included from ./../include/fst/cache.h:32:
In file included from ./../include/fst/vector-fst.h:33:
In file included from ./../include/fst/mutable-fst.h:37:
In file included from ./../include/fst/expanded-fst.h:33:
./../include/fst/fst.h:704:15: error: no viable overloaded '='
704 | isymbols_ = impl.isymbols_ ? impl.isymbols_->Copy() : nullptr;
| ~~~~~~~~~ ^ ~~~~~~~~~~~~~~~~~~~~~~~~~~~~~~~~~~~~~~~~~~~~~~~~~
/usr/include/c++/v1/__memory/unique_ptr.h:231:67: note: candidate function not viable: no known conversion from 'SymbolTable *' to 'unique_ptr<SymbolTable>' for 1st argument
231 | _LIBCPP_HIDE_FROM_ABI _LIBCPP_CONSTEXPR_SINCE_CXX23 unique_ptr& operator=(unique_ptr&& __u) _NOEXCEPT {
| ^ ~~~~~~~~~~~~~~~~
/usr/include/c++/v1/__memory/unique_ptr.h:241:67: note: candidate template ignored: could not match 'unique_ptr<_Up, _Ep>' against 'SymbolTable *'
241 | _LIBCPP_HIDE_FROM_ABI _LIBCPP_CONSTEXPR_SINCE_CXX23 unique_ptr& operator=(unique_ptr<_Up, _Ep>&& __u) _NOEXCEPT {
| ^
/usr/include/c++/v1/__memory/unique_ptr.h:263:67: note: candidate function not viable: no known conversion from 'SymbolTable *' to 'nullptr_t' (aka 'std::nullptr_t') for 1st argument
263 | _LIBCPP_HIDE_FROM_ABI _LIBCPP_CONSTEXPR_SINCE_CXX23 unique_ptr& operator=(nullptr_t) _NOEXCEPT {
| ^ ~~~~~~~~~
/usr/include/c++/v1/__memory/unique_ptr.h:138:59: note: candidate function (the implicit copy assignment operator) not viable: no known conversion from 'SymbolTable *' to 'const unique_ptr<SymbolTable>' for 1st argument
138 | class _LIBCPP_UNIQUE_PTR_TRIVIAL_ABI _LIBCPP_TEMPLATE_VIS unique_ptr {
| ^~~~~~~~~~
In file included from encode.cc:20:
In file included from ./../include/fst/encode.h:32:
In file included from ./../include/fst/arc-map.h:32:
In file included from ./../include/fst/cache.h:32:
In file included from ./../include/fst/vector-fst.h:33:
In file included from ./../include/fst/mutable-fst.h:37:
In file included from ./../include/fst/expanded-fst.h:33:
./../include/fst/fst.h:705:15: error: no viable overloaded '='
705 | osymbols_ = impl.osymbols_ ? impl.osymbols_->Copy() : nullptr;
| ~~~~~~~~~ ^ ~~~~~~~~~~~~~~~~~~~~~~~~~~~~~~~~~~~~~~~~~~~~~~~~~
/usr/include/c++/v1/__memory/unique_ptr.h:231:67: note: candidate function not viable: no known conversion from 'SymbolTable *' to 'unique_ptr<SymbolTable>' for 1st argument
231 | _LIBCPP_HIDE_FROM_ABI _LIBCPP_CONSTEXPR_SINCE_CXX23 unique_ptr& operator=(unique_ptr&& __u) _NOEXCEPT {
| ^ ~~~~~~~~~~~~~~~~
/usr/include/c++/v1/__memory/unique_ptr.h:241:67: note: candidate template ignored: could not match 'unique_ptr<_Up, _Ep>' against 'SymbolTable *'
241 | _LIBCPP_HIDE_FROM_ABI _LIBCPP_CONSTEXPR_SINCE_CXX23 unique_ptr& operator=(unique_ptr<_Up, _Ep>&& __u) _NOEXCEPT {
| ^
/usr/include/c++/v1/__memory/unique_ptr.h:263:67: note: candidate function not viable: no known conversion from 'SymbolTable *' to 'nullptr_t' (aka 'std::nullptr_t') for 1st argument
263 | _LIBCPP_HIDE_FROM_ABI _LIBCPP_CONSTEXPR_SINCE_CXX23 unique_ptr& operator=(nullptr_t) _NOEXCEPT {
| ^ ~~~~~~~~~
/usr/include/c++/v1/__memory/unique_ptr.h:138:59: note: candidate function (the implicit copy assignment operator) not viable: no known conversion from 'SymbolTable *' to 'const unique_ptr<SymbolTable>' for 1st argument
138 | class _LIBCPP_UNIQUE_PTR_TRIVIAL_ABI _LIBCPP_TEMPLATE_VIS unique_ptr {
| ^~~~~~~~~~
depbase=`echo fst-types.lo | sed 's|[^/]*$|.deps/&|;s|\.lo$||'`;\
/bin/sh ../../libtool --tag=CXX --mode=compile c++ -std=c++17 -fno-exceptions -Wno-deprecated-declarations -DHAVE_CONFIG_H -I./../include -O2 -pipe -fstack-protector-strong -fno-strict-aliasing -MT fst-types.lo -MD -MP -MF $depbase.Tpo -c -o fst-types.lo fst-types.cc &&\
mv -f $depbase.Tpo $depbase.Plo
libtool: compile: c++ -std=c++17 -fno-exceptions -Wno-deprecated-declarations -DHAVE_CONFIG_H -I./../include -O2 -pipe -fstack-protector-strong -fno-strict-aliasing -MT fst-types.lo -MD -MP -MF .deps/fst-types.Tpo -c fst-types.cc -fPIC -DPIC -o .libs/fst-types.o
2 errors generated.
gmake[3]: *** [Makefile:475: encode.lo] Error 1
gmake[3]: *** Waiting for unfinished jobs....
In file included from fst.cc:20:
./../include/fst/fst.h:704:15: error: no viable overloaded '='
704 | isymbols_ = impl.isymbols_ ? impl.isymbols_->Copy() : nullptr;
| ~~~~~~~~~ ^ ~~~~~~~~~~~~~~~~~~~~~~~~~~~~~~~~~~~~~~~~~~~~~~~~~
/usr/include/c++/v1/__memory/unique_ptr.h:231:67: note: candidate function not viable: no known conversion from 'SymbolTable *' to 'unique_ptr<SymbolTable>' for 1st argument
231 | _LIBCPP_HIDE_FROM_ABI _LIBCPP_CONSTEXPR_SINCE_CXX23 unique_ptr& operator=(unique_ptr&& __u) _NOEXCEPT {
| ^ ~~~~~~~~~~~~~~~~
/usr/include/c++/v1/__memory/unique_ptr.h:241:67: note: candidate template ignored: could not match 'unique_ptr<_Up, _Ep>' against 'SymbolTable *'
241 | _LIBCPP_HIDE_FROM_ABI _LIBCPP_CONSTEXPR_SINCE_CXX23 unique_ptr& operator=(unique_ptr<_Up, _Ep>&& __u) _NOEXCEPT {
| ^
/usr/include/c++/v1/__memory/unique_ptr.h:263:67: note: candidate function not viable: no known conversion from 'SymbolTable *' to 'nullptr_t' (aka 'std::nullptr_t') for 1st argument
263 | _LIBCPP_HIDE_FROM_ABI _LIBCPP_CONSTEXPR_SINCE_CXX23 unique_ptr& operator=(nullptr_t) _NOEXCEPT {
| ^ ~~~~~~~~~
/usr/include/c++/v1/__memory/unique_ptr.h:138:59: note: candidate function (the implicit copy assignment operator) not viable: no known conversion from 'SymbolTable *' to 'const unique_ptr<SymbolTable>' for 1st argument
138 | class _LIBCPP_UNIQUE_PTR_TRIVIAL_ABI _LIBCPP_TEMPLATE_VIS unique_ptr {
| ^~~~~~~~~~
In file included from fst.cc:20:
./../include/fst/fst.h:705:15: error: no viable overloaded '='
705 | osymbols_ = impl.osymbols_ ? impl.osymbols_->Copy() : nullptr;
| ~~~~~~~~~ ^ ~~~~~~~~~~~~~~~~~~~~~~~~~~~~~~~~~~~~~~~~~~~~~~~~~
/usr/include/c++/v1/__memory/unique_ptr.h:231:67: note: candidate function not viable: no known conversion from 'SymbolTable *' to 'unique_ptr<SymbolTable>' for 1st argument
231 | _LIBCPP_HIDE_FROM_ABI _LIBCPP_CONSTEXPR_SINCE_CXX23 unique_ptr& operator=(unique_ptr&& __u) _NOEXCEPT {
| ^ ~~~~~~~~~~~~~~~~
/usr/include/c++/v1/__memory/unique_ptr.h:241:67: note: candidate template ignored: could not match 'unique_ptr<_Up, _Ep>' against 'SymbolTable *'
241 | _LIBCPP_HIDE_FROM_ABI _LIBCPP_CONSTEXPR_SINCE_CXX23 unique_ptr& operator=(unique_ptr<_Up, _Ep>&& __u) _NOEXCEPT {
| ^
/usr/include/c++/v1/__memory/unique_ptr.h:263:67: note: candidate function not viable: no known conversion from 'SymbolTable *' to 'nullptr_t' (aka 'std::nullptr_t') for 1st argument
263 | _LIBCPP_HIDE_FROM_ABI _LIBCPP_CONSTEXPR_SINCE_CXX23 unique_ptr& operator=(nullptr_t) _NOEXCEPT {
| ^ ~~~~~~~~~
/usr/include/c++/v1/__memory/unique_ptr.h:138:59: note: candidate function (the implicit copy assignment operator) not viable: no known conversion from 'SymbolTable *' to 'const unique_ptr<SymbolTable>' for 1st argument
138 | class _LIBCPP_UNIQUE_PTR_TRIVIAL_ABI _LIBCPP_TEMPLATE_VIS unique_ptr {
| ^~~~~~~~~~
In file included from fst.cc:27:
In file included from ./../include/fst/matcher-fst.h:30:
In file included from ./../include/fst/lookahead-matcher.h:35:
In file included from ./../include/fst/label-reachable.h:30:
In file included from ./../include/fst/accumulator.h:34:
In file included from ./../include/fst/replace.h:38:
In file included from ./../include/fst/state-table.h:30:
./../include/fst/bi-table.h:330:25: error: no member named 's_' in 'VectorHashBiTable<I, T, S, FP, H, HS>'
330 | : selector_(table.s_),
| ~~~~~ ^
3 errors generated.
gmake[3]: *** [Makefile:475: fst.lo] Error 1
In file included from fst-types.cc:21:
In file included from ./../include/fst/compact-fst.h:34:
In file included from ./../include/fst/cache.h:32:
In file included from ./../include/fst/vector-fst.h:33:
In file included from ./../include/fst/mutable-fst.h:37:
In file included from ./../include/fst/expanded-fst.h:33:
./../include/fst/fst.h:704:15: error: no viable overloaded '='
704 | isymbols_ = impl.isymbols_ ? impl.isymbols_->Copy() : nullptr;
| ~~~~~~~~~ ^ ~~~~~~~~~~~~~~~~~~~~~~~~~~~~~~~~~~~~~~~~~~~~~~~~~
/usr/include/c++/v1/__memory/unique_ptr.h:231:67: note: candidate function not viable: no known conversion from 'SymbolTable *' to 'unique_ptr<SymbolTable>' for 1st argument
231 | _LIBCPP_HIDE_FROM_ABI _LIBCPP_CONSTEXPR_SINCE_CXX23 unique_ptr& operator=(unique_ptr&& __u) _NOEXCEPT {
| ^ ~~~~~~~~~~~~~~~~
/usr/include/c++/v1/__memory/unique_ptr.h:241:67: note: candidate template ignored: could not match 'unique_ptr<_Up, _Ep>' against 'SymbolTable *'
241 | _LIBCPP_HIDE_FROM_ABI _LIBCPP_CONSTEXPR_SINCE_CXX23 unique_ptr& operator=(unique_ptr<_Up, _Ep>&& __u) _NOEXCEPT {
| ^
/usr/include/c++/v1/__memory/unique_ptr.h:263:67: note: candidate function not viable: no known conversion from 'SymbolTable *' to 'nullptr_t' (aka 'std::nullptr_t') for 1st argument
263 | _LIBCPP_HIDE_FROM_ABI _LIBCPP_CONSTEXPR_SINCE_CXX23 unique_ptr& operator=(nullptr_t) _NOEXCEPT {
| ^ ~~~~~~~~~
/usr/include/c++/v1/__memory/unique_ptr.h:138:59: note: candidate function (the implicit copy assignment operator) not viable: no known conversion from 'SymbolTable *' to 'const unique_ptr<SymbolTable>' for 1st argument
138 | class _LIBCPP_UNIQUE_PTR_TRIVIAL_ABI _LIBCPP_TEMPLATE_VIS unique_ptr {
| ^~~~~~~~~~
In file included from fst-types.cc:21:
In file included from ./../include/fst/compact-fst.h:34:
In file included from ./../include/fst/cache.h:32:
In file included from ./../include/fst/vector-fst.h:33:
In file included from ./../include/fst/mutable-fst.h:37:
In file included from ./../include/fst/expanded-fst.h:33:
./../include/fst/fst.h:705:15: error: no viable overloaded '='
705 | osymbols_ = impl.osymbols_ ? impl.osymbols_->Copy() : nullptr;
| ~~~~~~~~~ ^ ~~~~~~~~~~~~~~~~~~~~~~~~~~~~~~~~~~~~~~~~~~~~~~~~~
/usr/include/c++/v1/__memory/unique_ptr.h:231:67: note: candidate function not viable: no known conversion from 'SymbolTable *' to 'unique_ptr<SymbolTable>' for 1st argument
231 | _LIBCPP_HIDE_FROM_ABI _LIBCPP_CONSTEXPR_SINCE_CXX23 unique_ptr& operator=(unique_ptr&& __u) _NOEXCEPT {
| ^ ~~~~~~~~~~~~~~~~
/usr/include/c++/v1/__memory/unique_ptr.h:241:67: note: candidate template ignored: could not match 'unique_ptr<_Up, _Ep>' against 'SymbolTable *'
241 | _LIBCPP_HIDE_FROM_ABI _LIBCPP_CONSTEXPR_SINCE_CXX23 unique_ptr& operator=(unique_ptr<_Up, _Ep>&& __u) _NOEXCEPT {
| ^
/usr/include/c++/v1/__memory/unique_ptr.h:263:67: note: candidate function not viable: no known conversion from 'SymbolTable *' to 'nullptr_t' (aka 'std::nullptr_t') for 1st argument
263 | _LIBCPP_HIDE_FROM_ABI _LIBCPP_CONSTEXPR_SINCE_CXX23 unique_ptr& operator=(nullptr_t) _NOEXCEPT {
| ^ ~~~~~~~~~
/usr/include/c++/v1/__memory/unique_ptr.h:138:59: note: candidate function (the implicit copy assignment operator) not viable: no known conversion from 'SymbolTable *' to 'const unique_ptr<SymbolTable>' for 1st argument
138 | class _LIBCPP_UNIQUE_PTR_TRIVIAL_ABI _LIBCPP_TEMPLATE_VIS unique_ptr {
| ^~~~~~~~~~
2 errors generated.
gmake[3]: *** [Makefile:475: fst-types.lo] Error 1
gmake[3]: Leaving directory '/wrkdirs/usr/ports/math/openfst-vosk/work/openfst-7dfd808/src/lib'
gmake[2]: *** [Makefile:375: all-recursive] Error 1
gmake[2]: Leaving directory '/wrkdirs/usr/ports/math/openfst-vosk/work/openfst-7dfd808/src'
gmake[1]: *** [Makefile:434: all-recursive] Error 1
gmake[1]: Leaving directory '/wrkdirs/usr/ports/math/openfst-vosk/work/openfst-7dfd808'
gmake: *** [Makefile:358: all] Error 2
===> Compilation failed unexpectedly.
Try to set MAKE_JOBS_UNSAFE=yes and rebuild before reporting the failure to
the maintainer.
*** Error code 1
Stop.
make: stopped making "build" in /usr/ports/math/openfst-vosk