[package - main-amd64-default][www/onlyoffice-documentserver] Failed for onlyoffice-documentserver-8.0.1.31_1 in build
- Go to: [ bottom of page ] [ top of archives ] [ this month ]
Date: Fri, 01 Nov 2024 16:30:48 UTC
You are receiving this mail as a port that you maintain
is failing to build on the FreeBSD package build server.
Please investigate the failure and submit a PR to fix
build.
Maintainer: mikael@FreeBSD.org
Log URL: https://pkg-status.freebsd.org/beefy18/data/main-amd64-default/p35e33b5b9186_sd0f9b0bd19b/logs/onlyoffice-documentserver-8.0.1.31_1.log
Build URL: https://pkg-status.freebsd.org/beefy18/build.html?mastername=main-amd64-default&build=p35e33b5b9186_sd0f9b0bd19b
Log:
=>> Building www/onlyoffice-documentserver
build started at Fri Nov 1 16:27:36 UTC 2024
port directory: /usr/ports/www/onlyoffice-documentserver
package name: onlyoffice-documentserver-8.0.1.31_1
building for: FreeBSD main-amd64-default-job-12 15.0-CURRENT FreeBSD 15.0-CURRENT 1500026 amd64
maintained by: mikael@FreeBSD.org
Makefile datestamp: -rw-r--r-- 1 root wheel 13258 Oct 5 01:01 /usr/ports/www/onlyoffice-documentserver/Makefile
Ports top last git commit: 35e33b5b918
Ports top unclean checkout: no
Port dir last git commit: 55cfbcf56c3
Port dir unclean checkout: no
Poudriere version: poudriere-git-3.4.2
Host OSVERSION: 1500023
Jail OSVERSION: 1500026
Job Id: 12
!!! Jail is newer than host. (Jail: 1500026, Host: 1500023) !!!
!!! This is not supported. !!!
!!! Host kernel must be same or newer than jail. !!!
!!! Expect build failures. !!!
---Begin Environment---
SHELL=/bin/sh
OSVERSION=1500026
UNAME_v=FreeBSD 15.0-CURRENT 1500026
UNAME_r=15.0-CURRENT
BLOCKSIZE=K
MAIL=/var/mail/root
MM_CHARSET=UTF-8
LANG=C.UTF-8
STATUS=1
HOME=/root
PATH=/sbin:/bin:/usr/sbin:/usr/bin:/usr/local/sbin:/usr/local/bin:/root/bin
MAKE_OBJDIR_CHECK_WRITABLE=0
LOCALBASE=/usr/local
USER=root
POUDRIERE_NAME=poudriere-git
LIBEXECPREFIX=/usr/local/libexec/poudriere
POUDRIERE_VERSION=3.4.2
MASTERMNT=/usr/local/poudriere/data/.m/main-amd64-default/ref
LC_COLLATE=C
POUDRIERE_BUILD_TYPE=bulk
PACKAGE_BUILDING=yes
SAVED_TERM=
OUTPUT_REDIRECTED_STDERR=4
OUTPUT_REDIRECTED=1
PWD=/usr/local/poudriere/data/.m/main-amd64-default/12/.p
OUTPUT_REDIRECTED_STDOUT=3
P_PORTS_FEATURES=FLAVORS SUBPACKAGES SELECTED_OPTIONS
MASTERNAME=main-amd64-default
SCRIPTPREFIX=/usr/local/share/poudriere
SCRIPTNAME=bulk.sh
OLDPWD=/usr/local/poudriere/data/.m/main-amd64-default/ref/.p/pool
POUDRIERE_PKGNAME=poudriere-git-3.4.2
SCRIPTPATH=/usr/local/share/poudriere/bulk.sh
POUDRIEREPATH=/usr/local/bin/poudriere
---End Environment---
---Begin Poudriere Port Flags/Env---
PORT_FLAGS=
PKGENV=
FLAVOR=
MAKE_ARGS=
---End Poudriere Port Flags/Env---
---Begin OPTIONS List---
===> The following configuration options are available for onlyoffice-documentserver-8.0.1.31_1:
====> Options available for the single DB: you have to select exactly one of them
MYSQL=off: MySQL database support
PGSQL=on: PostgreSQL database support
===> Use 'make config' to modify these settings
---End OPTIONS List---
--MAINTAINER--
mikael@FreeBSD.org
--End MAINTAINER--
--CONFIGURE_ARGS--
--End CONFIGURE_ARGS--
--CONFIGURE_ENV--
MAKE=gmake PKG_CONFIG=pkgconf PYTHON="/usr/local/bin/python3.11" QT_SELECT=qt5 QMAKEMODULES="/wrkdirs/usr/ports/www/onlyoffice-documentserver/work/DocumentServer-8.0.1/mkspecs/modules:/usr/local/lib/qt5/mkspecs/modules" XDG_DATA_HOME=/wrkdirs/usr/ports/www/onlyoffice-documentserver/work XDG_CONFIG_HOME=/wrkdirs/usr/ports/www/onlyoffice-documentserver/work XDG_CACHE_HOME=/wrkdirs/usr/ports/www/onlyoffice-documentserver/work/.cache HOME=/wrkdirs/usr/ports/www/onlyoffice-documentserver/work TMPDIR="/tmp" PATH=/wrkdirs/usr/ports/www/onlyoffice-documentserver/work/.bin:/sbin:/bin:/usr/sbin:/usr/bin:/usr/local/sbin:/usr/local/bin:/root/bin PKG_CONFIG_LIBDIR=/wrkdirs/usr/ports/www/onlyoffice-documentserver/work/.pkgconfig:/usr/local/libdata/pkgconfig:/usr/local/share/pkgconfig:/usr/libdata/pkgconfig SHELL=/bin/sh CONFIG_SHELL=/bin/sh DEFAULT_AUTOCONF=2.72 CMAKE_PREFIX_PATH="/usr/local"
--End CONFIGURE_ENV--
--MAKE_ENV--
BUILD_NUMBER="36" PKG_CACHE_PATH=/wrkdirs/usr/ports/www/onlyoffice-documentserver/work/.pkg-cache PRODUCT_VERSION=8.0.1 BUILD_NUMBER=31 PYTHONDONTWRITEBYTECODE=1 QT_SELECT=qt5 QMAKEMODULES="/wrkdirs/usr/ports/www/onlyoffice-documentserver/work/DocumentServer-8.0.1/mkspecs/modules:/usr/local/lib/qt5/mkspecs/modules" XDG_DATA_HOME=/wrkdirs/usr/ports/www/onlyoffice-documentserver/work XDG_CONFIG_HOME=/wrkdirs/usr/ports/www/onlyoffice-documentserver/work XDG_CACHE_HOME=/wrkdirs/usr/ports/www/onlyoffice-documentserver/work/.cache HOME=/wrkdirs/usr/ports/www/onlyoffice-documentserver/work TMPDIR="/tmp" PATH=/wrkdirs/usr/ports/www/onlyoffice-documentserver/work/.bin:/sbin:/bin:/usr/sbin:/usr/bin:/usr/local/sbin:/usr/local/bin:/root/bin PKG_CONFIG_LIBDIR=/wrkdirs/usr/ports/www/onlyoffice-documentserver/work/.pkgconfig:/usr/local/libdata/pkgconfig:/usr/local/share/pkgconfig:/usr/libdata/pkgconfig MK_DEBUG_FILES=no MK_KERNEL_SYMBOLS=no SHELL=/bin/sh NO_LINT=YES DEFAULT_AUTOCONF=
2.72 PREFIX=/usr/local LOCALBASE=/usr/local CC="cc" CFLAGS="-O2 -pipe -DLIBICONV_PLUG -fstack-protector-strong -isystem /usr/local/include -fno-strict-aliasing " CPP="cpp" CPPFLAGS="-DLIBICONV_PLUG -I/usr/local/include -isystem /usr/local/include" LDFLAGS=" -Wl,--undefined-version -L/usr/local/lib -fstack-protector-strong " LIBS="-L/usr/local/lib" CXX="c++" CXXFLAGS="-O2 -pipe -DLIBICONV_PLUG -fstack-protector-strong -isystem /usr/local/include -fno-strict-aliasing -DLIBICONV_PLUG -isystem /usr/local/include " BSD_INSTALL_PROGRAM="install -s -m 555" BSD_INSTALL_LIB="install -s -m 0644" BSD_INSTALL_SCRIPT="install -m 555" BSD_INSTALL_DATA="install -m 0644" BSD_INSTALL_MAN="install -m 444"
--End MAKE_ENV--
--PLIST_SUB--
DS_GROUPNAME=onlyoffice DS_USERNAME=onlyoffice PYTHON_INCLUDEDIR=include/python3.11 PYTHON_LIBDIR=lib/python3.11 PYTHON_PLATFORM=freebsd15 PYTHON_SITELIBDIR=lib/python3.11/site-packages PYTHON_SUFFIX=311 PYTHON_EXT_SUFFIX=.cpython-311 PYTHON_VER=3.11 PYTHON_VERSION=python3.11 PYTHON2="@comment " PYTHON3="" QT_BINDIR="lib/qt5/bin" QT_INCDIR="include/qt5" QT_LIBDIR="lib/qt5" QT_ARCHDIR="lib/qt5" QT_PLUGINDIR="lib/qt5/plugins" QT_LIBEXECDIR="libexec/qt5" QT_IMPORTDIR="lib/qt5/imports" QT_QMLDIR="lib/qt5/qml" QT_DATADIR="share/qt5" QT_DOCDIR="share/doc/qt5" QT_L10NDIR="share/qt5/translations" QT_EXAMPLEDIR="share/examples/qt5" QT_TESTDIR="share/qt5/tests" QT_MKSPECDIR="lib/qt5/mkspecs" QT_TOOLDIR="lib/qt5/bin" OSREL=15.0 PREFIX=%D LOCALBASE=/usr/local RESETPREFIX=/usr/local LIB32DIR=lib DOCSDIR="share/doc/onlyoffice-documentserver" EXAMPLESDIR="share/examples/onlyoffice-documentserver" DATADIR="share/onlyoffice-documentserver" WWWDIR="www/onlyoffice" ETCDIR="etc/onlyoffice"
--End PLIST_SUB--
--SUB_LIST--
DS_GROUPNAME=onlyoffice DS_USERNAME=onlyoffice ETCDIR=/usr/local/etc/onlyoffice PREFIX=/usr/local WWWDIR=/usr/local/www/onlyoffice PYTHON_INCLUDEDIR=/usr/local/include/python3.11 PYTHON_LIBDIR=/usr/local/lib/python3.11 PYTHON_PLATFORM=freebsd15 PYTHON_SITELIBDIR=/usr/local/lib/python3.11/site-packages PYTHON_SUFFIX=311 PYTHON_EXT_SUFFIX=.cpython-311 PYTHON_VER=3.11 PYTHON_VERSION=python3.11 PYTHON2="@comment " PYTHON3="" PREFIX=/usr/local LOCALBASE=/usr/local DATADIR=/usr/local/share/onlyoffice-documentserver DOCSDIR=/usr/local/share/doc/onlyoffice-documentserver EXAMPLESDIR=/usr/local/share/examples/onlyoffice-documentserver WWWDIR=/usr/local/www/onlyoffice ETCDIR=/usr/local/etc/onlyoffice
--End SUB_LIST--
---Begin make.conf---
# XXX: We really need this but cannot use it while 'make checksum' does not
# try the next mirror on checksum failure. It currently retries the same
# failed mirror and then fails rather then trying another. It *does*
# try the next if the size is mismatched though.
#MASTER_SITE_FREEBSD=yes
# Build ALLOW_MAKE_JOBS_PACKAGES with 3 jobs
MAKE_JOBS_NUMBER=3
USE_PACKAGE_DEPENDS=yes
BATCH=yes
WRKDIRPREFIX=/wrkdirs
PORTSDIR=/usr/ports
PACKAGES=/packages
DISTDIR=/distfiles
PACKAGE_BUILDING=yes
PACKAGE_BUILDING_FLAVORS=yes
#### ####
# XXX: We really need this but cannot use it while 'make checksum' does not
# try the next mirror on checksum failure. It currently retries the same
# failed mirror and then fails rather then trying another. It *does*
# try the next if the size is mismatched though.
#MASTER_SITE_FREEBSD=yes
# Build ALLOW_MAKE_JOBS_PACKAGES with 3 jobs
MAKE_JOBS_NUMBER=3
#### Misc Poudriere ####
.include "/etc/make.conf.ports_env"
GID=0
UID=0
---End make.conf---
--Resource limits--
ulimit: can't get limit: Invalid argument
cpu time (seconds, -t) unlimited
file size (512-blocks, -f) unlimited
data seg size (kbytes, -d) 33554432
stack size (kbytes, -s) 524288
core file size (512-blocks, -c) unlimited
max memory size (kbytes, -m) unlimited
locked memory (kbytes, -l) unlimited
max user processes (-u) 89999
open files (-n) 8192
virtual mem size (kbytes, -v) unlimited
swap limit (kbytes, -w) unlimited
socket buffer size (bytes, -b) unlimited
pseudo-terminals (-p) unlimited
kqueues (-k) unlimited
umtx shared locks (-o) unlimited
--End resource limits--
=======================<phase: check-sanity >============================
===== env: NO_DEPENDS=yes USER=root UID=0 GID=0
===> License AGPLv3 accepted by the user
===========================================================================
=======================<phase: pkg-depends >============================
===== env: USE_PACKAGE_DEPENDS_ONLY=1 USER=root UID=0 GID=0
===> onlyoffice-documentserver-8.0.1.31_1 depends on file: /usr/local/sbin/pkg - not found
===> Installing existing package /packages/All/pkg-1.21.3.pkg
[main-amd64-default-job-12] Installing pkg-1.21.3...
[main-amd64-default-job-12] Extracting pkg-1.21.3: .......... done
===> onlyoffice-documentserver-8.0.1.31_1 depends on file: /usr/local/sbin/pkg - found
===> Returning to build of onlyoffice-documentserver-8.0.1.31_1
===========================================================================
=======================<phase: fetch-depends >============================
===== env: USE_PACKAGE_DEPENDS_ONLY=1 USER=root UID=0 GID=0
===========================================================================
=======================<phase: fetch >============================
===== env: NO_DEPENDS=yes USER=root UID=0 GID=0
===> License AGPLv3 accepted by the user
===> Fetching all distfiles required by onlyoffice-documentserver-8.0.1.31_1 for building
===========================================================================
=======================<phase: checksum >============================
===== env: NO_DEPENDS=yes USER=root UID=0 GID=0
===> License AGPLv3 accepted by the user
===> Fetching all distfiles required by onlyoffice-documentserver-8.0.1.31_1 for building
=> SHA256 Checksum OK for v8-8.9.255.25_all.tar.gz.
=> SHA256 Checksum OK for node-v18.18.2.tar.gz.
=> SHA256 Checksum OK for optipng-0.7.7.tar.gz.
=> SHA256 Checksum OK for onlyoffice-documentserver-8.0.1.31-npm-cache.tar.gz.
=> SHA256 Checksum OK for ONLYOFFICE-DocumentServer-v8.0.1.31-v8.0.1_GH0.tar.gz.
=> SHA256 Checksum OK for ONLYOFFICE-core-v8.0.1.31_GH0.tar.gz.
=> SHA256 Checksum OK for ONLYOFFICE-core-fonts-v8.0.1.31_GH0.tar.gz.
=> SHA256 Checksum OK for ONLYOFFICE-dictionaries-v8.0.1.31_GH0.tar.gz.
=> SHA256 Checksum OK for ONLYOFFICE-document-server-integration-v8.0.1.31_GH0.tar.gz.
=> SHA256 Checksum OK for ONLYOFFICE-document-templates-v8.0.1.31_GH0.tar.gz.
=> SHA256 Checksum OK for ONLYOFFICE-sdkjs-v8.0.1.31_GH0.tar.gz.
=> SHA256 Checksum OK for ONLYOFFICE-server-v8.0.1.31_GH0.tar.gz.
=> SHA256 Checksum OK for ONLYOFFICE-web-apps-v8.0.1.31_GH0.tar.gz.
=> SHA256 Checksum OK for ONLYOFFICE-build_tools-v8.0.1.31_GH0.tar.gz.
=> SHA256 Checksum OK for ONLYOFFICE-DocumentBuilder-626d1e44db3d06ceb8298215a67ef0475912d89a_GH0.tar.gz.
=> SHA256 Checksum OK for ONLYOFFICE-onlyoffice.github.io-b26d001664d771df4f663d2d3ba7dd4a188b6cab_GH0.tar.gz.
=> SHA256 Checksum OK for ONLYOFFICE-document-server-package-v8.0.1.31_GH0.tar.gz.
=> SHA256 Checksum OK for jasenhuang-katana-parser-be6df45_GH0.tar.gz.
=> SHA256 Checksum OK for google-gumbo-parser-aa91b27_GH0.tar.gz.
=> SHA256 Checksum OK for hunspell-hyphen-73dd296_GH0.tar.gz.
===========================================================================
=======================<phase: extract-depends>============================
===== env: USE_PACKAGE_DEPENDS_ONLY=1 USER=root UID=0 GID=0
===========================================================================
=======================<phase: extract >============================
<snip>
| ^
/usr/include/c++/v1/__fwd/string.h:23:29: note: template is declared here
23 | struct _LIBCPP_TEMPLATE_VIS char_traits;
| ^
In file included from ../../src/inspector/search-util.cc:5:
In file included from ../../src/inspector/search-util.h:10:
In file included from gen/src/inspector/protocol/Debugger.h:10:
In file included from gen/src/inspector/protocol/Protocol.h:13:
In file included from gen/src/inspector/protocol/Forward.h:10:
In file included from ../../src/inspector/string-util.h:12:
In file included from ../../src/inspector/../../third_party/inspector_protocol/crdtp/protocol_core.h:11:
/usr/include/c++/v1/string:3998:3: error: implicit instantiation of undefined template 'std::char_traits<unsigned short>'
3998 | _Traits::copy(__ptr, __lhs.data(), __lhs_sz);
| ^
../../src/inspector/string-16.h:101:28: note: in instantiation of function template specialization 'std::operator+<unsigned short, std::char_traits<unsigned short>, std::allocator<unsigned short>>' requested here
101 | return String16(m_impl + other.m_impl);
| ^
/usr/include/c++/v1/__fwd/string.h:23:29: note: template is declared here
23 | struct _LIBCPP_TEMPLATE_VIS char_traits;
| ^
In file included from ../../src/inspector/search-util.cc:5:
In file included from ../../src/inspector/search-util.h:10:
In file included from gen/src/inspector/protocol/Debugger.h:10:
In file included from gen/src/inspector/protocol/Protocol.h:13:
In file included from gen/src/inspector/protocol/Forward.h:10:
In file included from ../../src/inspector/string-util.h:12:
In file included from ../../src/inspector/../../third_party/inspector_protocol/crdtp/protocol_core.h:11:
/usr/include/c++/v1/string:3999:3: error: implicit instantiation of undefined template 'std::char_traits<unsigned short>'
3999 | _Traits::copy(__ptr + __lhs_sz, __rhs.data(), __rhs_sz);
| ^
/usr/include/c++/v1/__fwd/string.h:23:29: note: template is declared here
23 | struct _LIBCPP_TEMPLATE_VIS char_traits;
| ^
In file included from ../../src/inspector/search-util.cc:5:
In file included from ../../src/inspector/search-util.h:10:
In file included from gen/src/inspector/protocol/Debugger.h:10:
In file included from gen/src/inspector/protocol/Protocol.h:13:
In file included from gen/src/inspector/protocol/Forward.h:10:
In file included from ../../src/inspector/string-util.h:12:
In file included from ../../src/inspector/../../third_party/inspector_protocol/crdtp/protocol_core.h:11:
/usr/include/c++/v1/string:4000:3: error: implicit instantiation of undefined template 'std::char_traits<unsigned short>'
4000 | _Traits::assign(__ptr + __lhs_sz + __rhs_sz, 1, _CharT());
| ^
/usr/include/c++/v1/__fwd/string.h:23:29: note: template is declared here
23 | struct _LIBCPP_TEMPLATE_VIS char_traits;
| ^
In file included from ../../src/inspector/search-util.cc:5:
In file included from ../../src/inspector/search-util.h:10:
In file included from gen/src/inspector/protocol/Debugger.h:10:
In file included from gen/src/inspector/protocol/Protocol.h:13:
In file included from gen/src/inspector/protocol/Forward.h:10:
In file included from ../../src/inspector/string-util.h:12:
In file included from ../../src/inspector/../../third_party/inspector_protocol/crdtp/protocol_core.h:11:
/usr/include/c++/v1/string:2841:7: error: implicit instantiation of undefined template 'std::char_traits<unsigned short>'
2841 | traits_type::copy(__p + __sz, __s, __n);
| ^
/usr/include/c++/v1/string:1376:12: note: in instantiation of member function 'std::basic_string<unsigned short>::append' requested here
1376 | return append(__str.data(), __str.size());
| ^
/usr/include/c++/v1/string:1347:12: note: in instantiation of member function 'std::basic_string<unsigned short>::append' requested here
1347 | return append(__str);
| ^
../../src/inspector/string-16.h:104:12: note: in instantiation of member function 'std::basic_string<unsigned short>::operator+=' requested here
104 | m_impl += other.m_impl;
| ^
/usr/include/c++/v1/__fwd/string.h:23:29: note: template is declared here
23 | struct _LIBCPP_TEMPLATE_VIS char_traits;
| ^
In file included from ../../src/inspector/search-util.cc:5:
In file included from ../../src/inspector/search-util.h:10:
In file included from gen/src/inspector/protocol/Debugger.h:10:
In file included from gen/src/inspector/protocol/Protocol.h:13:
In file included from gen/src/inspector/protocol/Forward.h:10:
In file included from ../../src/inspector/string-util.h:12:
In file included from ../../src/inspector/../../third_party/inspector_protocol/crdtp/protocol_core.h:11:
/usr/include/c++/v1/string:2844:7: error: implicit instantiation of undefined template 'std::char_traits<unsigned short>'
2844 | traits_type::assign(__p[__sz], value_type());
| ^
/usr/include/c++/v1/__fwd/string.h:23:29: note: template is declared here
23 | struct _LIBCPP_TEMPLATE_VIS char_traits;
| ^
In file included from ../../src/inspector/search-util.cc:5:
In file included from ../../src/inspector/search-util.h:10:
In file included from gen/src/inspector/protocol/Debugger.h:10:
In file included from gen/src/inspector/protocol/Protocol.h:13:
In file included from gen/src/inspector/protocol/Forward.h:10:
In file included from ../../src/inspector/string-util.h:12:
In file included from ../../src/inspector/../../third_party/inspector_protocol/crdtp/protocol_core.h:11:
/usr/include/c++/v1/string:2492:5: error: implicit instantiation of undefined template 'std::char_traits<unsigned short>'
2492 | traits_type::copy(std::__to_address(__p), std::__to_address(__old_p), __n_copy);
| ^
/usr/include/c++/v1/string:2847:5: note: in instantiation of member function 'std::basic_string<unsigned short>::__grow_by_and_replace' requested here
2847 | __grow_by_and_replace(__cap, __sz + __n - __cap, __sz, __sz, 0, __n, __s);
| ^
/usr/include/c++/v1/string:1376:12: note: in instantiation of member function 'std::basic_string<unsigned short>::append' requested here
1376 | return append(__str.data(), __str.size());
| ^
/usr/include/c++/v1/string:1347:12: note: in instantiation of member function 'std::basic_string<unsigned short>::append' requested here
1347 | return append(__str);
| ^
../../src/inspector/string-16.h:104:12: note: in instantiation of member function 'std::basic_string<unsigned short>::operator+=' requested here
104 | m_impl += other.m_impl;
| ^
/usr/include/c++/v1/__fwd/string.h:23:29: note: template is declared here
23 | struct _LIBCPP_TEMPLATE_VIS char_traits;
| ^
In file included from ../../src/inspector/search-util.cc:5:
In file included from ../../src/inspector/search-util.h:10:
In file included from gen/src/inspector/protocol/Debugger.h:10:
In file included from gen/src/inspector/protocol/Protocol.h:13:
In file included from gen/src/inspector/protocol/Forward.h:10:
In file included from ../../src/inspector/string-util.h:12:
In file included from ../../src/inspector/../../third_party/inspector_protocol/crdtp/protocol_core.h:11:
/usr/include/c++/v1/string:2494:5: error: implicit instantiation of undefined template 'std::char_traits<unsigned short>'
2494 | traits_type::copy(std::__to_address(__p) + __n_copy, __p_new_stuff, __n_add);
| ^
/usr/include/c++/v1/__fwd/string.h:23:29: note: template is declared here
23 | struct _LIBCPP_TEMPLATE_VIS char_traits;
| ^
In file included from ../../src/inspector/search-util.cc:5:
In file included from ../../src/inspector/search-util.h:10:
In file included from gen/src/inspector/protocol/Debugger.h:10:
In file included from gen/src/inspector/protocol/Protocol.h:13:
In file included from gen/src/inspector/protocol/Forward.h:10:
In file included from ../../src/inspector/string-util.h:12:
In file included from ../../src/inspector/../../third_party/inspector_protocol/crdtp/protocol_core.h:11:
/usr/include/c++/v1/string:2497:5: error: implicit instantiation of undefined template 'std::char_traits<unsigned short>'
2497 | traits_type::copy(
| ^
/usr/include/c++/v1/__fwd/string.h:23:29: note: template is declared here
23 | struct _LIBCPP_TEMPLATE_VIS char_traits;
| ^
fatal error: too many errors emitted, stopping now [-ferror-limit=]
1 warning and 20 errors generated.
[189/2933] CXX obj/test/unittests/cppgc_unittests_sources/heap-growing-unittest.o
In file included from ../../test/unittests/heap/cppgc/heap-growing-unittest.cc:10:
In file included from ../../testing/gmock/include/gmock/gmock.h:10:
In file included from ../../third_party/googletest/src/googlemock/include/gmock/gmock.h:59:
In file included from ../../third_party/googletest/src/googlemock/include/gmock/gmock-actions.h:145:
In file included from ../../third_party/googletest/src/googlemock/include/gmock/internal/gmock-internal-utils.h:46:
In file included from ../../third_party/googletest/src/googlemock/include/gmock/internal/gmock-port.h:56:
../../third_party/googletest/src/googletest/include/gtest/internal/gtest-port.h:1649:3: warning: mutex 'mutex_' is still held at the end of function [-Wthread-safety-analysis]
1649 | }
| ^
../../third_party/googletest/src/googletest/include/gtest/internal/gtest-port.h:1646:32: note: mutex acquired here
1646 | GTEST_CHECK_POSIX_SUCCESS_(pthread_mutex_lock(&mutex_));
| ^
../../third_party/googletest/src/googletest/include/gtest/internal/gtest-port.h:1658:32: warning: releasing mutex 'mutex_' that was not held [-Wthread-safety-analysis]
1658 | GTEST_CHECK_POSIX_SUCCESS_(pthread_mutex_unlock(&mutex_));
| ^
2 warnings generated.
[190/2933] CXX obj/test/unittests/cppgc_unittests_sources/gc-invoker-unittest.o
In file included from ../../test/unittests/heap/cppgc/gc-invoker-unittest.cc:10:
In file included from ../../testing/gmock/include/gmock/gmock-matchers.h:10:
In file included from ../../third_party/googletest/src/googlemock/include/gmock/gmock-matchers.h:271:
In file included from ../../third_party/googletest/src/googlemock/include/gmock/internal/gmock-internal-utils.h:46:
In file included from ../../third_party/googletest/src/googlemock/include/gmock/internal/gmock-port.h:56:
../../third_party/googletest/src/googletest/include/gtest/internal/gtest-port.h:1649:3: warning: mutex 'mutex_' is still held at the end of function [-Wthread-safety-analysis]
1649 | }
| ^
../../third_party/googletest/src/googletest/include/gtest/internal/gtest-port.h:1646:32: note: mutex acquired here
1646 | GTEST_CHECK_POSIX_SUCCESS_(pthread_mutex_lock(&mutex_));
| ^
../../third_party/googletest/src/googletest/include/gtest/internal/gtest-port.h:1658:32: warning: releasing mutex 'mutex_' that was not held [-Wthread-safety-analysis]
1658 | GTEST_CHECK_POSIX_SUCCESS_(pthread_mutex_unlock(&mutex_));
| ^
2 warnings generated.
[191/2933] CXX obj/torque_base/types.o
[192/2933] CXX obj/test/unittests/cppgc_unittests_sources/member-unittest.o
In file included from ../../test/unittests/heap/cppgc/member-unittest.cc:14:
In file included from ../../test/unittests/heap/cppgc/tests.h:13:
In file included from ../../testing/gtest/include/gtest/gtest.h:10:
In file included from ../../third_party/googletest/src/googletest/include/gtest/gtest.h:62:
In file included from ../../third_party/googletest/src/googletest/include/gtest/internal/gtest-internal.h:40:
../../third_party/googletest/src/googletest/include/gtest/internal/gtest-port.h:1649:3: warning: mutex 'mutex_' is still held at the end of function [-Wthread-safety-analysis]
1649 | }
| ^
../../third_party/googletest/src/googletest/include/gtest/internal/gtest-port.h:1646:32: note: mutex acquired here
1646 | GTEST_CHECK_POSIX_SUCCESS_(pthread_mutex_lock(&mutex_));
| ^
../../third_party/googletest/src/googletest/include/gtest/internal/gtest-port.h:1658:32: warning: releasing mutex 'mutex_' that was not held [-Wthread-safety-analysis]
1658 | GTEST_CHECK_POSIX_SUCCESS_(pthread_mutex_unlock(&mutex_));
| ^
2 warnings generated.
[193/2933] CXX obj/torque_base/implementation-visitor.o
[194/2933] CXX obj/torque_base/torque-parser.o
ninja: build stopped: subcommand failed.
gn gen out.gn/freebsd_64 --args="v8_monolithic=true is_debug=false v8_static_library=true is_component_build=false is_clang=true use_sysroot=false treat_warnings_as_errors=false clang_use_chrome_plugins=false use_lld=true use_custom_libcxx=false v8_use_external_startup_data=false is_component_build=false"
Error (ninja): 1
---------------------------------------------
build branch: master
---------------------------------------------
---------------------------------------------
build modules: server
---------------------------------------------
Error (./make.py): 1
*** Error code 1
Stop.
make: stopped making "build" in /usr/ports/www/onlyoffice-documentserver