[package - 140releng-armv7-quarterly][games/ivan] Failed for ivan-0.59_1 in build

From: <pkg-fallout_at_FreeBSD.org>
Date: Thu, 21 Mar 2024 03:41:35 UTC
You are receiving this mail as a port that you maintain
is failing to build on the FreeBSD package build server.
Please investigate the failure and submit a PR to fix
build.

Maintainer:     amdmi3@FreeBSD.org
Log URL:        https://pkg-status.freebsd.org/ampere1/data/140releng-armv7-quarterly/a9efba85d3b9/logs/ivan-0.59_1.log
Build URL:      https://pkg-status.freebsd.org/ampere1/build.html?mastername=140releng-armv7-quarterly&build=a9efba85d3b9
Log:

=>> Building games/ivan
build started at Thu Mar 21 03:41:03 UTC 2024
port directory: /usr/ports/games/ivan
package name: ivan-0.59_1
building for: FreeBSD 140releng-armv7-quarterly-job-02 14.0-RELEASE-p5 FreeBSD 14.0-RELEASE-p5 1400097 arm
maintained by: amdmi3@FreeBSD.org
Makefile datestamp: -rw-r--r--  1 root wheel 754 Jan 16 01:02 /usr/ports/games/ivan/Makefile
Ports top last git commit: a9efba85d
Ports top unclean checkout: no
Port dir last git commit: 72cbe1a32
Port dir unclean checkout: no
Poudriere version: poudriere-git-3.4.1-1-g1e9f97d6
Host OSVERSION: 1500006
Jail OSVERSION: 1400097
Job Id: 02

---Begin Environment---
SHELL=/bin/sh
OSVERSION=1400097
UNAME_v=FreeBSD 14.0-RELEASE-p5 1400097
UNAME_r=14.0-RELEASE-p5
BLOCKSIZE=K
MAIL=/var/mail/root
MM_CHARSET=UTF-8
LANG=C.UTF-8
STATUS=1
HOME=/root
PATH=/sbin:/bin:/usr/sbin:/usr/bin:/usr/local/sbin:/usr/local/bin:/root/bin
MAKE_OBJDIR_CHECK_WRITABLE=0
LOCALBASE=/usr/local
USER=root
POUDRIERE_NAME=poudriere-git
LIBEXECPREFIX=/usr/local/libexec/poudriere
POUDRIERE_VERSION=3.4.1-1-g1e9f97d6
MASTERMNT=/usr/local/poudriere/data/.m/140releng-armv7-quarterly/ref
LC_COLLATE=C
POUDRIERE_BUILD_TYPE=bulk
PACKAGE_BUILDING=yes
SAVED_TERM=
OUTPUT_REDIRECTED_STDERR=4
OUTPUT_REDIRECTED=1
PWD=/usr/local/poudriere/data/.m/140releng-armv7-quarterly/02/.p
OUTPUT_REDIRECTED_STDOUT=3
P_PORTS_FEATURES=FLAVORS SUBPACKAGES SELECTED_OPTIONS
MASTERNAME=140releng-armv7-quarterly
SCRIPTPREFIX=/usr/local/share/poudriere
SCRIPTNAME=bulk.sh
OLDPWD=/usr/local/poudriere/data/.m/140releng-armv7-quarterly/ref/.p/pool
POUDRIERE_PKGNAME=poudriere-git-3.4.1-1-g1e9f97d6
SCRIPTPATH=/usr/local/share/poudriere/bulk.sh
POUDRIEREPATH=/usr/local/bin/poudriere
---End Environment---

---Begin Poudriere Port Flags/Env---
PORT_FLAGS=
PKGENV=
FLAVOR=
MAKE_ARGS=
---End Poudriere Port Flags/Env---

---Begin OPTIONS List---
===> The following configuration options are available for ivan-0.59_1:
     DOCS=on: Build and/or install documentation
     WIZARD=off: Enable Wizard mode
===> Use 'make config' to modify these settings
---End OPTIONS List---

--MAINTAINER--
amdmi3@FreeBSD.org
--End MAINTAINER--

--CONFIGURE_ARGS--

--End CONFIGURE_ARGS--

--CONFIGURE_ENV--
PKG_CONFIG=pkgconf SDL2_CONFIG=/usr/local/bin/sdl2-config XDG_DATA_HOME=/wrkdirs/usr/ports/games/ivan/work  XDG_CONFIG_HOME=/wrkdirs/usr/ports/games/ivan/work  XDG_CACHE_HOME=/wrkdirs/usr/ports/games/ivan/work/.cache  HOME=/wrkdirs/usr/ports/games/ivan/work TMPDIR="/tmp" PATH=/wrkdirs/usr/ports/games/ivan/work/.bin:/sbin:/bin:/usr/sbin:/usr/bin:/usr/local/sbin:/usr/local/bin:/root/bin PKG_CONFIG_LIBDIR=/wrkdirs/usr/ports/games/ivan/work/.pkgconfig:/usr/local/libdata/pkgconfig:/usr/local/share/pkgconfig:/usr/libdata/pkgconfig SHELL=/bin/sh CONFIG_SHELL=/bin/sh
--End CONFIGURE_ENV--

--MAKE_ENV--
NINJA_STATUS="[%p %s/%t] " SDL2_CONFIG=/usr/local/bin/sdl2-config XDG_DATA_HOME=/wrkdirs/usr/ports/games/ivan/work  XDG_CONFIG_HOME=/wrkdirs/usr/ports/games/ivan/work  XDG_CACHE_HOME=/wrkdirs/usr/ports/games/ivan/work/.cache  HOME=/wrkdirs/usr/ports/games/ivan/work TMPDIR="/tmp" PATH=/wrkdirs/usr/ports/games/ivan/work/.bin:/sbin:/bin:/usr/sbin:/usr/bin:/usr/local/sbin:/usr/local/bin:/root/bin PKG_CONFIG_LIBDIR=/wrkdirs/usr/ports/games/ivan/work/.pkgconfig:/usr/local/libdata/pkgconfig:/usr/local/share/pkgconfig:/usr/libdata/pkgconfig MK_DEBUG_FILES=no MK_KERNEL_SYMBOLS=no SHELL=/bin/sh NO_LINT=YES DESTDIR=/wrkdirs/usr/ports/games/ivan/work/stage PREFIX=/usr/local  LOCALBASE=/usr/local  CC="cc" CFLAGS="-O2 -pipe  -fstack-protector-strong -fno-strict-aliasing "  CPP="cpp" CPPFLAGS=""  LDFLAGS=" -fstack-protector-strong " LIBS=""  CXX="c++" CXXFLAGS="-O2 -pipe -fstack-protector-strong -fno-strict-aliasing  "  MANPREFIX="/usr/local" BSD_INSTALL_PROGRAM="install  -s -m 555"  BSD_I
NSTALL_LIB="install  -s -m 0644"  BSD_INSTALL_SCRIPT="install  -m 555"  BSD_INSTALL_DATA="install  -m 0644"  BSD_INSTALL_MAN="install  -m 444"
--End MAKE_ENV--

--PLIST_SUB--
PORTDOCS="" CMAKE_BUILD_TYPE="release" OSREL=14.0 PREFIX=%D LOCALBASE=/usr/local  RESETPREFIX=/usr/local LIB32DIR=lib DOCSDIR="share/doc/ivan"  EXAMPLESDIR="share/examples/ivan"  DATADIR="share/ivan"  WWWDIR="www/ivan"  ETCDIR="etc/ivan"
--End PLIST_SUB--

--SUB_LIST--
 PREFIX=/usr/local LOCALBASE=/usr/local  DATADIR=/usr/local/share/ivan DOCSDIR=/usr/local/share/doc/ivan EXAMPLESDIR=/usr/local/share/examples/ivan  WWWDIR=/usr/local/www/ivan ETCDIR=/usr/local/etc/ivan
--End SUB_LIST--

---Begin make.conf---
USE_PACKAGE_DEPENDS=yes
BATCH=yes
WRKDIRPREFIX=/wrkdirs
PORTSDIR=/usr/ports
PACKAGES=/packages
DISTDIR=/distfiles
PACKAGE_BUILDING=yes
PACKAGE_BUILDING_FLAVORS=yes
####  ####
# XXX: We really need this but cannot use it while 'make checksum' does not
# try the next mirror on checksum failure.  It currently retries the same
# failed mirror and then fails rather then trying another.  It *does*
# try the next if the size is mismatched though.
#MASTER_SITE_FREEBSD=yes
# Build ALLOW_MAKE_JOBS_PACKAGES with 3 jobs
MAKE_JOBS_NUMBER=3
#### Misc Poudriere ####
.include "/etc/make.conf.ports_env"
GID=0
UID=0
---End make.conf---
--Resource limits--
cpu time               (seconds, -t)  unlimited
file size           (512-blocks, -f)  unlimited
data seg size           (kbytes, -d)  524288
stack size              (kbytes, -s)  65536
core file size      (512-blocks, -c)  unlimited
max memory size         (kbytes, -m)  unlimited
locked memory           (kbytes, -l)  unlimited
max user processes              (-u)  89999
open files                      (-n)  8192
virtual mem size        (kbytes, -v)  unlimited
swap limit              (kbytes, -w)  unlimited
socket buffer size       (bytes, -b)  unlimited
pseudo-terminals                (-p)  unlimited
kqueues                         (-k)  unlimited
umtx shared locks               (-o)  unlimited
--End resource limits--
=======================<phase: check-sanity   >============================
===== env: NO_DEPENDS=yes USER=root UID=0 GID=0
===>  License GPLv2+ accepted by the user
===========================================================================
=======================<phase: pkg-depends    >============================
===== env: USE_PACKAGE_DEPENDS_ONLY=1 USER=root UID=0 GID=0
===>   ivan-0.59_1 depends on file: /usr/local/sbin/pkg - not found
===>   Installing existing package /packages/All/pkg-1.20.9.pkg
[140releng-armv7-quarterly-job-02] Installing pkg-1.20.9...
[140releng-armv7-quarterly-job-02] Extracting pkg-1.20.9: .......... done
===>   ivan-0.59_1 depends on file: /usr/local/sbin/pkg - found
===>   Returning to build of ivan-0.59_1
===========================================================================
=======================<phase: fetch-depends  >============================
===== env: USE_PACKAGE_DEPENDS_ONLY=1 USER=root UID=0 GID=0
===========================================================================
=======================<phase: fetch          >============================
===== env: NO_DEPENDS=yes USER=root UID=0 GID=0
===>  License GPLv2+ accepted by the user
===> Fetching all distfiles required by ivan-0.59_1 for building
===========================================================================
=======================<phase: checksum       >============================
===== env: NO_DEPENDS=yes USER=root UID=0 GID=0
===>  License GPLv2+ accepted by the user
===> Fetching all distfiles required by ivan-0.59_1 for building
=> SHA256 Checksum OK for Attnam-ivan-0.59-v059_GH0.tar.gz.
===========================================================================
=======================<phase: extract-depends>============================
===== env: USE_PACKAGE_DEPENDS_ONLY=1 USER=root UID=0 GID=0
===========================================================================
=======================<phase: extract        >============================
===== env: NO_DEPENDS=yes USER=root UID=0 GID=0
===>  License GPLv2+ accepted by the user
===> Fetching all distfiles required by ivan-0.59_1 for building
===>  Extracting for ivan-0.59_1
=> SHA256 Checksum OK for Attnam-ivan-0.59-v059_GH0.tar.gz.
===========================================================================
=======================<phase: patch-depends  >============================
===== env: USE_PACKAGE_DEPENDS_ONLY=1 USER=root UID=0 GID=0
===========================================================================
=======================<phase: patch          >============================
===== env: NO_DEPENDS=yes USER=root UID=0 GID=0
===>  Patching for ivan-0.59_1
===>  Applying FreeBSD patches for ivan-0.59_1 from /usr/ports/games/ivan/files
===========================================================================
=======================<phase: build-depends  >============================
===== env: USE_PACKAGE_DEPENDS_ONLY=1 USER=root UID=0 GID=0
===>   ivan-0.59_1 depends on file: /usr/local/bin/cmake - not found
===>   Installing existing package /packages/All/cmake-core-3.28.1.pkg
[140releng-armv7-quarterly-job-02] Installing cmake-core-3.28.1...
[140releng-armv7-quarterly-job-02] `-- Installing expat-2.5.0...
[140releng-armv7-quarterly-job-02] `-- Extracting expat-2.5.0: .......... done
[140releng-armv7-quarterly-job-02] `-- Installing jsoncpp-1.9.5...
[140releng-armv7-quarterly-job-02] `-- Extracting jsoncpp-1.9.5: .......... done
[140releng-armv7-quarterly-job-02] `-- Installing libuv-1.47.0...
[140releng-armv7-quarterly-job-02] `-- Extracting libuv-1.47.0: .......... done
[140releng-armv7-quarterly-job-02] `-- Installing rhash-1.4.4...
[140releng-armv7-quarterly-job-02] |   `-- Installing gettext-runtime-0.22.3...
[140releng-armv7-quarterly-job-02] |   | `-- Installing indexinfo-0.3.1...
[140releng-armv7-quarterly-job-02] |   | `-- Extracting indexinfo-0.3.1: .... done
[140releng-armv7-quarterly-job-02] |   `-- Extracting gettext-runtime-0.22.3: .......... done
[140releng-armv7-quarterly-job-02] `-- Extracting rhash-1.4.4: .......... done
[140releng-armv7-quarterly-job-02] Extracting cmake-core-3.28.1: .......... done
===>   ivan-0.59_1 depends on file: /usr/local/bin/cmake - found
===>   Returning to build of ivan-0.59_1
===>   ivan-0.59_1 depends on executable: ninja - not found
===>   Installing existing package /packages/All/ninja-1.11.1,2.pkg
[140releng-armv7-quarterly-job-02] Installing ninja-1.11.1,2...
[140releng-armv7-quarterly-job-02] `-- Installing python39-3.9.18...
<snip>
-- Found SDL2: /usr/local/lib/libSDL2main.a;/usr/local/lib/libSDL2.so;-lpthread  
-- Checking for module 'libpng'
--   Found libpng, version 1.6.40
-- Configuring done (2.1s)
-- Generating done (0.0s)
CMake Warning:
  Manually-specified variables were not used by the project:

    CMAKE_COLOR_MAKEFILE
    CMAKE_CXX_FLAGS_DEBUG
    CMAKE_C_FLAGS_DEBUG
    CMAKE_C_FLAGS_RELEASE
    CMAKE_MODULE_LINKER_FLAGS
    CMAKE_SHARED_LINKER_FLAGS
    CMAKE_VERBOSE_MAKEFILE
    FETCHCONTENT_FULLY_DISCONNECTED


-- Build files have been written to: /wrkdirs/usr/ports/games/ivan/work/.build
===========================================================================
=======================<phase: build          >============================
===== env: NO_DEPENDS=yes USER=root UID=0 GID=0
===>  Building for ivan-0.59_1
[  1% 3/62] /usr/bin/c++ -DDATADIR=\"/usr/local/share\" -DIVAN_VERSION=\"0.59\" -DUNIX -DUSE_SDL -I/wrkdirs/usr/ports/games/ivan/work/ivan-059/FeLib/Include -I/wrkdirs/usr/ports/games/ivan/work/ivan-059/FeLib/../xbrzscale -I/wrkdirs/usr/ports/games/ivan/work/ivan-059/FeLib/../xbrzscale/xbrz -isystem /usr/local/include/SDL2 -isystem /usr/local/include/libpng16 -isystem /usr/local/include -std=c++11 -O2 -pipe -fstack-protector-strong -fno-strict-aliasing -O2 -pipe -fstack-protector-strong -fno-strict-aliasing   -DNDEBUG -MD -MT FeLib/CMakeFiles/FeLib.dir/Source/error.cpp.o -MF FeLib/CMakeFiles/FeLib.dir/Source/error.cpp.o.d -o FeLib/CMakeFiles/FeLib.dir/Source/error.cpp.o -c /wrkdirs/usr/ports/games/ivan/work/ivan-059/FeLib/Source/error.cpp
[  3% 4/62] /usr/bin/c++ -DDATADIR=\"/usr/local/share\" -DIVAN_VERSION=\"0.59\" -DUNIX -DUSE_SDL -I/wrkdirs/usr/ports/games/ivan/work/ivan-059/FeLib/Include -I/wrkdirs/usr/ports/games/ivan/work/ivan-059/FeLib/../xbrzscale -I/wrkdirs/usr/ports/games/ivan/work/ivan-059/FeLib/../xbrzscale/xbrz -isystem /usr/local/include/SDL2 -isystem /usr/local/include/libpng16 -isystem /usr/local/include -std=c++11 -O2 -pipe -fstack-protector-strong -fno-strict-aliasing -O2 -pipe -fstack-protector-strong -fno-strict-aliasing   -DNDEBUG -MD -MT FeLib/CMakeFiles/FeLib.dir/Source/config.cpp.o -MF FeLib/CMakeFiles/FeLib.dir/Source/config.cpp.o.d -o FeLib/CMakeFiles/FeLib.dir/Source/config.cpp.o -c /wrkdirs/usr/ports/games/ivan/work/ivan-059/FeLib/Source/config.cpp
[  4% 5/62] /usr/bin/c++ -DDATADIR=\"/usr/local/share\" -DIVAN_VERSION=\"0.59\" -DUNIX -DUSE_SDL -I/wrkdirs/usr/ports/games/ivan/work/ivan-059/FeLib/Include -I/wrkdirs/usr/ports/games/ivan/work/ivan-059/FeLib/../xbrzscale -I/wrkdirs/usr/ports/games/ivan/work/ivan-059/FeLib/../xbrzscale/xbrz -isystem /usr/local/include/SDL2 -isystem /usr/local/include/libpng16 -isystem /usr/local/include -std=c++11 -O2 -pipe -fstack-protector-strong -fno-strict-aliasing -O2 -pipe -fstack-protector-strong -fno-strict-aliasing   -DNDEBUG -MD -MT FeLib/CMakeFiles/FeLib.dir/Source/bitmap.cpp.o -MF FeLib/CMakeFiles/FeLib.dir/Source/bitmap.cpp.o.d -o FeLib/CMakeFiles/FeLib.dir/Source/bitmap.cpp.o -c /wrkdirs/usr/ports/games/ivan/work/ivan-059/FeLib/Source/bitmap.cpp
[  6% 6/62] /usr/bin/c++ -DDATADIR=\"/usr/local/share\" -DIVAN_VERSION=\"0.59\" -DUNIX -DUSE_SDL -I/wrkdirs/usr/ports/games/ivan/work/ivan-059/FeLib/Include -I/wrkdirs/usr/ports/games/ivan/work/ivan-059/FeLib/../xbrzscale -I/wrkdirs/usr/ports/games/ivan/work/ivan-059/FeLib/../xbrzscale/xbrz -isystem /usr/local/include/SDL2 -isystem /usr/local/include/libpng16 -isystem /usr/local/include -std=c++11 -O2 -pipe -fstack-protector-strong -fno-strict-aliasing -O2 -pipe -fstack-protector-strong -fno-strict-aliasing   -DNDEBUG -MD -MT FeLib/CMakeFiles/FeLib.dir/Source/febot.cpp.o -MF FeLib/CMakeFiles/FeLib.dir/Source/febot.cpp.o.d -o FeLib/CMakeFiles/FeLib.dir/Source/febot.cpp.o -c /wrkdirs/usr/ports/games/ivan/work/ivan-059/FeLib/Source/febot.cpp
[  8% 7/62] /usr/bin/c++ -DDATADIR=\"/usr/local/share\" -DIVAN_VERSION=\"0.59\" -DUNIX -DUSE_SDL -I/wrkdirs/usr/ports/games/ivan/work/ivan-059/FeLib/Include -I/wrkdirs/usr/ports/games/ivan/work/ivan-059/FeLib/../xbrzscale -I/wrkdirs/usr/ports/games/ivan/work/ivan-059/FeLib/../xbrzscale/xbrz -isystem /usr/local/include/SDL2 -isystem /usr/local/include/libpng16 -isystem /usr/local/include -std=c++11 -O2 -pipe -fstack-protector-strong -fno-strict-aliasing -O2 -pipe -fstack-protector-strong -fno-strict-aliasing   -DNDEBUG -MD -MT FeLib/CMakeFiles/FeLib.dir/Source/femath.cpp.o -MF FeLib/CMakeFiles/FeLib.dir/Source/femath.cpp.o.d -o FeLib/CMakeFiles/FeLib.dir/Source/femath.cpp.o -c /wrkdirs/usr/ports/games/ivan/work/ivan-059/FeLib/Source/femath.cpp
[  9% 8/62] /usr/bin/c++ -DDATADIR=\"/usr/local/share\" -DIVAN_VERSION=\"0.59\" -DUNIX -DUSE_SDL -I/wrkdirs/usr/ports/games/ivan/work/ivan-059/FeLib/Include -I/wrkdirs/usr/ports/games/ivan/work/ivan-059/FeLib/../xbrzscale -I/wrkdirs/usr/ports/games/ivan/work/ivan-059/FeLib/../xbrzscale/xbrz -isystem /usr/local/include/SDL2 -isystem /usr/local/include/libpng16 -isystem /usr/local/include -std=c++11 -O2 -pipe -fstack-protector-strong -fno-strict-aliasing -O2 -pipe -fstack-protector-strong -fno-strict-aliasing   -DNDEBUG -MD -MT FeLib/CMakeFiles/FeLib.dir/Source/festring.cpp.o -MF FeLib/CMakeFiles/FeLib.dir/Source/festring.cpp.o.d -o FeLib/CMakeFiles/FeLib.dir/Source/festring.cpp.o -c /wrkdirs/usr/ports/games/ivan/work/ivan-059/FeLib/Source/festring.cpp
[ 11% 9/62] /usr/bin/c++ -DDATADIR=\"/usr/local/share\" -DIVAN_VERSION=\"0.59\" -DUNIX -DUSE_SDL -I/wrkdirs/usr/ports/games/ivan/work/ivan-059/FeLib/Include -I/wrkdirs/usr/ports/games/ivan/work/ivan-059/FeLib/../xbrzscale -I/wrkdirs/usr/ports/games/ivan/work/ivan-059/FeLib/../xbrzscale/xbrz -isystem /usr/local/include/SDL2 -isystem /usr/local/include/libpng16 -isystem /usr/local/include -std=c++11 -O2 -pipe -fstack-protector-strong -fno-strict-aliasing -O2 -pipe -fstack-protector-strong -fno-strict-aliasing   -DNDEBUG -MD -MT FeLib/CMakeFiles/FeLib.dir/Source/feio.cpp.o -MF FeLib/CMakeFiles/FeLib.dir/Source/feio.cpp.o.d -o FeLib/CMakeFiles/FeLib.dir/Source/feio.cpp.o -c /wrkdirs/usr/ports/games/ivan/work/ivan-059/FeLib/Source/feio.cpp
[ 12% 10/62] /usr/bin/c++ -DDATADIR=\"/usr/local/share\" -DIVAN_VERSION=\"0.59\" -DUNIX -DUSE_SDL -I/wrkdirs/usr/ports/games/ivan/work/ivan-059/FeLib/Include -I/wrkdirs/usr/ports/games/ivan/work/ivan-059/FeLib/../xbrzscale -I/wrkdirs/usr/ports/games/ivan/work/ivan-059/FeLib/../xbrzscale/xbrz -isystem /usr/local/include/SDL2 -isystem /usr/local/include/libpng16 -isystem /usr/local/include -std=c++11 -O2 -pipe -fstack-protector-strong -fno-strict-aliasing -O2 -pipe -fstack-protector-strong -fno-strict-aliasing   -DNDEBUG -MD -MT FeLib/CMakeFiles/FeLib.dir/Source/felist.cpp.o -MF FeLib/CMakeFiles/FeLib.dir/Source/felist.cpp.o.d -o FeLib/CMakeFiles/FeLib.dir/Source/felist.cpp.o -c /wrkdirs/usr/ports/games/ivan/work/ivan-059/FeLib/Source/felist.cpp
[ 14% 11/62] /usr/bin/c++ -DDATADIR=\"/usr/local/share\" -DIVAN_VERSION=\"0.59\" -DUNIX -DUSE_SDL -I/wrkdirs/usr/ports/games/ivan/work/ivan-059/FeLib/Include -I/wrkdirs/usr/ports/games/ivan/work/ivan-059/FeLib/../xbrzscale -I/wrkdirs/usr/ports/games/ivan/work/ivan-059/FeLib/../xbrzscale/xbrz -isystem /usr/local/include/SDL2 -isystem /usr/local/include/libpng16 -isystem /usr/local/include -std=c++11 -O2 -pipe -fstack-protector-strong -fno-strict-aliasing -O2 -pipe -fstack-protector-strong -fno-strict-aliasing   -DNDEBUG -MD -MT FeLib/CMakeFiles/FeLib.dir/Source/fetime.cpp.o -MF FeLib/CMakeFiles/FeLib.dir/Source/fetime.cpp.o.d -o FeLib/CMakeFiles/FeLib.dir/Source/fetime.cpp.o -c /wrkdirs/usr/ports/games/ivan/work/ivan-059/FeLib/Source/fetime.cpp
[ 16% 12/62] /usr/bin/c++ -DDATADIR=\"/usr/local/share\" -DIVAN_VERSION=\"0.59\" -DUNIX -DUSE_SDL -I/wrkdirs/usr/ports/games/ivan/work/ivan-059/FeLib/Include -I/wrkdirs/usr/ports/games/ivan/work/ivan-059/FeLib/../xbrzscale -I/wrkdirs/usr/ports/games/ivan/work/ivan-059/FeLib/../xbrzscale/xbrz -isystem /usr/local/include/SDL2 -isystem /usr/local/include/libpng16 -isystem /usr/local/include -std=c++11 -O2 -pipe -fstack-protector-strong -fno-strict-aliasing -O2 -pipe -fstack-protector-strong -fno-strict-aliasing   -DNDEBUG -MD -MT FeLib/CMakeFiles/FeLib.dir/Source/hscore.cpp.o -MF FeLib/CMakeFiles/FeLib.dir/Source/hscore.cpp.o.d -o FeLib/CMakeFiles/FeLib.dir/Source/hscore.cpp.o -c /wrkdirs/usr/ports/games/ivan/work/ivan-059/FeLib/Source/hscore.cpp
FAILED: FeLib/CMakeFiles/FeLib.dir/Source/hscore.cpp.o 
/usr/bin/c++ -DDATADIR=\"/usr/local/share\" -DIVAN_VERSION=\"0.59\" -DUNIX -DUSE_SDL -I/wrkdirs/usr/ports/games/ivan/work/ivan-059/FeLib/Include -I/wrkdirs/usr/ports/games/ivan/work/ivan-059/FeLib/../xbrzscale -I/wrkdirs/usr/ports/games/ivan/work/ivan-059/FeLib/../xbrzscale/xbrz -isystem /usr/local/include/SDL2 -isystem /usr/local/include/libpng16 -isystem /usr/local/include -std=c++11 -O2 -pipe -fstack-protector-strong -fno-strict-aliasing -O2 -pipe -fstack-protector-strong -fno-strict-aliasing   -DNDEBUG -MD -MT FeLib/CMakeFiles/FeLib.dir/Source/hscore.cpp.o -MF FeLib/CMakeFiles/FeLib.dir/Source/hscore.cpp.o.d -o FeLib/CMakeFiles/FeLib.dir/Source/hscore.cpp.o -c /wrkdirs/usr/ports/games/ivan/work/ivan-059/FeLib/Source/hscore.cpp
In file included from /wrkdirs/usr/ports/games/ivan/work/ivan-059/FeLib/Source/hscore.cpp:14:
/wrkdirs/usr/ports/games/ivan/work/ivan-059/FeLib/Include/save.h:269:14: error: use of overloaded operator '<<' is ambiguous (with operand types 'outputfile' and 'const value_type' (aka 'const long long'))
    SaveFile << Vector[c];
    ~~~~~~~~ ^  ~~~~~~~~~
/wrkdirs/usr/ports/games/ivan/work/ivan-059/FeLib/Source/hscore.cpp:112:22: note: in instantiation of function template specialization 'operator<<<long long>' requested here
            << Entry << Time << RandomID << LastAdd << CheckSum;
                     ^
/wrkdirs/usr/ports/games/ivan/work/ivan-059/FeLib/Include/save.h:168:20: note: candidate function
inline outputfile& operator<<(outputfile& SaveFile, truth Value)
                   ^
/wrkdirs/usr/ports/games/ivan/work/ivan-059/FeLib/Include/save.h:180:20: note: candidate function
inline outputfile& operator<<(outputfile& SaveFile, char Value)
                   ^
/wrkdirs/usr/ports/games/ivan/work/ivan-059/FeLib/Include/save.h:192:20: note: candidate function
inline outputfile& operator<<(outputfile& SaveFile, uchar Value)
                   ^
/wrkdirs/usr/ports/games/ivan/work/ivan-059/FeLib/Include/save.h:204:20: note: candidate function
inline outputfile& operator<<(outputfile& SaveFile, short Value)
                   ^
/wrkdirs/usr/ports/games/ivan/work/ivan-059/FeLib/Include/save.h:218:20: note: candidate function
inline outputfile& operator<<(outputfile& SaveFile, ushort Value)
                   ^
/wrkdirs/usr/ports/games/ivan/work/ivan-059/FeLib/Include/save.h:232:1: note: candidate function
RAW_SAVE_LOAD(long)
^
/wrkdirs/usr/ports/games/ivan/work/ivan-059/FeLib/Include/save.h:29:20: note: expanded from macro 'RAW_SAVE_LOAD'
inline outputfile& operator<<(outputfile& SaveFile, type Value)\
                   ^
/wrkdirs/usr/ports/games/ivan/work/ivan-059/FeLib/Include/save.h:233:1: note: candidate function
RAW_SAVE_LOAD(ulong)
^
/wrkdirs/usr/ports/games/ivan/work/ivan-059/FeLib/Include/save.h:29:20: note: expanded from macro 'RAW_SAVE_LOAD'
inline outputfile& operator<<(outputfile& SaveFile, type Value)\
                   ^
/wrkdirs/usr/ports/games/ivan/work/ivan-059/FeLib/Include/save.h:234:1: note: candidate function
RAW_SAVE_LOAD(int)
^
/wrkdirs/usr/ports/games/ivan/work/ivan-059/FeLib/Include/save.h:29:20: note: expanded from macro 'RAW_SAVE_LOAD'
inline outputfile& operator<<(outputfile& SaveFile, type Value)\
                   ^
/wrkdirs/usr/ports/games/ivan/work/ivan-059/FeLib/Include/save.h:235:1: note: candidate function
RAW_SAVE_LOAD(uint)
^
/wrkdirs/usr/ports/games/ivan/work/ivan-059/FeLib/Include/save.h:29:20: note: expanded from macro 'RAW_SAVE_LOAD'
inline outputfile& operator<<(outputfile& SaveFile, type Value)\
                   ^
/wrkdirs/usr/ports/games/ivan/work/ivan-059/FeLib/Include/save.h:236:1: note: candidate function
RAW_SAVE_LOAD(double)
^
/wrkdirs/usr/ports/games/ivan/work/ivan-059/FeLib/Include/save.h:29:20: note: expanded from macro 'RAW_SAVE_LOAD'
inline outputfile& operator<<(outputfile& SaveFile, type Value)\
                   ^
/wrkdirs/usr/ports/games/ivan/work/ivan-059/FeLib/Include/save.h:281:14: error: invalid operands to binary expression ('inputfile' and 'value_type' (aka 'long long'))
    SaveFile >> Vector[c];
    ~~~~~~~~ ^  ~~~~~~~~~
/wrkdirs/usr/ports/games/ivan/work/ivan-059/FeLib/Source/hscore.cpp:134:31: note: in instantiation of function template specialization 'operator>><long long>' requested here
  HighScore >> Score >> Entry >> Time >> RandomID >> LastAdd;
                              ^
/wrkdirs/usr/ports/games/ivan/work/ivan-059/FeLib/Include/femath.h:83:12: note: candidate function not viable: no known conversion from 'value_type' (aka 'long long') to 'interval &' for 2nd argument
inputfile& operator>>(inputfile&, interval&);
           ^
/wrkdirs/usr/ports/games/ivan/work/ivan-059/FeLib/Include/femath.h:85:12: note: candidate function not viable: no known conversion from 'value_type' (aka 'long long') to 'region &' for 2nd argument
inputfile& operator>>(inputfile&, region&);
           ^
/wrkdirs/usr/ports/games/ivan/work/ivan-059/FeLib/Include/save.h:174:19: note: candidate function not viable: no known conversion from 'value_type' (aka 'long long') to 'truth &' (aka 'bool &') for 2nd argument
inline inputfile& operator>>(inputfile& SaveFile, truth& Value)
                  ^
/wrkdirs/usr/ports/games/ivan/work/ivan-059/FeLib/Include/save.h:186:19: note: candidate function not viable: no known conversion from 'value_type' (aka 'long long') to 'char &' for 2nd argument
inline inputfile& operator>>(inputfile& SaveFile, char& Value)
                  ^
/wrkdirs/usr/ports/games/ivan/work/ivan-059/FeLib/Include/save.h:198:19: note: candidate function not viable: no known conversion from 'value_type' (aka 'long long') to 'uchar &' (aka 'unsigned char &') for 2nd argument
inline inputfile& operator>>(inputfile& SaveFile, uchar& Value)
                  ^
/wrkdirs/usr/ports/games/ivan/work/ivan-059/FeLib/Include/save.h:211:19: note: candidate function not viable: no known conversion from 'value_type' (aka 'long long') to 'short &' for 2nd argument
inline inputfile& operator>>(inputfile& SaveFile, short& Value)
                  ^
/wrkdirs/usr/ports/games/ivan/work/ivan-059/FeLib/Include/save.h:225:19: note: candidate function not viable: no known conversion from 'value_type' (aka 'long long') to 'ushort &' (aka 'unsigned short &') for 2nd argument
inline inputfile& operator>>(inputfile& SaveFile, ushort& Value)
                  ^
/wrkdirs/usr/ports/games/ivan/work/ivan-059/FeLib/Include/save.h:232:1: note: candidate function not viable: no known conversion from 'value_type' (aka 'long long') to 'long &' for 2nd argument
RAW_SAVE_LOAD(long)
^
/wrkdirs/usr/ports/games/ivan/work/ivan-059/FeLib/Include/save.h:35:19: note: expanded from macro 'RAW_SAVE_LOAD'
inline inputfile& operator>>(inputfile& SaveFile, type& Value)\
                  ^
/wrkdirs/usr/ports/games/ivan/work/ivan-059/FeLib/Include/save.h:233:1: note: candidate function not viable: no known conversion from 'value_type' (aka 'long long') to 'ulong &' (aka 'unsigned long &') for 2nd argument
RAW_SAVE_LOAD(ulong)
^
/wrkdirs/usr/ports/games/ivan/work/ivan-059/FeLib/Include/save.h:35:19: note: expanded from macro 'RAW_SAVE_LOAD'
inline inputfile& operator>>(inputfile& SaveFile, type& Value)\
                  ^
/wrkdirs/usr/ports/games/ivan/work/ivan-059/FeLib/Include/save.h:234:1: note: candidate function not viable: no known conversion from 'value_type' (aka 'long long') to 'int &' for 2nd argument
RAW_SAVE_LOAD(int)
^
/wrkdirs/usr/ports/games/ivan/work/ivan-059/FeLib/Include/save.h:35:19: note: expanded from macro 'RAW_SAVE_LOAD'
inline inputfile& operator>>(inputfile& SaveFile, type& Value)\
                  ^
/wrkdirs/usr/ports/games/ivan/work/ivan-059/FeLib/Include/save.h:235:1: note: candidate function not viable: no known conversion from 'value_type' (aka 'long long') to 'uint &' (aka 'unsigned int &') for 2nd argument
RAW_SAVE_LOAD(uint)
^
/wrkdirs/usr/ports/games/ivan/work/ivan-059/FeLib/Include/save.h:35:19: note: expanded from macro 'RAW_SAVE_LOAD'
inline inputfile& operator>>(inputfile& SaveFile, type& Value)\
                  ^
/wrkdirs/usr/ports/games/ivan/work/ivan-059/FeLib/Include/save.h:236:1: note: candidate function not viable: no known conversion from 'value_type' (aka 'long long') to 'double &' for 2nd argument
RAW_SAVE_LOAD(double)
^
/wrkdirs/usr/ports/games/ivan/work/ivan-059/FeLib/Include/save.h:35:19: note: expanded from macro 'RAW_SAVE_LOAD'
inline inputfile& operator>>(inputfile& SaveFile, type& Value)\
                  ^
/wrkdirs/usr/ports/games/ivan/work/ivan-059/FeLib/Include/save.h:237:1: note: candidate function not viable: no known conversion from 'value_type' (aka 'long long') to 'packv2 &' for 2nd argument
RAW_SAVE_LOAD(packv2)
^
/wrkdirs/usr/ports/games/ivan/work/ivan-059/FeLib/Include/save.h:35:19: note: expanded from macro 'RAW_SAVE_LOAD'
inline inputfile& operator>>(inputfile& SaveFile, type& Value)\
                  ^
/wrkdirs/usr/ports/games/ivan/work/ivan-059/FeLib/Include/save.h:238:1: note: candidate function not viable: no known conversion from 'value_type' (aka 'long long') to 'v2 &' for 2nd argument
RAW_SAVE_LOAD(v2)
^
/wrkdirs/usr/ports/games/ivan/work/ivan-059/FeLib/Include/save.h:35:19: note: expanded from macro 'RAW_SAVE_LOAD'
inline inputfile& operator>>(inputfile& SaveFile, type& Value)\
                  ^
/wrkdirs/usr/ports/games/ivan/work/ivan-059/FeLib/Include/save.h:239:1: note: candidate function not viable: no known conversion from 'value_type' (aka 'long long') to 'rect &' for 2nd argument
RAW_SAVE_LOAD(rect)
^
/wrkdirs/usr/ports/games/ivan/work/ivan-059/FeLib/Include/save.h:35:19: note: expanded from macro 'RAW_SAVE_LOAD'
inline inputfile& operator>>(inputfile& SaveFile, type& Value)\
                  ^
/wrkdirs/usr/ports/games/ivan/work/ivan-059/FeLib/Include/save.h:242:12: note: candidate function not viable: no known conversion from 'value_type' (aka 'long long') to 'festring &' for 2nd argument
inputfile& operator>>(inputfile&, festring&);
           ^
/wrkdirs/usr/ports/games/ivan/work/ivan-059/FeLib/Include/save.h:244:12: note: candidate function not viable: no known conversion from 'value_type' (aka 'long long') to 'char *&' for 2nd argument
inputfile& operator>>(inputfile&, char*&);
           ^
/wrkdirs/usr/ports/games/ivan/work/ivan-059/FeLib/Include/save.h:255:19: note: candidate template ignored: could not match 'std::pair<type1, type2>' against 'value_type' (aka 'long long')
inline inputfile& operator>>(inputfile& SaveFile,
                  ^
/wrkdirs/usr/ports/games/ivan/work/ivan-059/FeLib/Include/save.h:275:19: note: candidate template ignored: could not match 'std::vector<type>' against 'value_type' (aka 'long long')
inline inputfile& operator>>(inputfile& SaveFile,
                  ^
/wrkdirs/usr/ports/games/ivan/work/ivan-059/FeLib/Include/save.h:299:19: note: candidate template ignored: could not match 'std::deque<type>' against 'value_type' (aka 'long long')
inline inputfile& operator>>(inputfile& SaveFile,
                  ^
/wrkdirs/usr/ports/games/ivan/work/ivan-059/FeLib/Include/save.h:323:19: note: candidate template ignored: could not match 'std::list<type>' against 'value_type' (aka 'long long')
inline inputfile& operator>>(inputfile& SaveFile,
                  ^
/wrkdirs/usr/ports/games/ivan/work/ivan-059/FeLib/Include/save.h:347:19: note: candidate template ignored: could not match 'std::map<type1, type2>' against 'value_type' (aka 'long long')
inline inputfile& operator>>(inputfile& SaveFile,
                  ^
/wrkdirs/usr/ports/games/ivan/work/ivan-059/FeLib/Include/save.h:379:19: note: candidate template ignored: could not match 'std::set<type>' against 'value_type' (aka 'long long')
inline inputfile& operator>>(inputfile& SaveFile,
                  ^
/wrkdirs/usr/ports/games/ivan/work/ivan-059/FeLib/Include/save.h:410:19: note: candidate template ignored: could not match 'fearray<type>' against 'value_type' (aka 'long long')
inline inputfile& operator>>(inputfile& SaveFile,
                  ^
2 errors generated.
[ 17% 12/62] /usr/bin/c++ -DDATADIR=\"/usr/local/share\" -DIVAN_VERSION=\"0.59\" -DUNIX -DUSE_SDL -I/wrkdirs/usr/ports/games/ivan/work/ivan-059/FeLib/Include -I/wrkdirs/usr/ports/games/ivan/work/ivan-059/FeLib/../xbrzscale -I/wrkdirs/usr/ports/games/ivan/work/ivan-059/FeLib/../xbrzscale/xbrz -isystem /usr/local/include/SDL2 -isystem /usr/local/include/libpng16 -isystem /usr/local/include -std=c++11 -O2 -pipe -fstack-protector-strong -fno-strict-aliasing -O2 -pipe -fstack-protector-strong -fno-strict-aliasing   -DNDEBUG -MD -MT FeLib/CMakeFiles/FeLib.dir/Source/graphics.cpp.o -MF FeLib/CMakeFiles/FeLib.dir/Source/graphics.cpp.o.d -o FeLib/CMakeFiles/FeLib.dir/Source/graphics.cpp.o -c /wrkdirs/usr/ports/games/ivan/work/ivan-059/FeLib/Source/graphics.cpp
[ 19% 12/62] /usr/bin/c++ -DDATADIR=\"/usr/local/share\" -DIVAN_VERSION=\"0.59\" -DUNIX -DUSE_SDL -I/wrkdirs/usr/ports/games/ivan/work/ivan-059/FeLib/Include -I/wrkdirs/usr/ports/games/ivan/work/ivan-059/FeLib/../xbrzscale -I/wrkdirs/usr/ports/games/ivan/work/ivan-059/FeLib/../xbrzscale/xbrz -isystem /usr/local/include/SDL2 -isystem /usr/local/include/libpng16 -isystem /usr/local/include -std=c++11 -O2 -pipe -fstack-protector-strong -fno-strict-aliasing -O2 -pipe -fstack-protector-strong -fno-strict-aliasing   -DNDEBUG -MD -MT FeLib/CMakeFiles/FeLib.dir/Source/rawbit.cpp.o -MF FeLib/CMakeFiles/FeLib.dir/Source/rawbit.cpp.o.d -o FeLib/CMakeFiles/FeLib.dir/Source/rawbit.cpp.o -c /wrkdirs/usr/ports/games/ivan/work/ivan-059/FeLib/Source/rawbit.cpp
ninja: build stopped: subcommand failed.
===> Compilation failed unexpectedly.
Try to set MAKE_JOBS_UNSAFE=yes and rebuild before reporting the failure to
the maintainer.
*** Error code 1

Stop.
make: stopped in /usr/ports/games/ivan