[package - 132amd64-quarterly][science/py-tensorflow] Failed for py39-tensorflow-2.9.1_14 in build

From: <pkg-fallout_at_FreeBSD.org>
Date: Sat, 16 Mar 2024 01:17:13 UTC
You are receiving this mail as a port that you maintain
is failing to build on the FreeBSD package build server.
Please investigate the failure and submit a PR to fix
build.

Maintainer:     amzo1337@gmail.com
Log URL:        https://pkg-status.freebsd.org/beefy14/data/132amd64-quarterly/a9efba85d3b9/logs/py39-tensorflow-2.9.1_14.log
Build URL:      https://pkg-status.freebsd.org/beefy14/build.html?mastername=132amd64-quarterly&build=a9efba85d3b9
Log:

=>> Building science/py-tensorflow
build started at Sat Mar 16 01:14:24 UTC 2024
port directory: /usr/ports/science/py-tensorflow
package name: py39-tensorflow-2.9.1_14
building for: FreeBSD 132amd64-quarterly-job-07 13.2-RELEASE-p10 FreeBSD 13.2-RELEASE-p10 amd64
maintained by: amzo1337@gmail.com
Makefile datestamp: -rw-r--r--  1 root  wheel  8631 Jan  6 01:02 /usr/ports/science/py-tensorflow/Makefile
Ports top last git commit: a9efba85d
Ports top unclean checkout: no
Port dir last git commit: 756e18783
Port dir unclean checkout: no
Poudriere version: poudriere-git-3.4.1-1-g1e9f97d6
Host OSVERSION: 1500006
Jail OSVERSION: 1302001
Job Id: 07

---Begin Environment---
SHELL=/bin/csh
OSVERSION=1302001
UNAME_v=FreeBSD 13.2-RELEASE-p10
UNAME_r=13.2-RELEASE-p10
BLOCKSIZE=K
MAIL=/var/mail/root
MM_CHARSET=UTF-8
LANG=C.UTF-8
STATUS=1
HOME=/root
PATH=/sbin:/bin:/usr/sbin:/usr/bin:/usr/local/sbin:/usr/local/bin:/root/bin
MAKE_OBJDIR_CHECK_WRITABLE=0
LOCALBASE=/usr/local
USER=root
POUDRIERE_NAME=poudriere-git
LIBEXECPREFIX=/usr/local/libexec/poudriere
POUDRIERE_VERSION=3.4.1-1-g1e9f97d6
MASTERMNT=/usr/local/poudriere/data/.m/132amd64-quarterly/ref
LC_COLLATE=C
POUDRIERE_BUILD_TYPE=bulk
PACKAGE_BUILDING=yes
SAVED_TERM=
OUTPUT_REDIRECTED_STDERR=4
OUTPUT_REDIRECTED=1
PWD=/usr/local/poudriere/data/.m/132amd64-quarterly/07/.p
OUTPUT_REDIRECTED_STDOUT=3
P_PORTS_FEATURES=FLAVORS SUBPACKAGES SELECTED_OPTIONS
MASTERNAME=132amd64-quarterly
SCRIPTPREFIX=/usr/local/share/poudriere
SCRIPTNAME=bulk.sh
OLDPWD=/usr/local/poudriere/data/.m/132amd64-quarterly/ref/.p/pool
POUDRIERE_PKGNAME=poudriere-git-3.4.1-1-g1e9f97d6
SCRIPTPATH=/usr/local/share/poudriere/bulk.sh
POUDRIEREPATH=/usr/local/bin/poudriere
---End Environment---

---Begin Poudriere Port Flags/Env---
PORT_FLAGS=
PKGENV=
FLAVOR=py39
MAKE_ARGS= FLAVOR=py39
---End Poudriere Port Flags/Env---

---Begin OPTIONS List---
===> The following configuration options are available for py39-tensorflow-2.9.1_14:
     CPU_OPTS=off: Enable optimisations using features available on your CPU
     XLA=off: Accelerated Linear Algebra
====> How many jobs to run during build?: you can only select none or one of them
     JOBS_1=off: Run one job
     JOBS_HALF=on: Run half jobs
     JOBS_ALL=off: Run all jobs
===> Use 'make config' to modify these settings
---End OPTIONS List---

--MAINTAINER--
amzo1337@gmail.com
--End MAINTAINER--

--CONFIGURE_ARGS--

--End CONFIGURE_ARGS--

--CONFIGURE_ENV--
PYTHON="/usr/local/bin/python3.9" XDG_DATA_HOME=/wrkdirs/usr/ports/science/py-tensorflow/work-py39  XDG_CONFIG_HOME=/wrkdirs/usr/ports/science/py-tensorflow/work-py39  XDG_CACHE_HOME=/wrkdirs/usr/ports/science/py-tensorflow/work-py39/.cache  HOME=/wrkdirs/usr/ports/science/py-tensorflow/work-py39 TMPDIR="/tmp" PATH=/wrkdirs/usr/ports/science/py-tensorflow/work-py39/.bin:/sbin:/bin:/usr/sbin:/usr/bin:/usr/local/sbin:/usr/local/bin:/root/bin PKG_CONFIG_LIBDIR=/wrkdirs/usr/ports/science/py-tensorflow/work-py39/.pkgconfig:/usr/local/libdata/pkgconfig:/usr/local/share/pkgconfig:/usr/libdata/pkgconfig SHELL=/bin/sh CONFIG_SHELL=/bin/sh
--End CONFIGURE_ENV--

--MAKE_ENV--
OPENSSLBASE=/usr OPENSSLDIR=/etc/ssl OPENSSLINC=/usr/include OPENSSLLIB=/usr/lib XDG_DATA_HOME=/wrkdirs/usr/ports/science/py-tensorflow/work-py39  XDG_CONFIG_HOME=/wrkdirs/usr/ports/science/py-tensorflow/work-py39  XDG_CACHE_HOME=/wrkdirs/usr/ports/science/py-tensorflow/work-py39/.cache  HOME=/wrkdirs/usr/ports/science/py-tensorflow/work-py39 TMPDIR="/tmp" PATH=/wrkdirs/usr/ports/science/py-tensorflow/work-py39/.bin:/sbin:/bin:/usr/sbin:/usr/bin:/usr/local/sbin:/usr/local/bin:/root/bin PKG_CONFIG_LIBDIR=/wrkdirs/usr/ports/science/py-tensorflow/work-py39/.pkgconfig:/usr/local/libdata/pkgconfig:/usr/local/share/pkgconfig:/usr/libdata/pkgconfig MK_DEBUG_FILES=no MK_KERNEL_SYMBOLS=no SHELL=/bin/sh NO_LINT=YES LDSHARED="/usr/local/llvm16/bin/clang -shared" PYTHONDONTWRITEBYTECODE= PYTHONOPTIMIZE= PREFIX=/usr/local  LOCALBASE=/usr/local  CC="/usr/local/llvm16/bin/clang" CFLAGS="-O2 -pipe  -fstack-protector-strong -fno-strict-aliasing "  CPP="/usr/local/llvm16/bin/clang-cpp" CPPFLA
GS=""  LDFLAGS="  -fstack-protector-strong " LIBS=""  CXX="/usr/local/llvm16/bin/clang++" CXXFLAGS="-O2 -pipe  -fstack-protector-strong -fno-strict-aliasing   -std=c++17 "  MANPREFIX="/usr/local" BSD_INSTALL_PROGRAM="install  -s -m 555"  BSD_INSTALL_LIB="install  -s -m 0644"  BSD_INSTALL_SCRIPT="install  -m 555"  BSD_INSTALL_DATA="install  -m 0644"  BSD_INSTALL_MAN="install  -m 444"
--End MAKE_ENV--

--PLIST_SUB--
TF_PORT_VERSION=2.9.1 PYTHON_INCLUDEDIR=include/python3.9  PYTHON_LIBDIR=lib/python3.9  PYTHON_PLATFORM=freebsd13  PYTHON_SITELIBDIR=lib/python3.9/site-packages  PYTHON_SUFFIX=39  PYTHON_EXT_SUFFIX=.cpython-39  PYTHON_VER=3.9  PYTHON_VERSION=python3.9 PYTHON2="@comment " PYTHON3="" OSREL=13.2 PREFIX=%D LOCALBASE=/usr/local  RESETPREFIX=/usr/local LIB32DIR=lib DOCSDIR="share/doc/tensorflow"  EXAMPLESDIR="share/examples/tensorflow"  DATADIR="share/tensorflow"  WWWDIR="www/tensorflow"  ETCDIR="etc/tensorflow"
--End PLIST_SUB--

--SUB_LIST--
 PYTHON_INCLUDEDIR=/usr/local/include/python3.9  PYTHON_LIBDIR=/usr/local/lib/python3.9  PYTHON_PLATFORM=freebsd13  PYTHON_SITELIBDIR=/usr/local/lib/python3.9/site-packages  PYTHON_SUFFIX=39  PYTHON_EXT_SUFFIX=.cpython-39  PYTHON_VER=3.9  PYTHON_VERSION=python3.9 PYTHON2="@comment " PYTHON3="" PREFIX=/usr/local LOCALBASE=/usr/local  DATADIR=/usr/local/share/tensorflow DOCSDIR=/usr/local/share/doc/tensorflow EXAMPLESDIR=/usr/local/share/examples/tensorflow  WWWDIR=/usr/local/www/tensorflow ETCDIR=/usr/local/etc/tensorflow
--End SUB_LIST--

---Begin make.conf---
USE_PACKAGE_DEPENDS=yes
BATCH=yes
WRKDIRPREFIX=/wrkdirs
PORTSDIR=/usr/ports
PACKAGES=/packages
DISTDIR=/distfiles
PACKAGE_BUILDING=yes
PACKAGE_BUILDING_FLAVORS=yes
####  ####
# XXX: We really need this but cannot use it while 'make checksum' does not
# try the next mirror on checksum failure.  It currently retries the same
# failed mirror and then fails rather then trying another.  It *does*
# try the next if the size is mismatched though.
#MASTER_SITE_FREEBSD=yes
# Build ALLOW_MAKE_JOBS_PACKAGES with 3 jobs
MAKE_JOBS_NUMBER=3
#### Misc Poudriere ####
.include "/etc/make.conf.ports_env"
GID=0
UID=0
---End make.conf---
--Resource limits--
cpu time               (seconds, -t)  unlimited
file size           (512-blocks, -f)  unlimited
data seg size           (kbytes, -d)  33554432
stack size              (kbytes, -s)  524288
core file size      (512-blocks, -c)  unlimited
max memory size         (kbytes, -m)  unlimited
locked memory           (kbytes, -l)  unlimited
max user processes              (-u)  89999
open files                      (-n)  8192
virtual mem size        (kbytes, -v)  unlimited
swap limit              (kbytes, -w)  unlimited
socket buffer size       (bytes, -b)  unlimited
pseudo-terminals                (-p)  unlimited
kqueues                         (-k)  unlimited
umtx shared locks               (-o)  unlimited
--End resource limits--
=======================<phase: check-sanity   >============================
===== env: NO_DEPENDS=yes USER=root UID=0 GID=0
===>  License APACHE20 accepted by the user
===========================================================================
=======================<phase: pkg-depends    >============================
===== env: USE_PACKAGE_DEPENDS_ONLY=1 USER=root UID=0 GID=0
===>   py39-tensorflow-2.9.1_14 depends on file: /usr/local/sbin/pkg - not found
===>   Installing existing package /packages/All/pkg-1.20.9.pkg
[132amd64-quarterly-job-07] Installing pkg-1.20.9...
[132amd64-quarterly-job-07] Extracting pkg-1.20.9: .......... done
===>   py39-tensorflow-2.9.1_14 depends on file: /usr/local/sbin/pkg - found
===>   Returning to build of py39-tensorflow-2.9.1_14
===========================================================================
=======================<phase: fetch-depends  >============================
===== env: USE_PACKAGE_DEPENDS_ONLY=1 USER=root UID=0 GID=0
===========================================================================
=======================<phase: fetch          >============================
===== env: NO_DEPENDS=yes USER=root UID=0 GID=0
===>  License APACHE20 accepted by the user
===> Fetching all distfiles required by py39-tensorflow-2.9.1_14 for building
===========================================================================
=======================<phase: checksum       >============================
===== env: NO_DEPENDS=yes USER=root UID=0 GID=0
===>  License APACHE20 accepted by the user
===> Fetching all distfiles required by py39-tensorflow-2.9.1_14 for building
=> SHA256 Checksum OK for tensorflow/platforms-0.0.2.tar.gz.
=> SHA256 Checksum OK for tensorflow/apple_support.0.12.1.tar.gz.
=> SHA256 Checksum OK for tensorflow/bazel-skylib-1.0.3.tar.gz.
=> SHA256 Checksum OK for tensorflow/dfc67056200b674accd08d8f9a21e328098c07e2.tar.gz.
=> SHA256 Checksum OK for tensorflow/v0.1.1.zip.
=> SHA256 Checksum OK for tensorflow/rules_apple.0.33.0.tar.gz.
=> SHA256 Checksum OK for tensorflow/081771d4a0e9d7d3aa0eed2ef389fa4700dfb23e.tar.gz.
=> SHA256 Checksum OK for tensorflow/308b05b2419edb5c8ee0471b67a40403df940149.tar.gz.
=> SHA256 Checksum OK for tensorflow/rules_docker-v0.10.0.tar.gz.
=> SHA256 Checksum OK for tensorflow/7cf3cefd652008d0a64a419c34c13bdca6c8f178.zip.
=> SHA256 Checksum OK for tensorflow/rules_pkg-0.2.5.tar.gz.
=> SHA256 Checksum OK for tensorflow/11bf7c25e666dd7ddacbcd4d4c4a9de7a25175f8.tar.gz.
=> SHA256 Checksum OK for tensorflow/rules_python-0.0.1.tar.gz.
=> SHA256 Checksum OK for tensorflow/rules_swift.0.25.0.tar.gz.
=> SHA256 Checksum OK for tensorflow/790d7a083520398268d92d0bd61cf85dfa32ee98.tar.gz.
=> SHA256 Checksum OK for tensorflow/0d859a811870d10f53a594927d0d0b97573ad06d.tar.gz.
=> SHA256 Checksum OK for tensorflow/e844ffd17118c1e17d94e1ba4354c075a4577b88.zip.
=> SHA256 Checksum OK for tensorflow/fd3d9af80465e4383162e4a7c5e2f406e82dd968.tar.gz.
=> SHA256 Checksum OK for tensorflow/506cfa4bffd060c06ec338ce50ea3468daa6c814.tar.gz.
=> SHA256 Checksum OK for tensorflow/e6c1b8dc8a8b00ee74e7268aac8b18d7260ab1ce.zip.
=> SHA256 Checksum OK for tensorflow/835a7d7b1ee3bc83e575e302a985c66ec4b65249.tar.gz.
=> SHA256 Checksum OK for tensorflow/openmp-10.0.1.src.tar.xz.
=> SHA256 Checksum OK for tensorflow/36dbc057604f00aacfc0288ddad57e3b21cfc1b8.tar.gz.
=> SHA256 Checksum OK for tensorflow/v2.6.tar.gz.
=> SHA256 Checksum OK for tensorflow/v1.0.tar.gz.
=> SHA256 Checksum OK for tensorflow/5916273f79a21551890fd3d56fc5375a78d1598d.zip.
=> SHA256 Checksum OK for tensorflow/d5e37adf1406cf899d7d9ec1d317c47506ccb970.tar.gz.
=> SHA256 Checksum OK for tensorflow/093ed77f7d50f75b376f40a71ea86e08cedb8b80.tar.gz.
=> SHA256 Checksum OK for tensorflow/eigen-008ff3483a8c5604639e1c4d204eae30ad737af6.tar.gz.
=> SHA256 Checksum OK for tensorflow/11b2812d64e49bab9b6c489f79067fc94e69db9f.zip.
=> SHA256 Checksum OK for tensorflow/b8374f80e42010941bda6c85b0e3f1a1bd77a1e0.zip.
=> SHA256 Checksum OK for tensorflow/4dfe081cf6bcd15db339cf2680b9281b8451eeb3.zip.
=> SHA256 Checksum OK for tensorflow/63058eff77e11aa15bf531df5dd34395ec3017c8.zip.
=> SHA256 Checksum OK for tensorflow/1cb299165c859533e22f2ed05eb2abd5071544df.tar.gz.
=> SHA256 Checksum OK for tensorflow/541b1ded4abadcc38e8178680b0677f65594ea6f.zip.
=> SHA256 Checksum OK for tensorflow/v1.12.0.tar.gz.
=> SHA256 Checksum OK for tensorflow/1200fe90bb174a6224a525ee60148671a786a71f.tar.gz.
=> SHA256 Checksum OK for tensorflow/tensorflow-tensorflow-v2.9.1_GH0.tar.gz.
===========================================================================
=======================<phase: extract-depends>============================
<snip>
    PYTHON_BIN_PATH=/usr/local/bin/python3.9 \
    PYTHON_LIB_PATH=/usr/local/lib/python3.9/site-packages \
    TF2_BEHAVIOR=1 \
    TF_SYSTEM_LIBS=absl_py,astor_archive,astunparse_archive,boringssl,com_github_googlecloudplatform_google_cloud_cpp,com_github_grpc_grpc,com_google_absl,com_google_protobuf,curl,cython,dill_archive,double_conversion,functools32_archive,gast_archive,gif,hwloc,icu,jsoncpp_git,libjpeg_turbo,lmdb,nasm,nsync,opt_einsum_archive,org_sqlite,pasta,png,pybind11,six_archive,snappy,tblib_archive,termcolor_archive,typing_extensions_archive,wrapt,zlib \
  /usr/local/llvm16/bin/clang-16 -U_FORTIFY_SOURCE '-D_FORTIFY_SOURCE=1' -fstack-protector -Wall -fno-omit-frame-pointer -g0 -O2 -DNDEBUG -ffunction-sections -fdata-sections '-std=c++17' -MD -MF bazel-out/k8-opt/bin/external/com_googlesource_code_re2/_objs/re2/unicode_groups.pic.d '-frandom-seed=bazel-out/k8-opt/bin/external/com_googlesource_code_re2/_objs/re2/unicode_groups.pic.o' -fPIC -iquote external/com_googlesource_code_re2 -iquote bazel-out/k8-opt/bin/external/com_googlesource_code_re2 -iquote external/com_google_absl -iquote bazel-out/k8-opt/bin/external/com_google_absl -I/usr/local/include -pthread -no-canonical-prefixes -Wno-builtin-macro-redefined '-D__DATE__="redacted"' '-D__TIMESTAMP__="redacted"' '-D__TIME__="redacted"' -c external/com_googlesource_code_re2/re2/unicode_groups.cc -o bazel-out/k8-opt/bin/external/com_googlesource_code_re2/_objs/re2/unicode_groups.pic.o)
# Configuration: 14043212de80515e4b1b60f4551a72c7a3d51028a66256a8dd9fc3a93497b376
# Execution platform: @local_execution_config_platform//:platform
SUBCOMMAND: # @com_googlesource_code_re2//:re2 [action 'Compiling util/rune.cc', configuration: 14043212de80515e4b1b60f4551a72c7a3d51028a66256a8dd9fc3a93497b376, execution platform: @local_execution_config_platform//:platform]
(cd /wrkdirs/usr/ports/science/py-tensorflow/work-py39/bazel_out/a3a528f8f183bd8af2e96331471788f6/execroot/org_tensorflow && \
  exec env - \
    BAZEL_CXXOPTS='-std=c++17' \
    CXXFLAGS='-stdlib=libc++' \
    KERAS_HOME=/wrkdirs/usr/ports/science/py-tensorflow/work-py39/.keras \
    PATH=/wrkdirs/usr/ports/science/py-tensorflow/work-py39/.bin:/sbin:/bin:/usr/sbin:/usr/bin:/usr/local/sbin:/usr/local/bin:/root/bin \
    PWD=/proc/self/cwd \
    PYTHON_BIN_PATH=/usr/local/bin/python3.9 \
    PYTHON_LIB_PATH=/usr/local/lib/python3.9/site-packages \
    TF2_BEHAVIOR=1 \
    TF_SYSTEM_LIBS=absl_py,astor_archive,astunparse_archive,boringssl,com_github_googlecloudplatform_google_cloud_cpp,com_github_grpc_grpc,com_google_absl,com_google_protobuf,curl,cython,dill_archive,double_conversion,functools32_archive,gast_archive,gif,hwloc,icu,jsoncpp_git,libjpeg_turbo,lmdb,nasm,nsync,opt_einsum_archive,org_sqlite,pasta,png,pybind11,six_archive,snappy,tblib_archive,termcolor_archive,typing_extensions_archive,wrapt,zlib \
  /usr/local/llvm16/bin/clang-16 -U_FORTIFY_SOURCE '-D_FORTIFY_SOURCE=1' -fstack-protector -Wall -fno-omit-frame-pointer -g0 -O2 -DNDEBUG -ffunction-sections -fdata-sections '-std=c++17' -MD -MF bazel-out/k8-opt/bin/external/com_googlesource_code_re2/_objs/re2/rune.pic.d '-frandom-seed=bazel-out/k8-opt/bin/external/com_googlesource_code_re2/_objs/re2/rune.pic.o' -fPIC -iquote external/com_googlesource_code_re2 -iquote bazel-out/k8-opt/bin/external/com_googlesource_code_re2 -iquote external/com_google_absl -iquote bazel-out/k8-opt/bin/external/com_google_absl -I/usr/local/include -pthread -no-canonical-prefixes -Wno-builtin-macro-redefined '-D__DATE__="redacted"' '-D__TIMESTAMP__="redacted"' '-D__TIME__="redacted"' -c external/com_googlesource_code_re2/util/rune.cc -o bazel-out/k8-opt/bin/external/com_googlesource_code_re2/_objs/re2/rune.pic.o)
# Configuration: 14043212de80515e4b1b60f4551a72c7a3d51028a66256a8dd9fc3a93497b376
# Execution platform: @local_execution_config_platform//:platform
SUBCOMMAND: # @com_googlesource_code_re2//:re2 [action 'Compiling re2/tostring.cc', configuration: 14043212de80515e4b1b60f4551a72c7a3d51028a66256a8dd9fc3a93497b376, execution platform: @local_execution_config_platform//:platform]
(cd /wrkdirs/usr/ports/science/py-tensorflow/work-py39/bazel_out/a3a528f8f183bd8af2e96331471788f6/execroot/org_tensorflow && \
  exec env - \
    BAZEL_CXXOPTS='-std=c++17' \
    CXXFLAGS='-stdlib=libc++' \
    KERAS_HOME=/wrkdirs/usr/ports/science/py-tensorflow/work-py39/.keras \
    PATH=/wrkdirs/usr/ports/science/py-tensorflow/work-py39/.bin:/sbin:/bin:/usr/sbin:/usr/bin:/usr/local/sbin:/usr/local/bin:/root/bin \
    PWD=/proc/self/cwd \
    PYTHON_BIN_PATH=/usr/local/bin/python3.9 \
    PYTHON_LIB_PATH=/usr/local/lib/python3.9/site-packages \
    TF2_BEHAVIOR=1 \
    TF_SYSTEM_LIBS=absl_py,astor_archive,astunparse_archive,boringssl,com_github_googlecloudplatform_google_cloud_cpp,com_github_grpc_grpc,com_google_absl,com_google_protobuf,curl,cython,dill_archive,double_conversion,functools32_archive,gast_archive,gif,hwloc,icu,jsoncpp_git,libjpeg_turbo,lmdb,nasm,nsync,opt_einsum_archive,org_sqlite,pasta,png,pybind11,six_archive,snappy,tblib_archive,termcolor_archive,typing_extensions_archive,wrapt,zlib \
  /usr/local/llvm16/bin/clang-16 -U_FORTIFY_SOURCE '-D_FORTIFY_SOURCE=1' -fstack-protector -Wall -fno-omit-frame-pointer -g0 -O2 -DNDEBUG -ffunction-sections -fdata-sections '-std=c++17' -MD -MF bazel-out/k8-opt/bin/external/com_googlesource_code_re2/_objs/re2/tostring.pic.d '-frandom-seed=bazel-out/k8-opt/bin/external/com_googlesource_code_re2/_objs/re2/tostring.pic.o' -fPIC -iquote external/com_googlesource_code_re2 -iquote bazel-out/k8-opt/bin/external/com_googlesource_code_re2 -iquote external/com_google_absl -iquote bazel-out/k8-opt/bin/external/com_google_absl -I/usr/local/include -pthread -no-canonical-prefixes -Wno-builtin-macro-redefined '-D__DATE__="redacted"' '-D__TIMESTAMP__="redacted"' '-D__TIME__="redacted"' -c external/com_googlesource_code_re2/re2/tostring.cc -o bazel-out/k8-opt/bin/external/com_googlesource_code_re2/_objs/re2/tostring.pic.o)
# Configuration: 14043212de80515e4b1b60f4551a72c7a3d51028a66256a8dd9fc3a93497b376
# Execution platform: @local_execution_config_platform//:platform
SUBCOMMAND: # @com_googlesource_code_re2//:re2 [action 'Compiling re2/simplify.cc', configuration: 14043212de80515e4b1b60f4551a72c7a3d51028a66256a8dd9fc3a93497b376, execution platform: @local_execution_config_platform//:platform]
(cd /wrkdirs/usr/ports/science/py-tensorflow/work-py39/bazel_out/a3a528f8f183bd8af2e96331471788f6/execroot/org_tensorflow && \
  exec env - \
    BAZEL_CXXOPTS='-std=c++17' \
    CXXFLAGS='-stdlib=libc++' \
    KERAS_HOME=/wrkdirs/usr/ports/science/py-tensorflow/work-py39/.keras \
    PATH=/wrkdirs/usr/ports/science/py-tensorflow/work-py39/.bin:/sbin:/bin:/usr/sbin:/usr/bin:/usr/local/sbin:/usr/local/bin:/root/bin \
    PWD=/proc/self/cwd \
    PYTHON_BIN_PATH=/usr/local/bin/python3.9 \
    PYTHON_LIB_PATH=/usr/local/lib/python3.9/site-packages \
    TF2_BEHAVIOR=1 \
    TF_SYSTEM_LIBS=absl_py,astor_archive,astunparse_archive,boringssl,com_github_googlecloudplatform_google_cloud_cpp,com_github_grpc_grpc,com_google_absl,com_google_protobuf,curl,cython,dill_archive,double_conversion,functools32_archive,gast_archive,gif,hwloc,icu,jsoncpp_git,libjpeg_turbo,lmdb,nasm,nsync,opt_einsum_archive,org_sqlite,pasta,png,pybind11,six_archive,snappy,tblib_archive,termcolor_archive,typing_extensions_archive,wrapt,zlib \
  /usr/local/llvm16/bin/clang-16 -U_FORTIFY_SOURCE '-D_FORTIFY_SOURCE=1' -fstack-protector -Wall -fno-omit-frame-pointer -g0 -O2 -DNDEBUG -ffunction-sections -fdata-sections '-std=c++17' -MD -MF bazel-out/k8-opt/bin/external/com_googlesource_code_re2/_objs/re2/simplify.pic.d '-frandom-seed=bazel-out/k8-opt/bin/external/com_googlesource_code_re2/_objs/re2/simplify.pic.o' -fPIC -iquote external/com_googlesource_code_re2 -iquote bazel-out/k8-opt/bin/external/com_googlesource_code_re2 -iquote external/com_google_absl -iquote bazel-out/k8-opt/bin/external/com_google_absl -I/usr/local/include -pthread -no-canonical-prefixes -Wno-builtin-macro-redefined '-D__DATE__="redacted"' '-D__TIMESTAMP__="redacted"' '-D__TIME__="redacted"' -c external/com_googlesource_code_re2/re2/simplify.cc -o bazel-out/k8-opt/bin/external/com_googlesource_code_re2/_objs/re2/simplify.pic.o)
# Configuration: 14043212de80515e4b1b60f4551a72c7a3d51028a66256a8dd9fc3a93497b376
# Execution platform: @local_execution_config_platform//:platform
SUBCOMMAND: # @com_googlesource_code_re2//:re2 [action 'Compiling util/strutil.cc', configuration: 14043212de80515e4b1b60f4551a72c7a3d51028a66256a8dd9fc3a93497b376, execution platform: @local_execution_config_platform//:platform]
(cd /wrkdirs/usr/ports/science/py-tensorflow/work-py39/bazel_out/a3a528f8f183bd8af2e96331471788f6/execroot/org_tensorflow && \
  exec env - \
    BAZEL_CXXOPTS='-std=c++17' \
    CXXFLAGS='-stdlib=libc++' \
    KERAS_HOME=/wrkdirs/usr/ports/science/py-tensorflow/work-py39/.keras \
    PATH=/wrkdirs/usr/ports/science/py-tensorflow/work-py39/.bin:/sbin:/bin:/usr/sbin:/usr/bin:/usr/local/sbin:/usr/local/bin:/root/bin \
    PWD=/proc/self/cwd \
    PYTHON_BIN_PATH=/usr/local/bin/python3.9 \
    PYTHON_LIB_PATH=/usr/local/lib/python3.9/site-packages \
    TF2_BEHAVIOR=1 \
    TF_SYSTEM_LIBS=absl_py,astor_archive,astunparse_archive,boringssl,com_github_googlecloudplatform_google_cloud_cpp,com_github_grpc_grpc,com_google_absl,com_google_protobuf,curl,cython,dill_archive,double_conversion,functools32_archive,gast_archive,gif,hwloc,icu,jsoncpp_git,libjpeg_turbo,lmdb,nasm,nsync,opt_einsum_archive,org_sqlite,pasta,png,pybind11,six_archive,snappy,tblib_archive,termcolor_archive,typing_extensions_archive,wrapt,zlib \
  /usr/local/llvm16/bin/clang-16 -U_FORTIFY_SOURCE '-D_FORTIFY_SOURCE=1' -fstack-protector -Wall -fno-omit-frame-pointer -g0 -O2 -DNDEBUG -ffunction-sections -fdata-sections '-std=c++17' -MD -MF bazel-out/k8-opt/bin/external/com_googlesource_code_re2/_objs/re2/strutil.pic.d '-frandom-seed=bazel-out/k8-opt/bin/external/com_googlesource_code_re2/_objs/re2/strutil.pic.o' -fPIC -iquote external/com_googlesource_code_re2 -iquote bazel-out/k8-opt/bin/external/com_googlesource_code_re2 -iquote external/com_google_absl -iquote bazel-out/k8-opt/bin/external/com_google_absl -I/usr/local/include -pthread -no-canonical-prefixes -Wno-builtin-macro-redefined '-D__DATE__="redacted"' '-D__TIMESTAMP__="redacted"' '-D__TIME__="redacted"' -c external/com_googlesource_code_re2/util/strutil.cc -o bazel-out/k8-opt/bin/external/com_googlesource_code_re2/_objs/re2/strutil.pic.o)
# Configuration: 14043212de80515e4b1b60f4551a72c7a3d51028a66256a8dd9fc3a93497b376
# Execution platform: @local_execution_config_platform//:platform
SUBCOMMAND: # @com_googlesource_code_re2//:re2 [action 'Compiling re2/perl_groups.cc', configuration: 14043212de80515e4b1b60f4551a72c7a3d51028a66256a8dd9fc3a93497b376, execution platform: @local_execution_config_platform//:platform]
(cd /wrkdirs/usr/ports/science/py-tensorflow/work-py39/bazel_out/a3a528f8f183bd8af2e96331471788f6/execroot/org_tensorflow && \
  exec env - \
    BAZEL_CXXOPTS='-std=c++17' \
    CXXFLAGS='-stdlib=libc++' \
    KERAS_HOME=/wrkdirs/usr/ports/science/py-tensorflow/work-py39/.keras \
    PATH=/wrkdirs/usr/ports/science/py-tensorflow/work-py39/.bin:/sbin:/bin:/usr/sbin:/usr/bin:/usr/local/sbin:/usr/local/bin:/root/bin \
    PWD=/proc/self/cwd \
    PYTHON_BIN_PATH=/usr/local/bin/python3.9 \
    PYTHON_LIB_PATH=/usr/local/lib/python3.9/site-packages \
    TF2_BEHAVIOR=1 \
    TF_SYSTEM_LIBS=absl_py,astor_archive,astunparse_archive,boringssl,com_github_googlecloudplatform_google_cloud_cpp,com_github_grpc_grpc,com_google_absl,com_google_protobuf,curl,cython,dill_archive,double_conversion,functools32_archive,gast_archive,gif,hwloc,icu,jsoncpp_git,libjpeg_turbo,lmdb,nasm,nsync,opt_einsum_archive,org_sqlite,pasta,png,pybind11,six_archive,snappy,tblib_archive,termcolor_archive,typing_extensions_archive,wrapt,zlib \
  /usr/local/llvm16/bin/clang-16 -U_FORTIFY_SOURCE '-D_FORTIFY_SOURCE=1' -fstack-protector -Wall -fno-omit-frame-pointer -g0 -O2 -DNDEBUG -ffunction-sections -fdata-sections '-std=c++17' -MD -MF bazel-out/k8-opt/bin/external/com_googlesource_code_re2/_objs/re2/perl_groups.pic.d '-frandom-seed=bazel-out/k8-opt/bin/external/com_googlesource_code_re2/_objs/re2/perl_groups.pic.o' -fPIC -iquote external/com_googlesource_code_re2 -iquote bazel-out/k8-opt/bin/external/com_googlesource_code_re2 -iquote external/com_google_absl -iquote bazel-out/k8-opt/bin/external/com_google_absl -I/usr/local/include -pthread -no-canonical-prefixes -Wno-builtin-macro-redefined '-D__DATE__="redacted"' '-D__TIMESTAMP__="redacted"' '-D__TIME__="redacted"' -c external/com_googlesource_code_re2/re2/perl_groups.cc -o bazel-out/k8-opt/bin/external/com_googlesource_code_re2/_objs/re2/perl_groups.pic.o)
# Configuration: 14043212de80515e4b1b60f4551a72c7a3d51028a66256a8dd9fc3a93497b376
# Execution platform: @local_execution_config_platform//:platform
SUBCOMMAND: # @com_googlesource_code_re2//:re2 [action 'Compiling re2/dfa.cc', configuration: 14043212de80515e4b1b60f4551a72c7a3d51028a66256a8dd9fc3a93497b376, execution platform: @local_execution_config_platform//:platform]
(cd /wrkdirs/usr/ports/science/py-tensorflow/work-py39/bazel_out/a3a528f8f183bd8af2e96331471788f6/execroot/org_tensorflow && \
  exec env - \
    BAZEL_CXXOPTS='-std=c++17' \
    CXXFLAGS='-stdlib=libc++' \
    KERAS_HOME=/wrkdirs/usr/ports/science/py-tensorflow/work-py39/.keras \
    PATH=/wrkdirs/usr/ports/science/py-tensorflow/work-py39/.bin:/sbin:/bin:/usr/sbin:/usr/bin:/usr/local/sbin:/usr/local/bin:/root/bin \
    PWD=/proc/self/cwd \
    PYTHON_BIN_PATH=/usr/local/bin/python3.9 \
    PYTHON_LIB_PATH=/usr/local/lib/python3.9/site-packages \
    TF2_BEHAVIOR=1 \
    TF_SYSTEM_LIBS=absl_py,astor_archive,astunparse_archive,boringssl,com_github_googlecloudplatform_google_cloud_cpp,com_github_grpc_grpc,com_google_absl,com_google_protobuf,curl,cython,dill_archive,double_conversion,functools32_archive,gast_archive,gif,hwloc,icu,jsoncpp_git,libjpeg_turbo,lmdb,nasm,nsync,opt_einsum_archive,org_sqlite,pasta,png,pybind11,six_archive,snappy,tblib_archive,termcolor_archive,typing_extensions_archive,wrapt,zlib \
  /usr/local/llvm16/bin/clang-16 -U_FORTIFY_SOURCE '-D_FORTIFY_SOURCE=1' -fstack-protector -Wall -fno-omit-frame-pointer -g0 -O2 -DNDEBUG -ffunction-sections -fdata-sections '-std=c++17' -MD -MF bazel-out/k8-opt/bin/external/com_googlesource_code_re2/_objs/re2/dfa.pic.d '-frandom-seed=bazel-out/k8-opt/bin/external/com_googlesource_code_re2/_objs/re2/dfa.pic.o' -fPIC -iquote external/com_googlesource_code_re2 -iquote bazel-out/k8-opt/bin/external/com_googlesource_code_re2 -iquote external/com_google_absl -iquote bazel-out/k8-opt/bin/external/com_google_absl -I/usr/local/include -pthread -no-canonical-prefixes -Wno-builtin-macro-redefined '-D__DATE__="redacted"' '-D__TIMESTAMP__="redacted"' '-D__TIME__="redacted"' -c external/com_googlesource_code_re2/re2/dfa.cc -o bazel-out/k8-opt/bin/external/com_googlesource_code_re2/_objs/re2/dfa.pic.o)
# Configuration: 14043212de80515e4b1b60f4551a72c7a3d51028a66256a8dd9fc3a93497b376
# Execution platform: @local_execution_config_platform//:platform
SUBCOMMAND: # @com_googlesource_code_re2//:re2 [action 'Compiling re2/filtered_re2.cc', configuration: 14043212de80515e4b1b60f4551a72c7a3d51028a66256a8dd9fc3a93497b376, execution platform: @local_execution_config_platform//:platform]
(cd /wrkdirs/usr/ports/science/py-tensorflow/work-py39/bazel_out/a3a528f8f183bd8af2e96331471788f6/execroot/org_tensorflow && \
  exec env - \
    BAZEL_CXXOPTS='-std=c++17' \
    CXXFLAGS='-stdlib=libc++' \
    KERAS_HOME=/wrkdirs/usr/ports/science/py-tensorflow/work-py39/.keras \
    PATH=/wrkdirs/usr/ports/science/py-tensorflow/work-py39/.bin:/sbin:/bin:/usr/sbin:/usr/bin:/usr/local/sbin:/usr/local/bin:/root/bin \
    PWD=/proc/self/cwd \
    PYTHON_BIN_PATH=/usr/local/bin/python3.9 \
    PYTHON_LIB_PATH=/usr/local/lib/python3.9/site-packages \
    TF2_BEHAVIOR=1 \
    TF_SYSTEM_LIBS=absl_py,astor_archive,astunparse_archive,boringssl,com_github_googlecloudplatform_google_cloud_cpp,com_github_grpc_grpc,com_google_absl,com_google_protobuf,curl,cython,dill_archive,double_conversion,functools32_archive,gast_archive,gif,hwloc,icu,jsoncpp_git,libjpeg_turbo,lmdb,nasm,nsync,opt_einsum_archive,org_sqlite,pasta,png,pybind11,six_archive,snappy,tblib_archive,termcolor_archive,typing_extensions_archive,wrapt,zlib \
  /usr/local/llvm16/bin/clang-16 -U_FORTIFY_SOURCE '-D_FORTIFY_SOURCE=1' -fstack-protector -Wall -fno-omit-frame-pointer -g0 -O2 -DNDEBUG -ffunction-sections -fdata-sections '-std=c++17' -MD -MF bazel-out/k8-opt/bin/external/com_googlesource_code_re2/_objs/re2/filtered_re2.pic.d '-frandom-seed=bazel-out/k8-opt/bin/external/com_googlesource_code_re2/_objs/re2/filtered_re2.pic.o' -fPIC -iquote external/com_googlesource_code_re2 -iquote bazel-out/k8-opt/bin/external/com_googlesource_code_re2 -iquote external/com_google_absl -iquote bazel-out/k8-opt/bin/external/com_google_absl -I/usr/local/include -pthread -no-canonical-prefixes -Wno-builtin-macro-redefined '-D__DATE__="redacted"' '-D__TIMESTAMP__="redacted"' '-D__TIME__="redacted"' -c external/com_googlesource_code_re2/re2/filtered_re2.cc -o bazel-out/k8-opt/bin/external/com_googlesource_code_re2/_objs/re2/filtered_re2.pic.o)
# Configuration: 14043212de80515e4b1b60f4551a72c7a3d51028a66256a8dd9fc3a93497b376
# Execution platform: @local_execution_config_platform//:platform
[137 / 1,462] Compiling re2/dfa.cc; 1s local ... (2 actions, 1 running)
SUBCOMMAND: # @com_googlesource_code_re2//:re2 [action 'Compiling re2/prog.cc', configuration: 14043212de80515e4b1b60f4551a72c7a3d51028a66256a8dd9fc3a93497b376, execution platform: @local_execution_config_platform//:platform]
(cd /wrkdirs/usr/ports/science/py-tensorflow/work-py39/bazel_out/a3a528f8f183bd8af2e96331471788f6/execroot/org_tensorflow && \
  exec env - \
    BAZEL_CXXOPTS='-std=c++17' \
    CXXFLAGS='-stdlib=libc++' \
    KERAS_HOME=/wrkdirs/usr/ports/science/py-tensorflow/work-py39/.keras \
    PATH=/wrkdirs/usr/ports/science/py-tensorflow/work-py39/.bin:/sbin:/bin:/usr/sbin:/usr/bin:/usr/local/sbin:/usr/local/bin:/root/bin \
    PWD=/proc/self/cwd \
    PYTHON_BIN_PATH=/usr/local/bin/python3.9 \
    PYTHON_LIB_PATH=/usr/local/lib/python3.9/site-packages \
    TF2_BEHAVIOR=1 \
    TF_SYSTEM_LIBS=absl_py,astor_archive,astunparse_archive,boringssl,com_github_googlecloudplatform_google_cloud_cpp,com_github_grpc_grpc,com_google_absl,com_google_protobuf,curl,cython,dill_archive,double_conversion,functools32_archive,gast_archive,gif,hwloc,icu,jsoncpp_git,libjpeg_turbo,lmdb,nasm,nsync,opt_einsum_archive,org_sqlite,pasta,png,pybind11,six_archive,snappy,tblib_archive,termcolor_archive,typing_extensions_archive,wrapt,zlib \
  /usr/local/llvm16/bin/clang-16 -U_FORTIFY_SOURCE '-D_FORTIFY_SOURCE=1' -fstack-protector -Wall -fno-omit-frame-pointer -g0 -O2 -DNDEBUG -ffunction-sections -fdata-sections '-std=c++17' -MD -MF bazel-out/k8-opt/bin/external/com_googlesource_code_re2/_objs/re2/prog.pic.d '-frandom-seed=bazel-out/k8-opt/bin/external/com_googlesource_code_re2/_objs/re2/prog.pic.o' -fPIC -iquote external/com_googlesource_code_re2 -iquote bazel-out/k8-opt/bin/external/com_googlesource_code_re2 -iquote external/com_google_absl -iquote bazel-out/k8-opt/bin/external/com_google_absl -I/usr/local/include -pthread -no-canonical-prefixes -Wno-builtin-macro-redefined '-D__DATE__="redacted"' '-D__TIMESTAMP__="redacted"' '-D__TIME__="redacted"' -c external/com_googlesource_code_re2/re2/prog.cc -o bazel-out/k8-opt/bin/external/com_googlesource_code_re2/_objs/re2/prog.pic.o)
# Configuration: 14043212de80515e4b1b60f4551a72c7a3d51028a66256a8dd9fc3a93497b376
# Execution platform: @local_execution_config_platform//:platform
ERROR: /wrkdirs/usr/ports/science/py-tensorflow/work-py39/bazel_out/a3a528f8f183bd8af2e96331471788f6/external/com_googlesource_code_re2/BUILD:26:11: Compiling re2/dfa.cc failed: (Exit 1): clang-16 failed: error executing command 
  (cd /wrkdirs/usr/ports/science/py-tensorflow/work-py39/bazel_out/a3a528f8f183bd8af2e96331471788f6/execroot/org_tensorflow && \
  exec env - \
    BAZEL_CXXOPTS='-std=c++17' \
    CXXFLAGS='-stdlib=libc++' \
    KERAS_HOME=/wrkdirs/usr/ports/science/py-tensorflow/work-py39/.keras \
    PATH=/wrkdirs/usr/ports/science/py-tensorflow/work-py39/.bin:/sbin:/bin:/usr/sbin:/usr/bin:/usr/local/sbin:/usr/local/bin:/root/bin \
    PWD=/proc/self/cwd \
    PYTHON_BIN_PATH=/usr/local/bin/python3.9 \
    PYTHON_LIB_PATH=/usr/local/lib/python3.9/site-packages \
    TF2_BEHAVIOR=1 \
    TF_SYSTEM_LIBS=absl_py,astor_archive,astunparse_archive,boringssl,com_github_googlecloudplatform_google_cloud_cpp,com_github_grpc_grpc,com_google_absl,com_google_protobuf,curl,cython,dill_archive,double_conversion,functools32_archive,gast_archive,gif,hwloc,icu,jsoncpp_git,libjpeg_turbo,lmdb,nasm,nsync,opt_einsum_archive,org_sqlite,pasta,png,pybind11,six_archive,snappy,tblib_archive,termcolor_archive,typing_extensions_archive,wrapt,zlib \
  /usr/local/llvm16/bin/clang-16 -U_FORTIFY_SOURCE '-D_FORTIFY_SOURCE=1' -fstack-protector -Wall -fno-omit-frame-pointer -g0 -O2 -DNDEBUG -ffunction-sections -fdata-sections '-std=c++17' -MD -MF bazel-out/k8-opt/bin/external/com_googlesource_code_re2/_objs/re2/dfa.pic.d '-frandom-seed=bazel-out/k8-opt/bin/external/com_googlesource_code_re2/_objs/re2/dfa.pic.o' -fPIC -iquote external/com_googlesource_code_re2 -iquote bazel-out/k8-opt/bin/external/com_googlesource_code_re2 -iquote external/com_google_absl -iquote bazel-out/k8-opt/bin/external/com_google_absl -I/usr/local/include -pthread -no-canonical-prefixes -Wno-builtin-macro-redefined '-D__DATE__="redacted"' '-D__TIMESTAMP__="redacted"' '-D__TIME__="redacted"' -c external/com_googlesource_code_re2/re2/dfa.cc -o bazel-out/k8-opt/bin/external/com_googlesource_code_re2/_objs/re2/dfa.pic.o)
# Configuration: 14043212de80515e4b1b60f4551a72c7a3d51028a66256a8dd9fc3a93497b376
# Execution platform: @local_execution_config_platform//:platform
external/com_googlesource_code_re2/re2/dfa.cc:1135:38: error: expected function body after function declarator
void DFA::RWLocker::LockForWriting() NO_THREAD_SAFETY_ANALYSIS {
                                     ^
external/com_googlesource_code_re2/re2/dfa.cc:1216:6: error: incomplete type 're2::DFA::StateSaver' named in nested name specifier
DFA::StateSaver::StateSaver(DFA* dfa, State* state) {
~~~~~^~~~~~~~~~~~
external/com_googlesource_code_re2/re2/dfa.cc:114:9: note: forward declaration of 're2::DFA::StateSaver'
  class StateSaver;
        ^
external/com_googlesource_code_re2/re2/dfa.cc:1216:6: error: incomplete type 're2::DFA::StateSaver' named in nested name specifier
DFA::StateSaver::StateSaver(DFA* dfa, State* state) {
~~~~~^~~~~~~~~~~~
external/com_googlesource_code_re2/re2/dfa.cc:114:9: note: forward declaration of 're2::DFA::StateSaver'
  class StateSaver;
        ^
external/com_googlesource_code_re2/re2/dfa.cc:1216:39: error: unknown type name 'State'
DFA::StateSaver::StateSaver(DFA* dfa, State* state) {
                                      ^
external/com_googlesource_code_re2/re2/dfa.cc:1234:6: error: incomplete type 're2::DFA::StateSaver' named in nested name specifier
DFA::StateSaver::~StateSaver() {
~~~~~^~~~~~~~~~~~
external/com_googlesource_code_re2/re2/dfa.cc:114:9: note: forward declaration of 're2::DFA::StateSaver'
  class StateSaver;
        ^
external/com_googlesource_code_re2/re2/dfa.cc:1239:18: error: incomplete type 're2::DFA::StateSaver' named in nested name specifier
DFA::State* DFA::StateSaver::Restore() {
            ~~~~~^~~~~~~~~~~~
external/com_googlesource_code_re2/re2/dfa.cc:114:9: note: forward declaration of 're2::DFA::StateSaver'
  class StateSaver;
        ^
external/com_googlesource_code_re2/re2/dfa.cc:1427:20: error: variable has incomplete type 'StateSaver'
        StateSaver save_start(this, start);
                   ^
external/com_googlesource_code_re2/re2/dfa.cc:114:9: note: forward declaration of 're2::DFA::StateSaver'
  class StateSaver;
        ^
external/com_googlesource_code_re2/re2/dfa.cc:1428:20: error: variable has incomplete type 'StateSaver'
        StateSaver save_s(this, s);
                   ^
external/com_googlesource_code_re2/re2/dfa.cc:114:9: note: forward declaration of 're2::DFA::StateSaver'
  class StateSaver;
        ^
external/com_googlesource_code_re2/re2/dfa.cc:1507:18: error: variable has incomplete type 'StateSaver'
      StateSaver save_s(this, s);
                 ^
external/com_googlesource_code_re2/re2/dfa.cc:114:9: note: forward declaration of 're2::DFA::StateSaver'
  class StateSaver;
        ^
9 errors generated.
INFO: Elapsed time: 96.673s, Critical Path: 4.19s
INFO: 139 processes: 23 internal, 116 local.
FAILED: Build did NOT complete successfully
FAILED: Build did NOT complete successfully
*** Error code 1

Stop.
make: stopped in /usr/ports/science/py-tensorflow