[package - 132i386-quarterly][devel/ignition-msgs] Failed for ignition-msgs-3.0.0_15 in build

From: <pkg-fallout_at_FreeBSD.org>
Date: Sat, 22 Jun 2024 11:13:32 UTC
You are receiving this mail as a port that you maintain
is failing to build on the FreeBSD package build server.
Please investigate the failure and submit a PR to fix
build.

Maintainer:     yuri@FreeBSD.org
Log URL:        https://pkg-status.freebsd.org/beefy13/data/132i386-quarterly/9a99f5d9d351/logs/ignition-msgs-3.0.0_15.log
Build URL:      https://pkg-status.freebsd.org/beefy13/build.html?mastername=132i386-quarterly&build=9a99f5d9d351
Log:

=>> Building devel/ignition-msgs
build started at Sat Jun 22 11:13:05 UTC 2024
port directory: /usr/ports/devel/ignition-msgs
package name: ignition-msgs-3.0.0_15
building for: FreeBSD 132i386-quarterly-job-07 13.2-RELEASE-p11 FreeBSD 13.2-RELEASE-p11 i386
maintained by: yuri@FreeBSD.org
Makefile datestamp: -rw-r--r--  1 root  wheel  912 Apr  9 01:01 /usr/ports/devel/ignition-msgs/Makefile
Ports top last git commit: 9a99f5d9d
Ports top unclean checkout: no
Port dir last git commit: c5cd82114
Port dir unclean checkout: no
Poudriere version: poudriere-git-3.4.1-30-g79e3edcd
Host OSVERSION: 1500018
Jail OSVERSION: 1302001
Job Id: 07

---Begin Environment---
SHELL=/bin/csh
BLOCKSIZE=K
MAIL=/var/mail/root
MM_CHARSET=UTF-8
LANG=C.UTF-8
OSVERSION=1302001
STATUS=1
HOME=/root
PATH=/sbin:/bin:/usr/sbin:/usr/bin:/usr/local/sbin:/usr/local/bin:/root/bin
MAKE_OBJDIR_CHECK_WRITABLE=0
UNAME_m=i386
UNAME_p=i386
UNAME_r=13.2-RELEASE-p11
LOCALBASE=/usr/local
UNAME_v=FreeBSD 13.2-RELEASE-p11
USER=root
POUDRIERE_NAME=poudriere-git
LIBEXECPREFIX=/usr/local/libexec/poudriere
POUDRIERE_VERSION=3.4.1-30-g79e3edcd
MASTERMNT=/usr/local/poudriere/data/.m/132i386-quarterly/ref
LC_COLLATE=C
POUDRIERE_BUILD_TYPE=bulk
PACKAGE_BUILDING=yes
SAVED_TERM=
OUTPUT_REDIRECTED_STDERR=4
OUTPUT_REDIRECTED=1
PWD=/usr/local/poudriere/data/.m/132i386-quarterly/07/.p
OUTPUT_REDIRECTED_STDOUT=3
P_PORTS_FEATURES=FLAVORS SUBPACKAGES SELECTED_OPTIONS
MASTERNAME=132i386-quarterly
SCRIPTPREFIX=/usr/local/share/poudriere
SCRIPTNAME=bulk.sh
OLDPWD=/usr/local/poudriere/data/.m/132i386-quarterly/ref/.p/pool
POUDRIERE_PKGNAME=poudriere-git-3.4.1-30-g79e3edcd
SCRIPTPATH=/usr/local/share/poudriere/bulk.sh
POUDRIEREPATH=/usr/local/bin/poudriere
---End Environment---

---Begin Poudriere Port Flags/Env---
PORT_FLAGS=
PKGENV=
FLAVOR=
MAKE_ARGS=
---End Poudriere Port Flags/Env---

---Begin OPTIONS List---
---End OPTIONS List---

--MAINTAINER--
yuri@FreeBSD.org
--End MAINTAINER--

--CONFIGURE_ARGS--

--End CONFIGURE_ARGS--

--CONFIGURE_ENV--
XDG_DATA_HOME=/wrkdirs/usr/ports/devel/ignition-msgs/work  XDG_CONFIG_HOME=/wrkdirs/usr/ports/devel/ignition-msgs/work  XDG_CACHE_HOME=/wrkdirs/usr/ports/devel/ignition-msgs/work/.cache  HOME=/wrkdirs/usr/ports/devel/ignition-msgs/work TMPDIR="/tmp" PATH=/wrkdirs/usr/ports/devel/ignition-msgs/work/.bin:/sbin:/bin:/usr/sbin:/usr/bin:/usr/local/sbin:/usr/local/bin:/root/bin PKG_CONFIG_LIBDIR=/wrkdirs/usr/ports/devel/ignition-msgs/work/.pkgconfig:/usr/local/libdata/pkgconfig:/usr/local/share/pkgconfig:/usr/libdata/pkgconfig SHELL=/bin/sh CONFIG_SHELL=/bin/sh CMAKE_PREFIX_PATH="/usr/local"
--End CONFIGURE_ENV--

--MAKE_ENV--
NINJA_STATUS="[%p %s/%t] " XDG_DATA_HOME=/wrkdirs/usr/ports/devel/ignition-msgs/work  XDG_CONFIG_HOME=/wrkdirs/usr/ports/devel/ignition-msgs/work  XDG_CACHE_HOME=/wrkdirs/usr/ports/devel/ignition-msgs/work/.cache  HOME=/wrkdirs/usr/ports/devel/ignition-msgs/work TMPDIR="/tmp" PATH=/wrkdirs/usr/ports/devel/ignition-msgs/work/.bin:/sbin:/bin:/usr/sbin:/usr/bin:/usr/local/sbin:/usr/local/bin:/root/bin PKG_CONFIG_LIBDIR=/wrkdirs/usr/ports/devel/ignition-msgs/work/.pkgconfig:/usr/local/libdata/pkgconfig:/usr/local/share/pkgconfig:/usr/libdata/pkgconfig MK_DEBUG_FILES=no MK_KERNEL_SYMBOLS=no SHELL=/bin/sh NO_LINT=YES DESTDIR=/wrkdirs/usr/ports/devel/ignition-msgs/work/stage PREFIX=/usr/local  LOCALBASE=/usr/local  CC="cc" CFLAGS="-O2 -pipe  -fstack-protector-strong -isystem /usr/local/include -fno-strict-aliasing "  CPP="cpp" CPPFLAGS="-isystem /usr/local/include"  LDFLAGS=" -labsl_hash -labsl_log_internal_message -labsl_log_internal_nullguard -labsl_raw_hash_set -fstack-protector
-strong -L/usr/local/lib " LIBS=""  CXX="c++" CXXFLAGS="-O2 -pipe  -fstack-protector-strong -isystem /usr/local/include -fno-strict-aliasing   -isystem /usr/local/include -std=c++17 " BSD_INSTALL_PROGRAM="install  -s -m 555"  BSD_INSTALL_LIB="install  -s -m 0644"  BSD_INSTALL_SCRIPT="install  -m 555"  BSD_INSTALL_DATA="install  -m 0644"  BSD_INSTALL_MAN="install  -m 444"
--End MAKE_ENV--

--PLIST_SUB--
MSGS_IGN_VER=msgs3 CMAKE_BUILD_TYPE="release" RUBY_LIBDIR="lib/ruby/3.2" RUBY_ARCHLIBDIR="lib/ruby/3.2/i386-freebsd13" RUBY_SITELIBDIR="lib/ruby/site_ruby/3.2" RUBY_SITEARCHLIBDIR="lib/ruby/site_ruby/3.2/i386-freebsd13" RUBY_VENDORLIBDIR="lib/ruby/vendor_ruby/3.2" RUBY_VENDORARCHLIBDIR="lib/ruby/vendor_ruby/3.2/i386-freebsd13" RUBY_MODDOCDIR="share/doc/ruby32/ignition-msgs" RUBY_MODEXAMPLESDIR="share/examples/ruby32/ignition-msgs" RUBY_DOCDIR="share/doc/ruby32" RUBY_EXAMPLESDIR="share/examples/ruby32" RUBY_RIDIR="share/ri/3.2/system" RUBY_SITERIDIR="share/ri/3.2/site"  RUBY_VERSION="3.2.4"  RUBY_VER="3.2"  RUBY_SHLIBVER="32"  RUBY_ARCH="i386-freebsd13"  RUBY_SUFFIX="32"  RUBY_DEFAULT_SUFFIX="32" OSREL=13.2 PREFIX=%D LOCALBASE=/usr/local  RESETPREFIX=/usr/local LIB32DIR=lib DOCSDIR="share/doc/ignition-msgs"  EXAMPLESDIR="share/examples/ignition-msgs"  DATADIR="share/ignition-msgs"  WWWDIR="www/ignition-msgs"  ETCDIR="etc/ignition-msgs"
--End PLIST_SUB--

--SUB_LIST--
PREFIX=/usr/local LOCALBASE=/usr/local  DATADIR=/usr/local/share/ignition-msgs DOCSDIR=/usr/local/share/doc/ignition-msgs EXAMPLESDIR=/usr/local/share/examples/ignition-msgs  WWWDIR=/usr/local/www/ignition-msgs ETCDIR=/usr/local/etc/ignition-msgs
--End SUB_LIST--

---Begin make.conf---
USE_PACKAGE_DEPENDS=yes
BATCH=yes
WRKDIRPREFIX=/wrkdirs
PORTSDIR=/usr/ports
PACKAGES=/packages
DISTDIR=/distfiles
PACKAGE_BUILDING=yes
PACKAGE_BUILDING_FLAVORS=yes
MACHINE=i386
MACHINE_ARCH=i386
ARCH=${MACHINE_ARCH}
####  ####
# XXX: We really need this but cannot use it while 'make checksum' does not
# try the next mirror on checksum failure.  It currently retries the same
# failed mirror and then fails rather then trying another.  It *does*
# try the next if the size is mismatched though.
#MASTER_SITE_FREEBSD=yes
# Build ALLOW_MAKE_JOBS_PACKAGES with 3 jobs
MAKE_JOBS_NUMBER=3
#### Misc Poudriere ####
.include "/etc/make.conf.ports_env"
GID=0
UID=0
---End make.conf---
--Resource limits--
cpu time               (seconds, -t)  unlimited
file size           (512-blocks, -f)  unlimited
data seg size           (kbytes, -d)  524288
stack size              (kbytes, -s)  65536
core file size      (512-blocks, -c)  unlimited
max memory size         (kbytes, -m)  unlimited
locked memory           (kbytes, -l)  unlimited
max user processes              (-u)  89999
open files                      (-n)  8192
virtual mem size        (kbytes, -v)  unlimited
swap limit              (kbytes, -w)  unlimited
socket buffer size       (bytes, -b)  unlimited
pseudo-terminals                (-p)  unlimited
kqueues                         (-k)  unlimited
umtx shared locks               (-o)  unlimited
--End resource limits--
=======================<phase: check-sanity   >============================
===== env: NO_DEPENDS=yes USER=root UID=0 GID=0
===>  License APACHE20 accepted by the user
===========================================================================
=======================<phase: pkg-depends    >============================
===== env: USE_PACKAGE_DEPENDS_ONLY=1 USER=root UID=0 GID=0
===>   ignition-msgs-3.0.0_15 depends on file: /usr/local/sbin/pkg - not found
===>   Installing existing package /packages/All/pkg-1.21.3.pkg
[132i386-quarterly-job-07] Installing pkg-1.21.3...
[132i386-quarterly-job-07] Extracting pkg-1.21.3: .......... done
===>   ignition-msgs-3.0.0_15 depends on file: /usr/local/sbin/pkg - found
===>   Returning to build of ignition-msgs-3.0.0_15
===========================================================================
=======================<phase: fetch-depends  >============================
===== env: USE_PACKAGE_DEPENDS_ONLY=1 USER=root UID=0 GID=0
===========================================================================
=======================<phase: fetch          >============================
===== env: NO_DEPENDS=yes USER=root UID=0 GID=0
===>  License APACHE20 accepted by the user
===> Fetching all distfiles required by ignition-msgs-3.0.0_15 for building
===========================================================================
=======================<phase: checksum       >============================
===== env: NO_DEPENDS=yes USER=root UID=0 GID=0
===>  License APACHE20 accepted by the user
===> Fetching all distfiles required by ignition-msgs-3.0.0_15 for building
=> SHA256 Checksum OK for ignition-msgs-3.0.0.tar.gz.
===========================================================================
=======================<phase: extract-depends>============================
===== env: USE_PACKAGE_DEPENDS_ONLY=1 USER=root UID=0 GID=0
===>   ignition-msgs-3.0.0_15 depends on file: /usr/local/bin/ruby32 - not found
===>   Installing existing package /packages/All/ruby-3.2.4,1.pkg
[132i386-quarterly-job-07] Installing ruby-3.2.4,1...
[132i386-quarterly-job-07] `-- Installing libedit-3.1.20230828_1,1...
[132i386-quarterly-job-07] `-- Extracting libedit-3.1.20230828_1,1: .......... done
[132i386-quarterly-job-07] `-- Installing libffi-3.4.4_1...
[132i386-quarterly-job-07] |   `-- Installing indexinfo-0.3.1...
[132i386-quarterly-job-07] |   `-- Extracting indexinfo-0.3.1: .... done
[132i386-quarterly-job-07] `-- Extracting libffi-3.4.4_1: .......... done
[132i386-quarterly-job-07] `-- Installing libunwind-20240221...
[132i386-quarterly-job-07] `-- Extracting libunwind-20240221: .......... done
[132i386-quarterly-job-07] `-- Installing libyaml-0.2.5...
[132i386-quarterly-job-07] `-- Extracting libyaml-0.2.5: ......... done
[132i386-quarterly-job-07] Extracting ruby-3.2.4,1: .......... done
=====
Message from ruby-3.2.4,1:

--
Some of the standard commands and libraries are provided as separate
ports for ease of upgrading:

	devel/ruby-gems:		gem - RubyGems package manager
	devel/rubygem-debug:		debug - Debugging functionality for Ruby
	devel/rubygem-erb:		erb - Templating system for Ruby
	devel/rubygem-irb:		irb - Interactive Ruby
	devel/rubygem-minitest:		minitest - Complete suite of testing facilities
	devel/rubygem-power_assert:	power_assert - Power Assert for Ruby
	devel/rubygem-rake:		rake - Ruby Make
	devel/rubygem-rbs:		rbs - Language for type signatures for Ruby and standard library definitions
	devel/rubygem-rdoc:		rdoc - Ruby Documentation System
	devel/rubygem-test-unit:	test-unit - Unit testing framework for Ruby
	devel/rubygem-typeprof:		typeprof - Type analysis tool for Ruby code
	ftp/rubygem-net-ftp:		net-ftp - Support for the File Transfer Protocol
	mail/rubygem-net-imap:		net-imap - Ruby client api for Internet Message Access Protocol
	mail/rubygem-net-pop:		net-pop - Ruby client library for POP3
	mail/rubygem-net-smtp:		net-smtp - Simple Mail Transfer Protocol client library for Ruby
	math/rubygem-matrix:		matrix - Implementation of Matrix and Vector classes
	math/rubygem-prime:		prime - Prime numbers and factorization library
	sysutils/rubygem-bundler:	bundler - Tool that manages gem dependencies for ruby applications
<snip>
[132i386-quarterly-job-07] `-- Installing libuv-1.48.0...
[132i386-quarterly-job-07] `-- Extracting libuv-1.48.0: .......... done
[132i386-quarterly-job-07] `-- Installing rhash-1.4.4_1...
[132i386-quarterly-job-07] |   `-- Installing gettext-runtime-0.22.5...
[132i386-quarterly-job-07] |   `-- Extracting gettext-runtime-0.22.5: .......... done
[132i386-quarterly-job-07] `-- Extracting rhash-1.4.4_1: .......... done
[132i386-quarterly-job-07] Extracting cmake-core-3.28.3: .......... done
===>   ignition-msgs-3.0.0_15 depends on file: /usr/local/bin/cmake - found
===>   Returning to build of ignition-msgs-3.0.0_15
===>   ignition-msgs-3.0.0_15 depends on executable: ninja - not found
===>   Installing existing package /packages/All/ninja-1.11.1,2.pkg
[132i386-quarterly-job-07] Installing ninja-1.11.1,2...
[132i386-quarterly-job-07] `-- Installing python39-3.9.18_2...
[132i386-quarterly-job-07] |   `-- Installing mpdecimal-4.0.0...
[132i386-quarterly-job-07] |   `-- Extracting mpdecimal-4.0.0: .......... done
[132i386-quarterly-job-07] |   `-- Installing readline-8.2.10...
[132i386-quarterly-job-07] |   `-- Extracting readline-8.2.10: .......... done
[132i386-quarterly-job-07] `-- Extracting python39-3.9.18_2: .......... done
[132i386-quarterly-job-07] Extracting ninja-1.11.1,2: ........ done
=====
Message from python39-3.9.18_2:

--
Note that some standard Python modules are provided as separate ports
as they require additional dependencies. They are available as:

py39-gdbm       databases/py-gdbm@py39
py39-sqlite3    databases/py-sqlite3@py39
py39-tkinter    x11-toolkits/py-tkinter@py39
===>   ignition-msgs-3.0.0_15 depends on executable: ninja - found
===>   Returning to build of ignition-msgs-3.0.0_15
===>   ignition-msgs-3.0.0_15 depends on file: /usr/local/bin/ruby32 - found
===========================================================================
=======================<phase: lib-depends    >============================
===== env: USE_PACKAGE_DEPENDS_ONLY=1 USER=root UID=0 GID=0
===>   ignition-msgs-3.0.0_15 depends on shared library: libprotobuf.so - not found
===>   Installing existing package /packages/All/protobuf-24.4,1.pkg
[132i386-quarterly-job-07] Installing protobuf-24.4,1...
[132i386-quarterly-job-07] `-- Installing abseil-20230125.3...
[132i386-quarterly-job-07] `-- Extracting abseil-20230125.3: .......... done
[132i386-quarterly-job-07] Extracting protobuf-24.4,1: .......... done
===>   ignition-msgs-3.0.0_15 depends on shared library: libprotobuf.so - found (/usr/local/lib/libprotobuf.so)
===>   Returning to build of ignition-msgs-3.0.0_15
===>   ignition-msgs-3.0.0_15 depends on shared library: libignition-math6.so - not found
===>   Installing existing package /packages/All/ignition-math-6.0.0_5.pkg
[132i386-quarterly-job-07] Installing ignition-math-6.0.0_5...
[132i386-quarterly-job-07] Extracting ignition-math-6.0.0_5: .......... done
===>   ignition-msgs-3.0.0_15 depends on shared library: libignition-math6.so - found (/usr/local/lib/libignition-math6.so)
===>   Returning to build of ignition-msgs-3.0.0_15
===========================================================================
=======================<phase: configure      >============================
===== env: NO_DEPENDS=yes USER=root UID=0 GID=0
===>  Configuring for ignition-msgs-3.0.0_15
===>  Performing out-of-source build
/bin/mkdir -p /wrkdirs/usr/ports/devel/ignition-msgs/work/.build
-- The C compiler identification is Clang 14.0.5
-- The CXX compiler identification is Clang 14.0.5
-- Detecting C compiler ABI info
-- Detecting C compiler ABI info - done
-- Check for working C compiler: /usr/bin/cc - skipped
-- Detecting C compile features
-- Detecting C compile features - done
-- Detecting CXX compiler ABI info
-- Detecting CXX compiler ABI info - done
-- Check for working CXX compiler: /usr/bin/c++ - skipped
-- Detecting CXX compile features
-- Detecting CXX compile features - done
-- ignition-msgs3 version 3.0.0~pre3
-- Operating system is BSD
-- 

-- ====== Finding Dependencies ======
-- Found Protobuf: /usr/local/lib/libprotobuf.so;-lpthread (found suitable version "4.24.4", minimum required is "3") 
-- Looking for Protobuf - found

-- Looking for ignition-math6 -- found version 6.0.0~pre4
-- Searching for dependencies of ignition-math6
-- Looking for ignition-math6 - found

-- Looking for ignition-tools - found

CMake Warning (dev) at /usr/local/share/cmake/ignition-cmake2/cmake2/IgnSetCompilerFlags.cmake:77 (exec_program):
  Policy CMP0153 is not set: The exec_program command should not be called.
  Run "cmake --help-policy CMP0153" for policy details.  Use the cmake_policy
  command to set the policy and suppress this warning.

  Use execute_process() instead.
Call Stack (most recent call first):
  /usr/local/share/cmake/ignition-cmake2/cmake2/IgnSetCompilerFlags.cmake:33 (ign_setup_unix)
  /usr/local/share/cmake/ignition-cmake2/cmake2/IgnConfigureBuild.cmake:86 (ign_set_compiler_flags)
  CMakeLists.txt:52 (ign_configure_build)
This warning is for project developers.  Use -Wno-dev to suppress it.

-- 
-- Searching for host SSE information
-- Could not find hardware support for SSE3 on this machine.
-- Could not find hardware support for SSSE3 on this machine.
-- Could not find hardware support for SSE4.1 on this machine.
-- Could not find hardware support for SSE4.2 on this machine.
-- SSE2 found
-- SSE4 disabled.
--
-- Installing Ruby messages to /usr/local/lib/ruby/ignition/msgs
-- Configuring library: ignition-msgs3
-- Performing Test COMPILER_HAS_HIDDEN_VISIBILITY
-- Performing Test COMPILER_HAS_HIDDEN_VISIBILITY - Success
-- Performing Test COMPILER_HAS_HIDDEN_INLINE_VISIBILITY
-- Performing Test COMPILER_HAS_HIDDEN_INLINE_VISIBILITY - Success
-- Performing Test COMPILER_HAS_DEPRECATED_ATTR
-- Performing Test COMPILER_HAS_DEPRECATED_ATTR - Success
-- Adding 2 UNIT tests
CMake Warning (dev) at /usr/local/share/cmake/ignition-cmake2/cmake2/IgnUtils.cmake:1643 (find_package):
  Policy CMP0148 is not set: The FindPythonInterp and FindPythonLibs modules
  are removed.  Run "cmake --help-policy CMP0148" for policy details.  Use
  the cmake_policy command to set the policy and suppress this warning.

Call Stack (most recent call first):
  src/CMakeLists.txt:202 (ign_build_tests)
This warning is for project developers.  Use -Wno-dev to suppress it.

-- Adding 1 INTEGRATION tests
CMake Warning (dev) at /usr/local/share/cmake/ignition-cmake2/cmake2/IgnUtils.cmake:1643 (find_package):
  Policy CMP0148 is not set: The FindPythonInterp and FindPythonLibs modules
  are removed.  Run "cmake --help-policy CMP0148" for policy details.  Use
  the cmake_policy command to set the policy and suppress this warning.

Call Stack (most recent call first):
  test/integration/CMakeLists.txt:9 (ign_build_tests)
This warning is for project developers.  Use -Wno-dev to suppress it.

-- No tests have been specified for PERFORMANCE
CMake Warning (dev) at /usr/local/share/cmake/ignition-cmake2/cmake2/IgnUtils.cmake:1643 (find_package):
  Policy CMP0148 is not set: The FindPythonInterp and FindPythonLibs modules
  are removed.  Run "cmake --help-policy CMP0148" for policy details.  Use
  the cmake_policy command to set the policy and suppress this warning.

Call Stack (most recent call first):
  test/performance/CMakeLists.txt:4 (ign_build_tests)
This warning is for project developers.  Use -Wno-dev to suppress it.

-- No tests have been specified for REGRESION
CMake Warning (dev) at /usr/local/share/cmake/ignition-cmake2/cmake2/IgnUtils.cmake:1643 (find_package):
  Policy CMP0148 is not set: The FindPythonInterp and FindPythonLibs modules
  are removed.  Run "cmake --help-policy CMP0148" for policy details.  Use
  the cmake_policy command to set the policy and suppress this warning.

Call Stack (most recent call first):
  test/regression/CMakeLists.txt:4 (ign_build_tests)
This warning is for project developers.  Use -Wno-dev to suppress it.

-- The program [cppcheck] was not found! Skipping codecheck setup
-- Build configuration successful
-- Adding 1 UNIT tests
CMake Warning (dev) at /usr/local/share/cmake/ignition-cmake2/cmake2/IgnUtils.cmake:1643 (find_package):
  Policy CMP0148 is not set: The FindPythonInterp and FindPythonLibs modules
  are removed.  Run "cmake --help-policy CMP0148" for policy details.  Use
  the cmake_policy command to set the policy and suppress this warning.

Call Stack (most recent call first):
  tools/CMakeLists.txt:11 (ign_build_tests)
This warning is for project developers.  Use -Wno-dev to suppress it.

-- Build type: Release
-- Install prefix: /usr/local
-- Could NOT find Doxygen (missing: DOXYGEN_EXECUTABLE) 
-- Configuring done (3.4s)
-- Generating done (0.1s)
CMake Warning:
  Manually-specified variables were not used by the project:

    CMAKE_COLOR_MAKEFILE
    CMAKE_MODULE_LINKER_FLAGS
    CMAKE_VERBOSE_MAKEFILE
    FETCHCONTENT_FULLY_DISCONNECTED


-- Build files have been written to: /wrkdirs/usr/ports/devel/ignition-msgs/work/.build
===========================================================================
=======================<phase: build          >============================
===== env: NO_DEPENDS=yes USER=root UID=0 GID=0
===>  Building for ignition-msgs-3.0.0_15
[  0% 3/307] /usr/bin/c++  -I/wrkdirs/usr/ports/devel/ignition-msgs/work/ignitionrobotics-ign-msgs-4a1cbcabff7d/include -I/wrkdirs/usr/ports/devel/ignition-msgs/work/.build/include -O2 -pipe  -fstack-protector-strong -isystem /usr/local/include -fno-strict-aliasing   -isystem /usr/local/include -std=c++17 -O2 -pipe  -fstack-protector-strong -isystem /usr/local/include -fno-strict-aliasing   -isystem /usr/local/include -std=c++17  -DNDEBUG  -Wall -Wextra -Wno-long-long -Wno-unused-value -Wfloat-equal -Wshadow -Winit-self -Wswitch-default -Wmissing-include-dirs -pedantic  -msse -msse2 -mfpmath=sse -pthread -MD -MT src/CMakeFiles/ign_msgs_gen.dir/generator_main.cc.o -MF src/CMakeFiles/ign_msgs_gen.dir/generator_main.cc.o.d -o src/CMakeFiles/ign_msgs_gen.dir/generator_main.cc.o -c /wrkdirs/usr/ports/devel/ignition-msgs/work/ignitionrobotics-ign-msgs-4a1cbcabff7d/src/generator_main.cc
[  0% 4/307] /usr/bin/c++  -I/wrkdirs/usr/ports/devel/ignition-msgs/work/ignitionrobotics-ign-msgs-4a1cbcabff7d/include -I/wrkdirs/usr/ports/devel/ignition-msgs/work/.build/include -I/wrkdirs/usr/ports/devel/ignition-msgs/work/ignitionrobotics-ign-msgs-4a1cbcabff7d/test/gtest/include -I/wrkdirs/usr/ports/devel/ignition-msgs/work/ignitionrobotics-ign-msgs-4a1cbcabff7d/test/gtest -I/wrkdirs/usr/ports/devel/ignition-msgs/work/ignitionrobotics-ign-msgs-4a1cbcabff7d/test -O2 -pipe  -fstack-protector-strong -isystem /usr/local/include -fno-strict-aliasing   -isystem /usr/local/include -std=c++17 -O2 -pipe  -fstack-protector-strong -isystem /usr/local/include -fno-strict-aliasing   -isystem /usr/local/include -std=c++17  -DNDEBUG  -Wall -Wextra -Wno-long-long -Wno-unused-value -Wfloat-equal -Wshadow -Winit-self -Wswitch-default -Wmissing-include-dirs -pedantic  -msse -msse2 -mfpmath=sse -MD -MT test/CMakeFiles/gtest_main.dir/gtest/src/gtest_main.cc.o -MF test/CMakeFiles/gtest_main.
dir/gtest/src/gtest_main.cc.o.d -o test/CMakeFiles/gtest_main.dir/gtest/src/gtest_main.cc.o -c /wrkdirs/usr/ports/devel/ignition-msgs/work/ignitionrobotics-ign-msgs-4a1cbcabff7d/test/gtest/src/gtest_main.cc
[  0% 4/307] /usr/bin/c++  -I/wrkdirs/usr/ports/devel/ignition-msgs/work/ignitionrobotics-ign-msgs-4a1cbcabff7d/include -I/wrkdirs/usr/ports/devel/ignition-msgs/work/.build/include -O2 -pipe  -fstack-protector-strong -isystem /usr/local/include -fno-strict-aliasing   -isystem /usr/local/include -std=c++17 -O2 -pipe  -fstack-protector-strong -isystem /usr/local/include -fno-strict-aliasing   -isystem /usr/local/include -std=c++17  -DNDEBUG  -Wall -Wextra -Wno-long-long -Wno-unused-value -Wfloat-equal -Wshadow -Winit-self -Wswitch-default -Wmissing-include-dirs -pedantic  -msse -msse2 -mfpmath=sse -pthread -MD -MT src/CMakeFiles/ign_msgs_gen.dir/Generator.cc.o -MF src/CMakeFiles/ign_msgs_gen.dir/Generator.cc.o.d -o src/CMakeFiles/ign_msgs_gen.dir/Generator.cc.o -c /wrkdirs/usr/ports/devel/ignition-msgs/work/ignitionrobotics-ign-msgs-4a1cbcabff7d/src/Generator.cc
[  1% 5/307] : && /usr/bin/c++ -O2 -pipe  -fstack-protector-strong -isystem /usr/local/include -fno-strict-aliasing   -isystem /usr/local/include -std=c++17 -O2 -pipe  -fstack-protector-strong -isystem /usr/local/include -fno-strict-aliasing   -isystem /usr/local/include -std=c++17  -DNDEBUG  -Wall -Wextra -Wno-long-long -Wno-unused-value -Wfloat-equal -Wshadow -Winit-self -Wswitch-default -Wmissing-include-dirs -pedantic -labsl_hash -labsl_log_internal_message -labsl_log_internal_nullguard -labsl_raw_hash_set -fstack-protector-strong -L/usr/local/lib src/CMakeFiles/ign_msgs_gen.dir/Generator.cc.o src/CMakeFiles/ign_msgs_gen.dir/generator_main.cc.o -o bin/ign_msgs_gen  /usr/local/lib/libprotobuf.so  /usr/local/lib/libprotoc.so  -lpthread  -lpthread && :
FAILED: bin/ign_msgs_gen 
: && /usr/bin/c++ -O2 -pipe  -fstack-protector-strong -isystem /usr/local/include -fno-strict-aliasing   -isystem /usr/local/include -std=c++17 -O2 -pipe  -fstack-protector-strong -isystem /usr/local/include -fno-strict-aliasing   -isystem /usr/local/include -std=c++17  -DNDEBUG  -Wall -Wextra -Wno-long-long -Wno-unused-value -Wfloat-equal -Wshadow -Winit-self -Wswitch-default -Wmissing-include-dirs -pedantic -labsl_hash -labsl_log_internal_message -labsl_log_internal_nullguard -labsl_raw_hash_set -fstack-protector-strong -L/usr/local/lib src/CMakeFiles/ign_msgs_gen.dir/Generator.cc.o src/CMakeFiles/ign_msgs_gen.dir/generator_main.cc.o -o bin/ign_msgs_gen  /usr/local/lib/libprotobuf.so  /usr/local/lib/libprotoc.so  -lpthread  -lpthread && :
ld: error: undefined symbol: absl::lts_20230125::hash_internal::CityHash32(char const*, unsigned int)
>>> referenced by Generator.cc
>>>               src/CMakeFiles/ign_msgs_gen.dir/Generator.cc.o:(std::__1::enable_if<std::is_same<absl::lts_20230125::hash_internal::MixingHashState, decltype(AbslHashValue(std::move(fp), fp0))>::value, absl::lts_20230125::hash_internal::MixingHashState>::type absl::lts_20230125::hash_internal::HashSelect::HashValueProbe::Invoke<absl::lts_20230125::hash_internal::MixingHashState, std::__1::basic_string_view<char, std::__1::char_traits<char> > >(absl::lts_20230125::hash_internal::MixingHashState, std::__1::basic_string_view<char, std::__1::char_traits<char> > const&))
c++: error: linker command failed with exit code 1 (use -v to see invocation)
[  1% 5/307] /usr/bin/c++  -I/wrkdirs/usr/ports/devel/ignition-msgs/work/ignitionrobotics-ign-msgs-4a1cbcabff7d/include -I/wrkdirs/usr/ports/devel/ignition-msgs/work/.build/include -I/wrkdirs/usr/ports/devel/ignition-msgs/work/ignitionrobotics-ign-msgs-4a1cbcabff7d/test/gtest/include -I/wrkdirs/usr/ports/devel/ignition-msgs/work/ignitionrobotics-ign-msgs-4a1cbcabff7d/test/gtest -I/wrkdirs/usr/ports/devel/ignition-msgs/work/ignitionrobotics-ign-msgs-4a1cbcabff7d/test -O2 -pipe  -fstack-protector-strong -isystem /usr/local/include -fno-strict-aliasing   -isystem /usr/local/include -std=c++17 -O2 -pipe  -fstack-protector-strong -isystem /usr/local/include -fno-strict-aliasing   -isystem /usr/local/include -std=c++17  -DNDEBUG  -Wall -Wextra -Wno-long-long -Wno-unused-value -Wfloat-equal -Wshadow -Winit-self -Wswitch-default -Wmissing-include-dirs -pedantic  -msse -msse2 -mfpmath=sse -MD -MT test/CMakeFiles/gtest.dir/gtest/src/gtest-all.cc.o -MF test/CMakeFiles/gtest.dir/gtest/s
rc/gtest-all.cc.o.d -o test/CMakeFiles/gtest.dir/gtest/src/gtest-all.cc.o -c /wrkdirs/usr/ports/devel/ignition-msgs/work/ignitionrobotics-ign-msgs-4a1cbcabff7d/test/gtest/src/gtest-all.cc
ninja: build stopped: subcommand failed.
===> Compilation failed unexpectedly.
Try to set MAKE_JOBS_UNSAFE=yes and rebuild before reporting the failure to
the maintainer.
*** Error code 1

Stop.
make: stopped in /usr/ports/devel/ignition-msgs