[package - 132i386-quarterly][editors/lazarus-qt5-devel] Failed for lazarus-qt5-devel-3.3.1.20240323 in build

From: <pkg-fallout_at_FreeBSD.org>
Date: Sat, 22 Jun 2024 10:21:47 UTC
You are receiving this mail as a port that you maintain
is failing to build on the FreeBSD package build server.
Please investigate the failure and submit a PR to fix
build.

Maintainer:     acm@FreeBSD.org
Log URL:        https://pkg-status.freebsd.org/beefy13/data/132i386-quarterly/9a99f5d9d351/logs/lazarus-qt5-devel-3.3.1.20240323.log
Build URL:      https://pkg-status.freebsd.org/beefy13/build.html?mastername=132i386-quarterly&build=9a99f5d9d351
Log:

=>> Building editors/lazarus-qt5-devel
build started at Sat Jun 22 10:18:52 UTC 2024
port directory: /usr/ports/editors/lazarus-qt5-devel
package name: lazarus-qt5-devel-3.3.1.20240323
building for: FreeBSD 132i386-quarterly-job-09 13.2-RELEASE-p11 FreeBSD 13.2-RELEASE-p11 i386
maintained by: acm@FreeBSD.org
Makefile datestamp: -rw-r--r--  1 root  wheel  344 Apr  9 01:02 /usr/ports/editors/lazarus-qt5-devel/Makefile
Ports top last git commit: 9a99f5d9d
Ports top unclean checkout: no
Port dir last git commit: c5cd82114
Port dir unclean checkout: no
Poudriere version: poudriere-git-3.4.1-30-g79e3edcd
Host OSVERSION: 1500018
Jail OSVERSION: 1302001
Job Id: 09

---Begin Environment---
SHELL=/bin/csh
BLOCKSIZE=K
MAIL=/var/mail/root
MM_CHARSET=UTF-8
LANG=C.UTF-8
OSVERSION=1302001
STATUS=1
HOME=/root
PATH=/sbin:/bin:/usr/sbin:/usr/bin:/usr/local/sbin:/usr/local/bin:/root/bin
MAKE_OBJDIR_CHECK_WRITABLE=0
UNAME_m=i386
UNAME_p=i386
UNAME_r=13.2-RELEASE-p11
LOCALBASE=/usr/local
UNAME_v=FreeBSD 13.2-RELEASE-p11
USER=root
POUDRIERE_NAME=poudriere-git
LIBEXECPREFIX=/usr/local/libexec/poudriere
POUDRIERE_VERSION=3.4.1-30-g79e3edcd
MASTERMNT=/usr/local/poudriere/data/.m/132i386-quarterly/ref
LC_COLLATE=C
POUDRIERE_BUILD_TYPE=bulk
PACKAGE_BUILDING=yes
SAVED_TERM=
OUTPUT_REDIRECTED_STDERR=4
OUTPUT_REDIRECTED=1
PWD=/usr/local/poudriere/data/.m/132i386-quarterly/09/.p
OUTPUT_REDIRECTED_STDOUT=3
P_PORTS_FEATURES=FLAVORS SUBPACKAGES SELECTED_OPTIONS
MASTERNAME=132i386-quarterly
SCRIPTPREFIX=/usr/local/share/poudriere
SCRIPTNAME=bulk.sh
OLDPWD=/usr/local/poudriere/data/.m/132i386-quarterly/ref/.p/pool
POUDRIERE_PKGNAME=poudriere-git-3.4.1-30-g79e3edcd
SCRIPTPATH=/usr/local/share/poudriere/bulk.sh
POUDRIEREPATH=/usr/local/bin/poudriere
---End Environment---

---Begin Poudriere Port Flags/Env---
PORT_FLAGS=
PKGENV=
FLAVOR=
MAKE_ARGS=
---End Poudriere Port Flags/Env---

---Begin OPTIONS List---
===> The following configuration options are available for lazarus-qt5-devel-3.3.1.20240323:
     GDB=on: Install a newest version  of gdb
===> Use 'make config' to modify these settings
---End OPTIONS List---

--MAINTAINER--
acm@FreeBSD.org
--End MAINTAINER--

--CONFIGURE_ARGS--

--End CONFIGURE_ARGS--

--CONFIGURE_ENV--
MAKE=gmake XDG_DATA_HOME=/wrkdirs/usr/ports/editors/lazarus-qt5-devel/work  XDG_CONFIG_HOME=/wrkdirs/usr/ports/editors/lazarus-qt5-devel/work  XDG_CACHE_HOME=/wrkdirs/usr/ports/editors/lazarus-qt5-devel/work/.cache  HOME=/wrkdirs/usr/ports/editors/lazarus-qt5-devel/work TMPDIR="/tmp" PATH=/wrkdirs/usr/ports/editors/lazarus-qt5-devel/work/.bin:/sbin:/bin:/usr/sbin:/usr/bin:/usr/local/sbin:/usr/local/bin:/root/bin PKG_CONFIG_LIBDIR=/wrkdirs/usr/ports/editors/lazarus-qt5-devel/work/.pkgconfig:/usr/local/libdata/pkgconfig:/usr/local/share/pkgconfig:/usr/libdata/pkgconfig SHELL=/bin/sh CONFIG_SHELL=/bin/sh
--End CONFIGURE_ENV--

--MAKE_ENV--
OPT="-Sgic " XDG_DATA_HOME=/wrkdirs/usr/ports/editors/lazarus-qt5-devel/work  XDG_CONFIG_HOME=/wrkdirs/usr/ports/editors/lazarus-qt5-devel/work  XDG_CACHE_HOME=/wrkdirs/usr/ports/editors/lazarus-qt5-devel/work/.cache  HOME=/wrkdirs/usr/ports/editors/lazarus-qt5-devel/work TMPDIR="/tmp" PATH=/wrkdirs/usr/ports/editors/lazarus-qt5-devel/work/.bin:/sbin:/bin:/usr/sbin:/usr/bin:/usr/local/sbin:/usr/local/bin:/root/bin PKG_CONFIG_LIBDIR=/wrkdirs/usr/ports/editors/lazarus-qt5-devel/work/.pkgconfig:/usr/local/libdata/pkgconfig:/usr/local/share/pkgconfig:/usr/libdata/pkgconfig MK_DEBUG_FILES=no MK_KERNEL_SYMBOLS=no SHELL=/bin/sh NO_LINT=YES PREFIX=/usr/local  LOCALBASE=/usr/local  CC="cc" CFLAGS="-O2 -pipe  -DLIBICONV_PLUG -fstack-protector-strong -fno-strict-aliasing "  CPP="cpp" CPPFLAGS="-DLIBICONV_PLUG"  LDFLAGS=" -fstack-protector-strong " LIBS=""  CXX="c++" CXXFLAGS="-O2 -pipe -DLIBICONV_PLUG -fstack-protector-strong -fno-strict-aliasing  -DLIBICONV_PLUG " BSD_INSTALL_PROGRAM=
"install  -s -m 555"  BSD_INSTALL_LIB="install  -s -m 0644"  BSD_INSTALL_SCRIPT="install  -m 555"  BSD_INSTALL_DATA="install  -m 0644"  BSD_INSTALL_MAN="install  -m 444"
--End MAKE_ENV--

--PLIST_SUB--
 OSREL=13.2 PREFIX=%D LOCALBASE=/usr/local  RESETPREFIX=/usr/local LIB32DIR=lib DOCSDIR="share/doc/lazarus"  EXAMPLESDIR="share/examples/lazarus"  DATADIR="share/lazarus-3.3.1"  WWWDIR="www/lazarus"  ETCDIR="etc/lazarus"
--End PLIST_SUB--

--SUB_LIST--
 PORTSDIR="/usr/ports" PREFIX=/usr/local LOCALBASE=/usr/local  DATADIR=/usr/local/share/lazarus-3.3.1 DOCSDIR=/usr/local/share/doc/lazarus EXAMPLESDIR=/usr/local/share/examples/lazarus  WWWDIR=/usr/local/www/lazarus ETCDIR=/usr/local/etc/lazarus
--End SUB_LIST--

---Begin make.conf---
USE_PACKAGE_DEPENDS=yes
BATCH=yes
WRKDIRPREFIX=/wrkdirs
PORTSDIR=/usr/ports
PACKAGES=/packages
DISTDIR=/distfiles
PACKAGE_BUILDING=yes
PACKAGE_BUILDING_FLAVORS=yes
MACHINE=i386
MACHINE_ARCH=i386
ARCH=${MACHINE_ARCH}
####  ####
# XXX: We really need this but cannot use it while 'make checksum' does not
# try the next mirror on checksum failure.  It currently retries the same
# failed mirror and then fails rather then trying another.  It *does*
# try the next if the size is mismatched though.
#MASTER_SITE_FREEBSD=yes
# Build ALLOW_MAKE_JOBS_PACKAGES with 3 jobs
MAKE_JOBS_NUMBER=3
#### Misc Poudriere ####
.include "/etc/make.conf.ports_env"
GID=0
UID=0
---End make.conf---
--Resource limits--
cpu time               (seconds, -t)  unlimited
file size           (512-blocks, -f)  unlimited
data seg size           (kbytes, -d)  524288
stack size              (kbytes, -s)  65536
core file size      (512-blocks, -c)  unlimited
max memory size         (kbytes, -m)  unlimited
locked memory           (kbytes, -l)  unlimited
max user processes              (-u)  89999
open files                      (-n)  8192
virtual mem size        (kbytes, -v)  unlimited
swap limit              (kbytes, -w)  unlimited
socket buffer size       (bytes, -b)  unlimited
pseudo-terminals                (-p)  unlimited
kqueues                         (-k)  unlimited
umtx shared locks               (-o)  unlimited
--End resource limits--
=======================<phase: check-sanity   >============================
===== env: NO_DEPENDS=yes USER=root UID=0 GID=0
===========================================================================
=======================<phase: pkg-depends    >============================
===== env: USE_PACKAGE_DEPENDS_ONLY=1 USER=root UID=0 GID=0
===>   lazarus-qt5-devel-3.3.1.20240323 depends on file: /usr/local/sbin/pkg - not found
===>   Installing existing package /packages/All/pkg-1.21.3.pkg
[132i386-quarterly-job-09] Installing pkg-1.21.3...
[132i386-quarterly-job-09] Extracting pkg-1.21.3: .......... done
===>   lazarus-qt5-devel-3.3.1.20240323 depends on file: /usr/local/sbin/pkg - found
===>   Returning to build of lazarus-qt5-devel-3.3.1.20240323
===========================================================================
=======================<phase: fetch-depends  >============================
===== env: USE_PACKAGE_DEPENDS_ONLY=1 USER=root UID=0 GID=0
===========================================================================
=======================<phase: fetch          >============================
===== env: NO_DEPENDS=yes USER=root UID=0 GID=0
===> Fetching all distfiles required by lazarus-qt5-devel-3.3.1.20240323 for building
===========================================================================
=======================<phase: checksum       >============================
===== env: NO_DEPENDS=yes USER=root UID=0 GID=0
===> Fetching all distfiles required by lazarus-qt5-devel-3.3.1.20240323 for building
=> SHA256 Checksum OK for freepascal/freepascal.org/lazarus-lazarus-db6ed214b9647d2729a5cde1c69893048ce0b18c_GL0.tar.gz.
===========================================================================
=======================<phase: extract-depends>============================
===== env: USE_PACKAGE_DEPENDS_ONLY=1 USER=root UID=0 GID=0
===========================================================================
=======================<phase: extract        >============================
===== env: NO_DEPENDS=yes USER=root UID=0 GID=0
===> Fetching all distfiles required by lazarus-qt5-devel-3.3.1.20240323 for building
===>  Extracting for lazarus-qt5-devel-3.3.1.20240323
=> SHA256 Checksum OK for freepascal/freepascal.org/lazarus-lazarus-db6ed214b9647d2729a5cde1c69893048ce0b18c_GL0.tar.gz.
===========================================================================
=======================<phase: patch-depends  >============================
===== env: USE_PACKAGE_DEPENDS_ONLY=1 USER=root UID=0 GID=0
===========================================================================
=======================<phase: patch          >============================
===== env: NO_DEPENDS=yes USER=root UID=0 GID=0
===>  Patching for lazarus-qt5-devel-3.3.1.20240323
===========================================================================
=======================<phase: build-depends  >============================
===== env: USE_PACKAGE_DEPENDS_ONLY=1 USER=root UID=0 GID=0
===>   lazarus-qt5-devel-3.3.1.20240323 depends on file: /usr/local/bin/as - not found
===>   Installing existing package /packages/All/binutils-2.40_5,1.pkg
[132i386-quarterly-job-09] Installing binutils-2.40_5,1...
[132i386-quarterly-job-09] `-- Installing gettext-runtime-0.22.5...
[132i386-quarterly-job-09] |   `-- Installing indexinfo-0.3.1...
[132i386-quarterly-job-09] |   `-- Extracting indexinfo-0.3.1: .... done
[132i386-quarterly-job-09] `-- Extracting gettext-runtime-0.22.5: .......... done
[132i386-quarterly-job-09] `-- Installing zstd-1.5.6...
[132i386-quarterly-job-09] |   `-- Installing liblz4-1.9.4_1,1...
[132i386-quarterly-job-09] |   `-- Extracting liblz4-1.9.4_1,1: .......... done
[132i386-quarterly-job-09] `-- Extracting zstd-1.5.6: .......... done
[132i386-quarterly-job-09] Extracting binutils-2.40_5,1: .......... done
===>   lazarus-qt5-devel-3.3.1.20240323 depends on file: /usr/local/bin/as - found
===>   Returning to build of lazarus-qt5-devel-3.3.1.20240323
===>   lazarus-qt5-devel-3.3.1.20240323 depends on executable: update-desktop-database - not found
===>   Installing existing package /packages/All/desktop-file-utils-0.26_2.pkg
[132i386-quarterly-job-09] Installing desktop-file-utils-0.26_2...
[132i386-quarterly-job-09] `-- Installing glib-2.80.3,2...
[132i386-quarterly-job-09] |   `-- Installing libffi-3.4.4_1...
[132i386-quarterly-job-09] |   `-- Extracting libffi-3.4.4_1: .......... done
[132i386-quarterly-job-09] |   `-- Installing libiconv-1.17_1...
[132i386-quarterly-job-09] |   `-- Extracting libiconv-1.17_1: .......... done
[132i386-quarterly-job-09] |   `-- Installing pcre2-10.43...
<snip>
/wrkdirs/usr/ports/editors/lazarus-qt5-devel/work/lazarus-db6ed214b9647d2729a5cde1c69893048ce0b18c/components/pas2js/frmpas2jsatompackagesettings.pas(36,31) Hint: (5024) Parameter "Sender" not used
/wrkdirs/usr/ports/editors/lazarus-qt5-devel/work/lazarus-db6ed214b9647d2729a5cde1c69893048ce0b18c/components/pas2js/frmpas2jsatompackagesettings.pas(37,24) Hint: (5024) Parameter "Sender" not used
/wrkdirs/usr/ports/editors/lazarus-qt5-devel/work/lazarus-db6ed214b9647d2729a5cde1c69893048ce0b18c/components/pas2js/frmpas2jsatompackagesettings.pas(34,36) Hint: (5024) Parameter "Sender" not used
/wrkdirs/usr/ports/editors/lazarus-qt5-devel/work/lazarus-db6ed214b9647d2729a5cde1c69893048ce0b18c/components/pas2js/frmpas2jsatompackagesettings.pas(35,34) Hint: (5024) Parameter "Sender" not used
/wrkdirs/usr/ports/editors/lazarus-qt5-devel/work/lazarus-db6ed214b9647d2729a5cde1c69893048ce0b18c/components/pas2js/regpas2jsatom.pas(28,32) Hint: (5024) Parameter "aProject" not used
/wrkdirs/usr/ports/editors/lazarus-qt5-devel/work/lazarus-db6ed214b9647d2729a5cde1c69893048ce0b18c/components/pas2js/regpas2jsatom.pas(26,31) Hint: (5024) Parameter "aProject" not used
/wrkdirs/usr/ports/editors/lazarus-qt5-devel/work/lazarus-db6ed214b9647d2729a5cde1c69893048ce0b18c/components/pas2js/regpas2jsatom.pas(29,34) Hint: (5024) Parameter "aProject" not used
/wrkdirs/usr/ports/editors/lazarus-qt5-devel/work/lazarus-db6ed214b9647d2729a5cde1c69893048ce0b18c/components/pas2js/regpas2jsatom.pas(30,32) Hint: (5024) Parameter "aProject" not used
/wrkdirs/usr/ports/editors/lazarus-qt5-devel/work/lazarus-db6ed214b9647d2729a5cde1c69893048ce0b18c/components/pas2js/regpas2jsatom.pas(31,39) Hint: (5024) Parameter "aProject" not used
(3104) Compiling frmpas2jsnodejsprojectoptions.pp
/wrkdirs/usr/ports/editors/lazarus-qt5-devel/work/lazarus-db6ed214b9647d2729a5cde1c69893048ce0b18c/components/pas2js/frmpas2jsnodejsprojectoptions.pp(18,26) Hint: (5024) Parameter "Sender" not used
/wrkdirs/usr/ports/editors/lazarus-qt5-devel/work/lazarus-db6ed214b9647d2729a5cde1c69893048ce0b18c/components/pas2js/pjsdsgnoptions.pas(186,5) Note: (6058) Call to subroutine "procedure TPas2jsOptions.IncreaseChangeStamp;" marked as inline is not inlined
/wrkdirs/usr/ports/editors/lazarus-qt5-devel/work/lazarus-db6ed214b9647d2729a5cde1c69893048ce0b18c/components/pas2js/pjsdsgnoptions.pas(385,7) Warning: (6060) Case statement does not handle all possible cases
(3104) Compiling frmpas2jsbrowserprojectoptions.pp
/wrkdirs/usr/ports/editors/lazarus-qt5-devel/work/lazarus-db6ed214b9647d2729a5cde1c69893048ce0b18c/components/pas2js/frmpas2jsbrowserprojectoptions.pp(47,34) Hint: (5024) Parameter "Sender" not used
/wrkdirs/usr/ports/editors/lazarus-qt5-devel/work/lazarus-db6ed214b9647d2729a5cde1c69893048ce0b18c/components/pas2js/frmpas2jsbrowserprojectoptions.pp(48,37) Hint: (5024) Parameter "Sender" not used
/wrkdirs/usr/ports/editors/lazarus-qt5-devel/work/lazarus-db6ed214b9647d2729a5cde1c69893048ce0b18c/components/pas2js/frmpas2jsbrowserprojectoptions.pp(49,37) Hint: (5024) Parameter "Sender" not used
/wrkdirs/usr/ports/editors/lazarus-qt5-devel/work/lazarus-db6ed214b9647d2729a5cde1c69893048ce0b18c/components/pas2js/frmpas2jsbrowserprojectoptions.pp(50,26) Hint: (5024) Parameter "Sender" not used
/wrkdirs/usr/ports/editors/lazarus-qt5-devel/work/lazarus-db6ed214b9647d2729a5cde1c69893048ce0b18c/components/pas2js/frmpas2jsbrowserprojectoptions.pp(51,40) Hint: (5024) Parameter "Sender" not used
/wrkdirs/usr/ports/editors/lazarus-qt5-devel/work/lazarus-db6ed214b9647d2729a5cde1c69893048ce0b18c/components/pas2js/frmpas2jsbrowserprojectoptions.pp(52,34) Hint: (5024) Parameter "Sender" not used
/wrkdirs/usr/ports/editors/lazarus-qt5-devel/work/lazarus-db6ed214b9647d2729a5cde1c69893048ce0b18c/components/pas2js/frmpas2jsbrowserprojectoptions.pp(53,35) Hint: (5024) Parameter "Sender" not used
/wrkdirs/usr/ports/editors/lazarus-qt5-devel/work/lazarus-db6ed214b9647d2729a5cde1c69893048ce0b18c/components/pas2js/frmpas2jsbrowserprojectoptions.pp(54,41) Hint: (5024) Parameter "Sender" not used
(3104) Compiling pjsdsgnoptsframe.pas
/wrkdirs/usr/ports/editors/lazarus-qt5-devel/work/lazarus-db6ed214b9647d2729a5cde1c69893048ce0b18c/components/pas2js/pjsdsgnoptsframe.pas(49,43) Hint: (5024) Parameter "Sender" not used
/wrkdirs/usr/ports/editors/lazarus-qt5-devel/work/lazarus-db6ed214b9647d2729a5cde1c69893048ce0b18c/components/pas2js/pjsdsgnoptsframe.pas(50,45) Hint: (5024) Parameter "Sender" not used
/wrkdirs/usr/ports/editors/lazarus-qt5-devel/work/lazarus-db6ed214b9647d2729a5cde1c69893048ce0b18c/components/pas2js/pjsdsgnoptsframe.pas(51,50) Hint: (5024) Parameter "Sender" not used
/wrkdirs/usr/ports/editors/lazarus-qt5-devel/work/lazarus-db6ed214b9647d2729a5cde1c69893048ce0b18c/components/pas2js/pjsdsgnoptsframe.pas(46,48) Hint: (5024) Parameter "Sender" not used
/wrkdirs/usr/ports/editors/lazarus-qt5-devel/work/lazarus-db6ed214b9647d2729a5cde1c69893048ce0b18c/components/pas2js/pjsdsgnoptsframe.pas(47,44) Hint: (5024) Parameter "Sender" not used
/wrkdirs/usr/ports/editors/lazarus-qt5-devel/work/lazarus-db6ed214b9647d2729a5cde1c69893048ce0b18c/components/pas2js/pjsdsgnoptsframe.pas(48,39) Hint: (5024) Parameter "Sender" not used
/wrkdirs/usr/ports/editors/lazarus-qt5-devel/work/lazarus-db6ed214b9647d2729a5cde1c69893048ce0b18c/components/pas2js/pjsdsgnoptsframe.pas(54,33) Hint: (5024) Parameter "Buttons" not used
/wrkdirs/usr/ports/editors/lazarus-qt5-devel/work/lazarus-db6ed214b9647d2729a5cde1c69893048ce0b18c/components/pas2js/pjsdsgnoptsframe.pas(58,33) Hint: (5024) Parameter "AOptions" not used
/wrkdirs/usr/ports/editors/lazarus-qt5-devel/work/lazarus-db6ed214b9647d2729a5cde1c69893048ce0b18c/components/pas2js/pjsdsgnoptsframe.pas(59,34) Hint: (5024) Parameter "AOptions" not used
(3104) Compiling pjsdsgnregister.pas
/wrkdirs/usr/ports/editors/lazarus-qt5-devel/work/lazarus-db6ed214b9647d2729a5cde1c69893048ce0b18c/components/pas2js/pjsdsgnregister.pas(280,38) Hint: (5024) Parameter "Filename" not used
/wrkdirs/usr/ports/editors/lazarus-qt5-devel/work/lazarus-db6ed214b9647d2729a5cde1c69893048ce0b18c/components/pas2js/pjsdsgnregister.pas(281,32) Hint: (5024) Parameter "ResourceName" not used
/wrkdirs/usr/ports/editors/lazarus-qt5-devel/work/lazarus-db6ed214b9647d2729a5cde1c69893048ce0b18c/components/pas2js/pjsdsgnregister.pas(311,25) Hint: (5024) Parameter "Sender" not used
/wrkdirs/usr/ports/editors/lazarus-qt5-devel/work/lazarus-db6ed214b9647d2729a5cde1c69893048ce0b18c/components/pas2js/pjsdsgnregister.pas(315,30) Hint: (5024) Parameter "Sender" not used
/wrkdirs/usr/ports/editors/lazarus-qt5-devel/work/lazarus-db6ed214b9647d2729a5cde1c69893048ce0b18c/components/pas2js/pjsdsgnregister.pas(316,30) Hint: (5024) Parameter "Sender" not used
/wrkdirs/usr/ports/editors/lazarus-qt5-devel/work/lazarus-db6ed214b9647d2729a5cde1c69893048ce0b18c/components/pas2js/pjsdsgnregister.pas(312,40) Hint: (5024) Parameter "Sender" not used
/wrkdirs/usr/ports/editors/lazarus-qt5-devel/work/lazarus-db6ed214b9647d2729a5cde1c69893048ce0b18c/components/pas2js/pjsdsgnregister.pas(313,44) Hint: (5024) Parameter "Sender" not used
/wrkdirs/usr/ports/editors/lazarus-qt5-devel/work/lazarus-db6ed214b9647d2729a5cde1c69893048ce0b18c/components/pas2js/pjsdsgnregister.pas(314,47) Hint: (5024) Parameter "Sender" not used
/wrkdirs/usr/ports/editors/lazarus-qt5-devel/work/lazarus-db6ed214b9647d2729a5cde1c69893048ce0b18c/components/pas2js/pjsdsgnregister.pas(256,25) Hint: (5024) Parameter "Sender" not used
/wrkdirs/usr/ports/editors/lazarus-qt5-devel/work/lazarus-db6ed214b9647d2729a5cde1c69893048ce0b18c/components/pas2js/pjsdsgnregister.pas(261,28) Hint: (5024) Parameter "NewFilename" not used
/wrkdirs/usr/ports/editors/lazarus-qt5-devel/work/lazarus-db6ed214b9647d2729a5cde1c69893048ce0b18c/components/pas2js/pjsdsgnregister.pas(261,54) Hint: (5024) Parameter "NewOwner" not used
/wrkdirs/usr/ports/editors/lazarus-qt5-devel/work/lazarus-db6ed214b9647d2729a5cde1c69893048ce0b18c/components/pas2js/pjsdsgnregister.pas(262,28) Hint: (5024) Parameter "NewSource" not used
/wrkdirs/usr/ports/editors/lazarus-qt5-devel/work/lazarus-db6ed214b9647d2729a5cde1c69893048ce0b18c/components/pas2js/pjsdsgnregister.pas(262,52) Hint: (5024) Parameter "Quiet" not used
/wrkdirs/usr/ports/editors/lazarus-qt5-devel/work/lazarus-db6ed214b9647d2729a5cde1c69893048ce0b18c/components/pas2js/pjsdsgnregister.pas(265,32) Hint: (5024) Parameter "ResourceName" not used
(1008) 9345 lines compiled, 1.4 sec
(1021) 7 warning(s) issued
(1022) 100 hint(s) issued
(1023) 1 note(s) issued
/bin/cp -f Makefile.compiled units/i386-freebsd/qt5/pas2jsdsgn.compiled
gmake[3]: Leaving directory '/wrkdirs/usr/ports/editors/lazarus-qt5-devel/work/lazarus-db6ed214b9647d2729a5cde1c69893048ce0b18c/components/pas2js'
gmake -C exampleswindow
gmake[3]: Entering directory '/wrkdirs/usr/ports/editors/lazarus-qt5-devel/work/lazarus-db6ed214b9647d2729a5cde1c69893048ce0b18c/components/exampleswindow'
/bin/rm -f lib/i386-freebsd/qt5/exampleprojects.ppu
/bin/mkdir -p lib/i386-freebsd/qt5
/usr/local/bin/ppc386 -MObjFPC -Scghi -O1 -g -gl -l -vewnhibq -dLCL -dLCLqt5 -Fu. -Fu../../packager/units/i386-freebsd -Fu../lazutils/lib/i386-freebsd -Fu../buildintf/units/i386-freebsd -Fu../freetype/lib/i386-freebsd -Fu../../lcl/units/i386-freebsd -Fu../../lcl/units/i386-freebsd/qt5 -Fu../lazcontrols/lib/i386-freebsd/qt5 -Fu../ideintf/units/i386-freebsd/qt5 -Fu/usr/local/lib/fpc/3.3.1/units/i386-freebsd/rtl -FE. -FUlib/i386-freebsd/qt5 -Sgic -di386 exampleprojects.pas
Hint: (11030) Start of reading config file /usr/local/etc/fpc.cfg
Hint: (11031) End of reading config file /usr/local/etc/fpc.cfg
Free Pascal Compiler version 3.3.1 [2024/04/10] for i386
Copyright (c) 1993-2024 by Florian Klaempfl and others
(1002) Target OS: FreeBSD/ELF for i386
(3104) Compiling exampleprojects.pas
(3104) Compiling exwinsettings.pas
(3104) Compiling uconst.pas
(1010) Writing Resource String Table file: uconst.rsj
/wrkdirs/usr/ports/editors/lazarus-qt5-devel/work/lazarus-db6ed214b9647d2729a5cde1c69893048ce0b18c/components/exampleswindow/exwinsettings.pas(46,39) Hint: (5024) Parameter "pbReadRegFile" not used
/wrkdirs/usr/ports/editors/lazarus-qt5-devel/work/lazarus-db6ed214b9647d2729a5cde1c69893048ce0b18c/components/exampleswindow/exwinsettings.pas(61,38) Hint: (5024) Parameter "Sender" not used
/wrkdirs/usr/ports/editors/lazarus-qt5-devel/work/lazarus-db6ed214b9647d2729a5cde1c69893048ce0b18c/components/exampleswindow/exwinsettings.pas(70,37) Hint: (5024) Parameter "AOptions" not used
/wrkdirs/usr/ports/editors/lazarus-qt5-devel/work/lazarus-db6ed214b9647d2729a5cde1c69893048ce0b18c/components/exampleswindow/exwinsettings.pas(71,30) Hint: (5024) Parameter "ADialog" not used
/wrkdirs/usr/ports/editors/lazarus-qt5-devel/work/lazarus-db6ed214b9647d2729a5cde1c69893048ce0b18c/components/exampleswindow/exwinsettings.pas(73,38) Hint: (5024) Parameter "AOptions" not used
(3104) Compiling uexampledata.pas
/wrkdirs/usr/ports/editors/lazarus-qt5-devel/work/lazarus-db6ed214b9647d2729a5cde1c69893048ce0b18c/components/exampleswindow/uexampledata.pas(682,5) Warning: (6060) Case statement does not handle all possible cases
(3104) Compiling ulaz_examples.pas
/wrkdirs/usr/ports/editors/lazarus-qt5-devel/work/lazarus-db6ed214b9647d2729a5cde1c69893048ce0b18c/components/exampleswindow/ulaz_examples.pas(126,21) Hint: (4055) Conversion between ordinals and pointers is not portable
/wrkdirs/usr/ports/editors/lazarus-qt5-devel/work/lazarus-db6ed214b9647d2729a5cde1c69893048ce0b18c/components/exampleswindow/ulaz_examples.pas(80,56) Hint: (5024) Parameter "Item" not used
/wrkdirs/usr/ports/editors/lazarus-qt5-devel/work/lazarus-db6ed214b9647d2729a5cde1c69893048ce0b18c/components/exampleswindow/ulaz_examples.pas(80,73) Hint: (5024) Parameter "Selected" not used
/wrkdirs/usr/ports/editors/lazarus-qt5-devel/work/lazarus-db6ed214b9647d2729a5cde1c69893048ce0b18c/components/exampleswindow/ulaz_examples.pas(177,16) Hint: (4055) Conversion between ordinals and pointers is not portable
/wrkdirs/usr/ports/editors/lazarus-qt5-devel/work/lazarus-db6ed214b9647d2729a5cde1c69893048ce0b18c/components/exampleswindow/ulaz_examples.pas(74,34) Hint: (5024) Parameter "Sender" not used
/wrkdirs/usr/ports/editors/lazarus-qt5-devel/work/lazarus-db6ed214b9647d2729a5cde1c69893048ce0b18c/components/exampleswindow/ulaz_examples.pas(198,30) Hint: (4055) Conversion between ordinals and pointers is not portable
/wrkdirs/usr/ports/editors/lazarus-qt5-devel/work/lazarus-db6ed214b9647d2729a5cde1c69893048ce0b18c/components/exampleswindow/ulaz_examples.pas(75,37) Hint: (5024) Parameter "Sender" not used
/wrkdirs/usr/ports/editors/lazarus-qt5-devel/work/lazarus-db6ed214b9647d2729a5cde1c69893048ce0b18c/components/exampleswindow/ulaz_examples.pas(76,34) Hint: (5024) Parameter "Sender" not used
/wrkdirs/usr/ports/editors/lazarus-qt5-devel/work/lazarus-db6ed214b9647d2729a5cde1c69893048ce0b18c/components/exampleswindow/ulaz_examples.pas(77,33) Hint: (5024) Parameter "Sender" not used
/wrkdirs/usr/ports/editors/lazarus-qt5-devel/work/lazarus-db6ed214b9647d2729a5cde1c69893048ce0b18c/components/exampleswindow/ulaz_examples.pas(78,68) Hint: (5024) Parameter "Shift" not used
/wrkdirs/usr/ports/editors/lazarus-qt5-devel/work/lazarus-db6ed214b9647d2729a5cde1c69893048ce0b18c/components/exampleswindow/ulaz_examples.pas(79,37) Hint: (5024) Parameter "Sender" not used
/wrkdirs/usr/ports/editors/lazarus-qt5-devel/work/lazarus-db6ed214b9647d2729a5cde1c69893048ce0b18c/components/exampleswindow/ulaz_examples.pas(245,16) Hint: (4055) Conversion between ordinals and pointers is not portable
/wrkdirs/usr/ports/editors/lazarus-qt5-devel/work/lazarus-db6ed214b9647d2729a5cde1c69893048ce0b18c/components/exampleswindow/ulaz_examples.pas(62,35) Hint: (5024) Parameter "Sender" not used
/wrkdirs/usr/ports/editors/lazarus-qt5-devel/work/lazarus-db6ed214b9647d2729a5cde1c69893048ce0b18c/components/exampleswindow/ulaz_examples.pas(265,16) Hint: (4055) Conversion between ordinals and pointers is not portable
/wrkdirs/usr/ports/editors/lazarus-qt5-devel/work/lazarus-db6ed214b9647d2729a5cde1c69893048ce0b18c/components/exampleswindow/ulaz_examples.pas(61,38) Hint: (5024) Parameter "Sender" not used
/wrkdirs/usr/ports/editors/lazarus-qt5-devel/work/lazarus-db6ed214b9647d2729a5cde1c69893048ce0b18c/components/exampleswindow/ulaz_examples.pas(303,16) Hint: (4055) Conversion between ordinals and pointers is not portable
/wrkdirs/usr/ports/editors/lazarus-qt5-devel/work/lazarus-db6ed214b9647d2729a5cde1c69893048ce0b18c/components/exampleswindow/ulaz_examples.pas(63,35) Hint: (5024) Parameter "Sender" not used
/wrkdirs/usr/ports/editors/lazarus-qt5-devel/work/lazarus-db6ed214b9647d2729a5cde1c69893048ce0b18c/components/exampleswindow/ulaz_examples.pas(60,36) Hint: (5024) Parameter "Sender" not used
/wrkdirs/usr/ports/editors/lazarus-qt5-devel/work/lazarus-db6ed214b9647d2729a5cde1c69893048ce0b18c/components/exampleswindow/ulaz_examples.pas(65,47) Hint: (5024) Parameter "Sender" not used
/wrkdirs/usr/ports/editors/lazarus-qt5-devel/work/lazarus-db6ed214b9647d2729a5cde1c69893048ce0b18c/components/exampleswindow/ulaz_examples.pas(65,64) Hint: (5024) Parameter "Index" not used
/wrkdirs/usr/ports/editors/lazarus-qt5-devel/work/lazarus-db6ed214b9647d2729a5cde1c69893048ce0b18c/components/exampleswindow/ulaz_examples.pas(67,36) Hint: (5024) Parameter "Sender" not used
/wrkdirs/usr/ports/editors/lazarus-qt5-devel/work/lazarus-db6ed214b9647d2729a5cde1c69893048ce0b18c/components/exampleswindow/ulaz_examples.pas(68,35) Hint: (5024) Parameter "Sender" not used
/wrkdirs/usr/ports/editors/lazarus-qt5-devel/work/lazarus-db6ed214b9647d2729a5cde1c69893048ce0b18c/components/exampleswindow/ulaz_examples.pas(69,37) Hint: (5024) Parameter "Sender" not used
/wrkdirs/usr/ports/editors/lazarus-qt5-devel/work/lazarus-db6ed214b9647d2729a5cde1c69893048ce0b18c/components/exampleswindow/ulaz_examples.pas(69,69) Hint: (5024) Parameter "Shift" not used
/wrkdirs/usr/ports/editors/lazarus-qt5-devel/work/lazarus-db6ed214b9647d2729a5cde1c69893048ce0b18c/components/exampleswindow/ulaz_examples.pas(66,42) Hint: (5024) Parameter "Sender" not used
/wrkdirs/usr/ports/editors/lazarus-qt5-devel/work/lazarus-db6ed214b9647d2729a5cde1c69893048ce0b18c/components/exampleswindow/ulaz_examples.pas(70,30) Hint: (5024) Parameter "Sender" not used
/wrkdirs/usr/ports/editors/lazarus-qt5-devel/work/lazarus-db6ed214b9647d2729a5cde1c69893048ce0b18c/components/exampleswindow/ulaz_examples.pas(71,31) Hint: (5024) Parameter "Sender" not used
/wrkdirs/usr/ports/editors/lazarus-qt5-devel/work/lazarus-db6ed214b9647d2729a5cde1c69893048ce0b18c/components/exampleswindow/ulaz_examples.pas(72,31) Hint: (5024) Parameter "Sender" not used
/wrkdirs/usr/ports/editors/lazarus-qt5-devel/work/lazarus-db6ed214b9647d2729a5cde1c69893048ce0b18c/components/exampleswindow/ulaz_examples.pas(72,63) Hint: (5024) Parameter "Shift" not used
/wrkdirs/usr/ports/editors/lazarus-qt5-devel/work/lazarus-db6ed214b9647d2729a5cde1c69893048ce0b18c/components/exampleswindow/ulaz_examples.pas(73,28) Hint: (5024) Parameter "Sender" not used
(3104) Compiling uintf.pas
/wrkdirs/usr/ports/editors/lazarus-qt5-devel/work/lazarus-db6ed214b9647d2729a5cde1c69893048ce0b18c/components/exampleswindow/uintf.pas(64,33) Hint: (5024) Parameter "Sender" not used
(1008) 1789 lines compiled, 0.6 sec
(1021) 1 warning(s) issued
(1022) 38 hint(s) issued
/bin/cp -f Makefile.compiled lib/i386-freebsd/qt5/exampleprojects.compiled
gmake[3]: Leaving directory '/wrkdirs/usr/ports/editors/lazarus-qt5-devel/work/lazarus-db6ed214b9647d2729a5cde1c69893048ce0b18c/components/exampleswindow'
gmake -C charactermap
gmake[3]: Entering directory '/wrkdirs/usr/ports/editors/lazarus-qt5-devel/work/lazarus-db6ed214b9647d2729a5cde1c69893048ce0b18c/components/charactermap'
/bin/rm -f lib/i386-freebsd/qt5/charactermappkg.ppu
/bin/mkdir -p lib/i386-freebsd/qt5
/usr/local/bin/ppc386 -MObjFPC -Scghi -O1 -g -gl -l -vewnhibq -dLCL -dLCLqt5 -Fu. -Fu../../packager/units/i386-freebsd -Fu../lazutils/lib/i386-freebsd -Fu../freetype/lib/i386-freebsd -Fu../../lcl/units/i386-freebsd -Fu../../lcl/units/i386-freebsd/qt5 -Fu/usr/local/lib/fpc/3.3.1/units/i386-freebsd/rtl -FE. -FUlib/i386-freebsd/qt5 -Sgic -di386 charactermappkg.pas
Hint: (11030) Start of reading config file /usr/local/etc/fpc.cfg
Hint: (11031) End of reading config file /usr/local/etc/fpc.cfg
Free Pascal Compiler version 3.3.1 [2024/04/10] for i386
Copyright (c) 1993-2024 by Florian Klaempfl and others
(1002) Target OS: FreeBSD/ELF for i386
(3104) Compiling charactermappkg.pas
(3104) Compiling charactermapfrm.pas
/wrkdirs/usr/ports/editors/lazarus-qt5-devel/work/lazarus-db6ed214b9647d2729a5cde1c69893048ce0b18c/components/charactermap/charactermapfrm.pas(77,26) Hint: (5024) Parameter "Sender" not used
/wrkdirs/usr/ports/editors/lazarus-qt5-devel/work/lazarus-db6ed214b9647d2729a5cde1c69893048ce0b18c/components/charactermap/charactermapfrm.pas(74,32) Hint: (5024) Parameter "Sender" not used
/wrkdirs/usr/ports/editors/lazarus-qt5-devel/work/lazarus-db6ed214b9647d2729a5cde1c69893048ce0b18c/components/charactermap/charactermapfrm.pas(75,32) Hint: (5024) Parameter "Sender" not used
/wrkdirs/usr/ports/editors/lazarus-qt5-devel/work/lazarus-db6ed214b9647d2729a5cde1c69893048ce0b18c/components/charactermap/charactermapfrm.pas(76,27) Hint: (5024) Parameter "Sender" not used
/wrkdirs/usr/ports/editors/lazarus-qt5-devel/work/lazarus-db6ed214b9647d2729a5cde1c69893048ce0b18c/components/charactermap/charactermapfrm.pas(76,64) Hint: (5024) Parameter "Shift" not used
/wrkdirs/usr/ports/editors/lazarus-qt5-devel/work/lazarus-db6ed214b9647d2729a5cde1c69893048ce0b18c/components/charactermap/charactermapfrm.pas(78,24) Hint: (5024) Parameter "Sender" not used
/wrkdirs/usr/ports/editors/lazarus-qt5-devel/work/lazarus-db6ed214b9647d2729a5cde1c69893048ce0b18c/components/charactermap/charactermapfrm.pas(79,32) Hint: (5024) Parameter "Sender" not used
/wrkdirs/usr/ports/editors/lazarus-qt5-devel/work/lazarus-db6ed214b9647d2729a5cde1c69893048ce0b18c/components/charactermap/charactermapfrm.pas(80,31) Hint: (5024) Parameter "Sender" not used
/wrkdirs/usr/ports/editors/lazarus-qt5-devel/work/lazarus-db6ed214b9647d2729a5cde1c69893048ce0b18c/components/charactermap/charactermapfrm.pas(81,43) Hint: (5024) Parameter "Sender" not used
/wrkdirs/usr/ports/editors/lazarus-qt5-devel/work/lazarus-db6ed214b9647d2729a5cde1c69893048ce0b18c/components/charactermap/charactermapfrm.pas(82,34) Hint: (5024) Parameter "Sender" not used
/wrkdirs/usr/ports/editors/lazarus-qt5-devel/work/lazarus-db6ed214b9647d2729a5cde1c69893048ce0b18c/components/charactermap/charactermapfrm.pas(83,16) Hint: (5024) Parameter "CanSelect" not used
/wrkdirs/usr/ports/editors/lazarus-qt5-devel/work/lazarus-db6ed214b9647d2729a5cde1c69893048ce0b18c/components/charactermap/charactermapfrm.pas(84,37) Hint: (5024) Parameter "Sender" not used
/wrkdirs/usr/ports/editors/lazarus-qt5-devel/work/lazarus-db6ed214b9647d2729a5cde1c69893048ce0b18c/components/charactermap/charactermapfrm.pas(85,16) Hint: (5024) Parameter "CanSelect" not used
/wrkdirs/usr/ports/editors/lazarus-qt5-devel/work/lazarus-db6ed214b9647d2729a5cde1c69893048ce0b18c/components/charactermap/charactermapfrm.pas(88,12) Hint: (5024) Parameter "Shift" not used
/wrkdirs/usr/ports/editors/lazarus-qt5-devel/work/lazarus-db6ed214b9647d2729a5cde1c69893048ce0b18c/components/charactermap/charactermapfrm.pas(89,33) Hint: (5024) Parameter "Sender" not used
/wrkdirs/usr/ports/editors/lazarus-qt5-devel/work/lazarus-db6ed214b9647d2729a5cde1c69893048ce0b18c/components/charactermap/charactermapfrm.pas(89,55) Hint: (5024) Parameter "Shift" not used
/wrkdirs/usr/ports/editors/lazarus-qt5-devel/work/lazarus-db6ed214b9647d2729a5cde1c69893048ce0b18c/components/charactermap/charactermapfrm.pas(73,12) Hint: (5024) Parameter "aState" not used
/wrkdirs/usr/ports/editors/lazarus-qt5-devel/work/lazarus-db6ed214b9647d2729a5cde1c69893048ce0b18c/components/charactermap/charactermapfrm.pas(91,36) Hint: (5024) Parameter "Sender" not used
/wrkdirs/usr/ports/editors/lazarus-qt5-devel/work/lazarus-db6ed214b9647d2729a5cde1c69893048ce0b18c/components/charactermap/charactermapfrm.pas(91,58) Hint: (5024) Parameter "Shift" not used
/wrkdirs/usr/ports/editors/lazarus-qt5-devel/work/lazarus-db6ed214b9647d2729a5cde1c69893048ce0b18c/components/charactermap/charactermapfrm.pas(41,22) Hint: (5023) Unit "Math" not used in CharacterMapFrm
(1010) Writing Resource String Table file: charactermapfrm.rsj
(1008) 541 lines compiled, 0.5 sec
(1022) 22 hint(s) issued
/bin/cp -f Makefile.compiled lib/i386-freebsd/qt5/charactermappkg.compiled
gmake[3]: Leaving directory '/wrkdirs/usr/ports/editors/lazarus-qt5-devel/work/lazarus-db6ed214b9647d2729a5cde1c69893048ce0b18c/components/charactermap'
gmake -C charactermap/design
gmake[3]: Entering directory '/wrkdirs/usr/ports/editors/lazarus-qt5-devel/work/lazarus-db6ed214b9647d2729a5cde1c69893048ce0b18c/components/charactermap/design'
/bin/rm -f lib/i386-freebsd/qt5/charactermap_ide_pkg.ppu
/bin/mkdir -p lib/i386-freebsd/qt5
/usr/local/bin/ppc386 -MObjFPC -Scghi -O1 -g -gl -l -vewnhibq -dLCL -dLCLqt5 -Fu. -Fu../../../packager/units/i386-freebsd -Fu../../lazdebuggers/lazdebuggerintf/lib/i386-freebsd -Fu../../lazutils/lib/i386-freebsd -Fu../../buildintf/units/i386-freebsd -Fu../../codetools/units/i386-freebsd -Fu../../debuggerintf/lib/i386-freebsd -Fu../../freetype/lib/i386-freebsd -Fu../../lazedit/lib/i386-freebsd -Fu../../../ide/packages/ideconfig/lib/i386-freebsd/qt5 -Fu../../../lcl/units/i386-freebsd -Fu../../../lcl/units/i386-freebsd/qt5 -Fu../lib/i386-freebsd/qt5 -Fu../../lazcontrols/lib/i386-freebsd/qt5 -Fu../../synedit/units/i386-freebsd/qt5 -Fu../../ideintf/units/i386-freebsd/qt5 -Fu/usr/local/lib/fpc/3.3.1/units/i386-freebsd/rtl -FE. -FUlib/i386-freebsd/qt5 -Sgic -di386 charactermap_ide_pkg.pas
Hint: (11030) Start of reading config file /usr/local/etc/fpc.cfg
Hint: (11031) End of reading config file /usr/local/etc/fpc.cfg
Free Pascal Compiler version 3.3.1 [2024/04/10] for i386
Copyright (c) 1993-2024 by Florian Klaempfl and others
(1002) Target OS: FreeBSD/ELF for i386
(3104) Compiling charactermap_ide_pkg.pas
(3104) Compiling charactermap_reg.pas
/wrkdirs/usr/ports/editors/lazarus-qt5-devel/work/lazarus-db6ed214b9647d2729a5cde1c69893048ce0b18c/components/charactermap/design/charactermap_reg.pas(39,37) Hint: (5024) Parameter "ASender" not used
/wrkdirs/usr/ports/editors/lazarus-qt5-devel/work/lazarus-db6ed214b9647d2729a5cde1c69893048ce0b18c/components/charactermap/design/charactermap_reg.pas(21,33) Hint: (5024) Parameter "Sender" not used
/wrkdirs/usr/ports/editors/lazarus-qt5-devel/work/lazarus-db6ed214b9647d2729a5cde1c69893048ce0b18c/components/charactermap/design/charactermap_reg.pas(19,31) Hint: (5024) Parameter "Sender" not used
(1008) 192 lines compiled, 0.7 sec
(1022) 5 hint(s) issued
/bin/cp -f Makefile.compiled lib/i386-freebsd/qt5/charactermap_ide_pkg.compiled
gmake[3]: Leaving directory '/wrkdirs/usr/ports/editors/lazarus-qt5-devel/work/lazarus-db6ed214b9647d2729a5cde1c69893048ce0b18c/components/charactermap/design'
gmake[2]: Leaving directory '/wrkdirs/usr/ports/editors/lazarus-qt5-devel/work/lazarus-db6ed214b9647d2729a5cde1c69893048ce0b18c/components'
gmake -C ide bigide
gmake[2]: Entering directory '/wrkdirs/usr/ports/editors/lazarus-qt5-devel/work/lazarus-db6ed214b9647d2729a5cde1c69893048ce0b18c/ide'
/bin/mkdir -p ../units/i386-freebsd/qt5
../tools/svn2revisioninc .. revision.inc
Warning: Version control client not in path.
Created /wrkdirs/usr/ports/editors/lazarus-qt5-devel/work/lazarus-db6ed214b9647d2729a5cde1c69893048ce0b18c/ide/revision.inc for revision: Unknown
/bin/rm -f ../units/i386-freebsd/qt5/pkgmanager.ppu
gmake --assume-new=lazarus.pp lazarus OPT='-Sgic  -dBigIDE  -Fu../packager/units/i386-freebsd -Fu../components/codetools/units/i386-freebsd -Fu../components/debuggerintf/lib/i386-freebsd -Fu../components/lazutils/lib/i386-freebsd -Fu../components/freetype/lib/i386-freebsd -Fu../lcl/units/i386-freebsd -Fu../lcl/units/i386-freebsd/qt5 -Fu../components/lazedit/lib/i386-freebsd -Fu../components/buildintf/units/i386-freebsd -Fu../components/ideintf/units/i386-freebsd/qt5 -Fu../components/lazedit/lib/i386-freebsd/qt5 -Fu../components/synedit/units/i386-freebsd/qt5 -Fu../components/lazcontrols/lib/i386-freebsd/qt5 -Fu../components/lazcontrols/design/lib/i386-freebsd/qt5 -Fu../components/lazdebuggers/lazdebuggerintf/lib/i386-freebsd -Fu../components/lazdebuggers/cmdlinedebuggerbase/lib/i386-freebsd/qt5 -Fu../components/lazdebuggergdbmi/units/i386-freebsd/qt5 -Fu../components/lclextensions/lib/i386-freebsd-qt5 -Fu../components/virtualtreeview/lib/i386-freebsd-qt5 -Fu../components/fpd
ebug/lib/i386-freebsd -Fu../components/lazdebuggers/lazdebuggerfp/lib/i386-freebsd/qt5 -Fu../components/lazdebuggers/lazdebuggerlldb/lib/i386-freebsd/qt5 -Fu../components/lazdebuggers/lazdebuggerfplldb/lib/i386-freebsd/qt5 -Fupackages/ideconfig/lib/i386-freebsd/qt5 -Fupackages/idedebugger/lib/i386-freebsd/qt5 -Fu../components/lazedit/lib/i386-freebsd/qt5 -Fu../components/synedit/design/units/i386-freebsd/qt5 -Fu../components/rtticontrols/lib/i386-freebsd/qt5 -Fu../components/cairocanvas/lib/i386-freebsd/qt5 -Fu../components/printers/lib/i386-freebsd/qt5 -Fu../components/printers/design/lib/i386-freebsd/qt5 -Fu../components/tdbf/lib/i386-freebsd/qt5 -Fu../components/turbopower_ipro/units/i386-freebsd/qt5 -Fu../components/turbopower_ipro/design/lib/i386-freebsd/qt5 -Fu../components/fpcunit/lib/i386-freebsd/qt5 -Fu../components/fpcunit/testinsight/lib/i386-freebsd -Fu../components/fpcunit/ide/lib/i386-freebsd/qt5 -Fu../components/projecttemplates/lib/i386-freebsd/qt5 -Fu../comp
onents/sqldb/lib/i386-freebsd/qt5 -Fu../components/sdf/lib/i386-freebsd/qt5 -Fu../components/leakview/lib/i386-freebsd/qt5 -Fu../components/memds/lib/i386-freebsd/qt5 -Fu../components/tachart/lib/i386-freebsd/qt5 -Fu../components/todolist/lib/i386-freebsd/qt5 -Fu../components/datetimectrls/lib/i386-freebsd/qt5 -Fu../components/datetimectrls/design/lib/i386-freebsd/qt5 -Fu../components/jcf2/lib/i386-freebsd -Fu../components/jcf2/IdePlugin/lazarus/lib/i386-freebsd/qt5 -Fu../components/chmhelp/packages/help/lib/i386-freebsd/qt5 -Fu../components/chmhelp/packages/idehelp/lib/i386-freebsd/qt5 -Fu../components/instantfpc/lib/i386-freebsd/qt5 -Fu../components/externhelp/lib/i386-freebsd/qt5 -Fu../components/PascalScript/Source/lib/i386-freebsd -Fu../components/macroscript/lib/i386-freebsd -Fu../components/onlinepackagemanager/lib/i386-freebsd/qt5 -Fu../components/simplewebservergui/lib/i386-freebsd/qt5 -Fu../components/projectgroups/lib/i386-freebsd/qt5 -Fu../components/pas2js/units
/i386-freebsd/qt5 -Fu../components/exampleswindow/lib/i386-freebsd/qt5 -Fu../components/charactermap/lib/i386-freebsd/qt5 -Fu../components/charactermap/design/lib/i386-freebsd/qt5'
gmake[3]: Entering directory '/wrkdirs/usr/ports/editors/lazarus-qt5-devel/work/lazarus-db6ed214b9647d2729a5cde1c69893048ce0b18c/ide'
/usr/local/bin/ppc386 -gl -vbqewnhi -Sci -dlclqt5 -Fu../designer -Fu../debugger -Fu../debugger/frames -Fu../converter -Fu../packager -Fu../packager/frames -Fu../components/custom -Fuframes -Fu. -Fu/usr/local/lib/fpc/3.3.1/units/i386-freebsd/rtl -Fiinclude -Fiinclude/freebsd -Fi../images -FE.. -FU../units/i386-freebsd/qt5 -Sgic -dBigIDE -Fu../packager/units/i386-freebsd -Fu../components/codetools/units/i386-freebsd -Fu../components/debuggerintf/lib/i386-freebsd -Fu../components/lazutils/lib/i386-freebsd -Fu../components/freetype/lib/i386-freebsd -Fu../lcl/units/i386-freebsd -Fu../lcl/units/i386-freebsd/qt5 -Fu../components/lazedit/lib/i386-freebsd -Fu../components/buildintf/units/i386-freebsd -Fu../components/ideintf/units/i386-freebsd/qt5 -Fu../components/lazedit/lib/i386-freebsd/qt5 -Fu../components/synedit/units/i386-freebsd/qt5 -Fu../components/lazcontrols/lib/i386-freebsd/qt5 -Fu../components/lazcontrols/design/lib/i386-freebsd/qt5 -Fu../components/lazdebuggers/lazdebugg
erintf/lib/i386-freebsd -Fu../components/lazdebuggers/cmdlinedebuggerbase/lib/i386-freebsd/qt5 -Fu../components/lazdebuggergdbmi/units/i386-freebsd/qt5 -Fu../components/lclextensions/lib/i386-freebsd-qt5 -Fu../components/virtualtreeview/lib/i386-freebsd-qt5 -Fu../components/fpdebug/lib/i386-freebsd -Fu../components/lazdebuggers/lazdebuggerfp/lib/i386-freebsd/qt5 -Fu../components/lazdebuggers/lazdebuggerlldb/lib/i386-freebsd/qt5 -Fu../components/lazdebuggers/lazdebuggerfplldb/lib/i386-freebsd/qt5 -Fupackages/ideconfig/lib/i386-freebsd/qt5 -Fupackages/idedebugger/lib/i386-freebsd/qt5 -Fu../components/lazedit/lib/i386-freebsd/qt5 -Fu../components/synedit/design/units/i386-freebsd/qt5 -Fu../components/rtticontrols/lib/i386-freebsd/qt5 -Fu../components/cairocanvas/lib/i386-freebsd/qt5 -Fu../components/printers/lib/i386-freebsd/qt5 -Fu../components/printers/design/lib/i386-freebsd/qt5 -Fu../components/tdbf/lib/i386-freebsd/qt5 -Fu../components/turbopower_ipro/units/i386-freebsd/qt
5 -Fu../components/turbopower_ipro/design/lib/i386-freebsd/qt5 -Fu../components/fpcunit/lib/i386-freebsd/qt5 -Fu../components/fpcunit/testinsight/lib/i386-freebsd -Fu../components/fpcunit/ide/lib/i386-freebsd/qt5 -Fu../components/projecttemplates/lib/i386-freebsd/qt5 -Fu../components/sqldb/lib/i386-freebsd/qt5 -Fu../components/sdf/lib/i386-freebsd/qt5 -Fu../components/leakview/lib/i386-freebsd/qt5 -Fu../components/memds/lib/i386-freebsd/qt5 -Fu../components/tachart/lib/i386-freebsd/qt5 -Fu../components/todolist/lib/i386-freebsd/qt5 -Fu../components/datetimectrls/lib/i386-freebsd/qt5 -Fu../components/datetimectrls/design/lib/i386-freebsd/qt5 -Fu../components/jcf2/lib/i386-freebsd -Fu../components/jcf2/IdePlugin/lazarus/lib/i386-freebsd/qt5 -Fu../components/chmhelp/packages/help/lib/i386-freebsd/qt5 -Fu../components/chmhelp/packages/idehelp/lib/i386-freebsd/qt5 -Fu../components/instantfpc/lib/i386-freebsd/qt5 -Fu../components/externhelp/lib/i386-freebsd/qt5 -Fu../components/Pa
scalScript/Source/lib/i386-freebsd -Fu../components/macroscript/lib/i386-freebsd -Fu../components/onlinepackagemanager/lib/i386-freebsd/qt5 -Fu../components/simplewebservergui/lib/i386-freebsd/qt5 -Fu../components/projectgroups/lib/i386-freebsd/qt5 -Fu../components/pas2js/units/i386-freebsd/qt5 -Fu../components/exampleswindow/lib/i386-freebsd/qt5 -Fu../components/charactermap/lib/i386-freebsd/qt5 -Fu../components/charactermap/design/lib/i386-freebsd/qt5 -di386 lazarus.pp
Hint: (11030) Start of reading config file /usr/local/etc/fpc.cfg
Hint: (11031) End of reading config file /usr/local/etc/fpc.cfg
Free Pascal Compiler version 3.3.1 [2024/04/10] for i386
Copyright (c) 1993-2024 by Florian Klaempfl and others
(1002) Target OS: FreeBSD/ELF for i386
(3104) Compiling lazarus.pp
(10001) PPU Loading /wrkdirs/usr/ports/editors/lazarus-qt5-devel/work/lazarus-db6ed214b9647d2729a5cde1c69893048ce0b18c/components/virtualtreeview/lib/i386-freebsd-qt5/laz.vtideeditors.ppu
(10011) PPU Source: laz.vtideeditors.pas not found
(10028) Recompiling laz.VTIDEEditors, checksum changed for /wrkdirs/usr/ports/editors/lazarus-qt5-devel/work/lazarus-db6ed214b9647d2729a5cde1c69893048ce0b18c/components/virtualtreeview/lib/i386-freebsd-qt5/laz.virtualtrees.ppu
Fatal: (10022) Can't find unit laz.VTIDEEditors used by laz.RegisterVirtualTreeView
Fatal: (1018) Compilation aborted
gmake[3]: *** [Makefile:4341: lazarus] Error 1
gmake[3]: Leaving directory '/wrkdirs/usr/ports/editors/lazarus-qt5-devel/work/lazarus-db6ed214b9647d2729a5cde1c69893048ce0b18c/ide'
gmake[2]: *** [Makefile:4783: bigide] Error 2
gmake[2]: Leaving directory '/wrkdirs/usr/ports/editors/lazarus-qt5-devel/work/lazarus-db6ed214b9647d2729a5cde1c69893048ce0b18c/ide'
gmake[1]: *** [Makefile:3109: idebig] Error 2
gmake[1]: Leaving directory '/wrkdirs/usr/ports/editors/lazarus-qt5-devel/work/lazarus-db6ed214b9647d2729a5cde1c69893048ce0b18c'
*** Error code 2

Stop.
make: stopped in /usr/ports/editors/lazarus-qt5-devel