[package - main-amd64-default][lang/cling] Failed for cling-0.5.2018.08.13_12 in build

From: <pkg-fallout_at_FreeBSD.org>
Date: Sat, 22 Jun 2024 05:39:39 UTC
You are receiving this mail as a port that you maintain
is failing to build on the FreeBSD package build server.
Please investigate the failure and submit a PR to fix
build.

Maintainer:     ports@FreeBSD.org
Log URL:        https://pkg-status.freebsd.org/beefy18/data/main-amd64-default/pf558721194b8_s42c545c5f8a/logs/cling-0.5.2018.08.13_12.log
Build URL:      https://pkg-status.freebsd.org/beefy18/build.html?mastername=main-amd64-default&build=pf558721194b8_s42c545c5f8a
Log:

=>> Building lang/cling
build started at Sat Jun 22 04:43:57 UTC 2024
port directory: /usr/ports/lang/cling
package name: cling-0.5.2018.08.13_12
building for: FreeBSD main-amd64-default-job-08 15.0-CURRENT FreeBSD 15.0-CURRENT 1500019 amd64
maintained by: ports@FreeBSD.org
Makefile datestamp: -rw-r--r--  1 root wheel 3025 Jan  2 01:01 /usr/ports/lang/cling/Makefile
Ports top last git commit: f558721194b
Ports top unclean checkout: no
Port dir last git commit: bbab7f59e96
Port dir unclean checkout: no
Poudriere version: poudriere-git-3.4.1-30-g79e3edcd
Host OSVERSION: 1500018
Jail OSVERSION: 1500019
Job Id: 08




!!! Jail is newer than host. (Jail: 1500019, Host: 1500018) !!!
!!! This is not supported. !!!
!!! Host kernel must be same or newer than jail. !!!
!!! Expect build failures. !!!



---Begin Environment---
SHELL=/bin/sh
OSVERSION=1500019
UNAME_v=FreeBSD 15.0-CURRENT 1500019
UNAME_r=15.0-CURRENT
BLOCKSIZE=K
MAIL=/var/mail/root
MM_CHARSET=UTF-8
LANG=C.UTF-8
STATUS=1
HOME=/root
PATH=/sbin:/bin:/usr/sbin:/usr/bin:/usr/local/sbin:/usr/local/bin:/root/bin
MAKE_OBJDIR_CHECK_WRITABLE=0
LOCALBASE=/usr/local
USER=root
POUDRIERE_NAME=poudriere-git
LIBEXECPREFIX=/usr/local/libexec/poudriere
POUDRIERE_VERSION=3.4.1-30-g79e3edcd
MASTERMNT=/usr/local/poudriere/data/.m/main-amd64-default/ref
LC_COLLATE=C
POUDRIERE_BUILD_TYPE=bulk
PACKAGE_BUILDING=yes
SAVED_TERM=
OUTPUT_REDIRECTED_STDERR=4
OUTPUT_REDIRECTED=1
PWD=/usr/local/poudriere/data/.m/main-amd64-default/08/.p
OUTPUT_REDIRECTED_STDOUT=3
P_PORTS_FEATURES=FLAVORS SUBPACKAGES SELECTED_OPTIONS
MASTERNAME=main-amd64-default
SCRIPTPREFIX=/usr/local/share/poudriere
SCRIPTNAME=bulk.sh
OLDPWD=/usr/local/poudriere/data/.m/main-amd64-default/ref/.p/pool
POUDRIERE_PKGNAME=poudriere-git-3.4.1-30-g79e3edcd
SCRIPTPATH=/usr/local/share/poudriere/bulk.sh
POUDRIEREPATH=/usr/local/bin/poudriere
---End Environment---

---Begin Poudriere Port Flags/Env---
PORT_FLAGS=
PKGENV=
FLAVOR=
MAKE_ARGS=
---End Poudriere Port Flags/Env---

---Begin OPTIONS List---
---End OPTIONS List---

--MAINTAINER--
ports@FreeBSD.org
--End MAINTAINER--

--CONFIGURE_ARGS--

--End CONFIGURE_ARGS--

--CONFIGURE_ENV--
PYTHON="/usr/local/bin/python3.11" XDG_DATA_HOME=/wrkdirs/usr/ports/lang/cling/work  XDG_CONFIG_HOME=/wrkdirs/usr/ports/lang/cling/work  XDG_CACHE_HOME=/wrkdirs/usr/ports/lang/cling/work/.cache  HOME=/wrkdirs/usr/ports/lang/cling/work TMPDIR="/tmp" PATH=/wrkdirs/usr/ports/lang/cling/work/.bin:/sbin:/bin:/usr/sbin:/usr/bin:/usr/local/sbin:/usr/local/bin:/root/bin PKG_CONFIG_LIBDIR=/wrkdirs/usr/ports/lang/cling/work/.pkgconfig:/usr/local/libdata/pkgconfig:/usr/local/share/pkgconfig:/usr/libdata/pkgconfig SHELL=/bin/sh CONFIG_SHELL=/bin/sh CMAKE_PREFIX_PATH="/usr/local"
--End CONFIGURE_ENV--

--MAKE_ENV--
NINJA_STATUS="[%p %s/%t] " XDG_DATA_HOME=/wrkdirs/usr/ports/lang/cling/work  XDG_CONFIG_HOME=/wrkdirs/usr/ports/lang/cling/work  XDG_CACHE_HOME=/wrkdirs/usr/ports/lang/cling/work/.cache  HOME=/wrkdirs/usr/ports/lang/cling/work TMPDIR="/tmp" PATH=/wrkdirs/usr/ports/lang/cling/work/.bin:/sbin:/bin:/usr/sbin:/usr/bin:/usr/local/sbin:/usr/local/bin:/root/bin PKG_CONFIG_LIBDIR=/wrkdirs/usr/ports/lang/cling/work/.pkgconfig:/usr/local/libdata/pkgconfig:/usr/local/share/pkgconfig:/usr/libdata/pkgconfig MK_DEBUG_FILES=no MK_KERNEL_SYMBOLS=no SHELL=/bin/sh NO_LINT=YES DESTDIR=/wrkdirs/usr/ports/lang/cling/work/stage PREFIX=/usr/local  LOCALBASE=/usr/local  CC="cc" CFLAGS="-O2 -pipe  -fstack-protector-strong -isystem /usr/local/include -fno-strict-aliasing "  CPP="cpp" CPPFLAGS="-isystem /usr/local/include"  LDFLAGS=" -fstack-protector-strong " LIBS="-L/usr/local/lib"  CXX="c++" CXXFLAGS="-O2 -pipe -fstack-protector-strong -isystem /usr/local/include -fno-strict-aliasing  -isystem /usr
/local/include " BSD_INSTALL_PROGRAM="install  -s -m 555"  BSD_INSTALL_LIB="install  -s -m 0644"  BSD_INSTALL_SCRIPT="install  -m 555"  BSD_INSTALL_DATA="install  -m 0644"  BSD_INSTALL_MAN="install  -m 444"
--End MAKE_ENV--

--PLIST_SUB--
LLVM_SUFFIX=50_cern-root LLVM_RELEASE=5.0.0 CMAKE_BUILD_TYPE="release" GTK2_VERSION="2.10.0"  GTK3_VERSION="3.0.0"  GTK4_VERSION="4.0.0" PYTHON_INCLUDEDIR=include/python3.11  PYTHON_LIBDIR=lib/python3.11  PYTHON_PLATFORM=freebsd15  PYTHON_SITELIBDIR=lib/python3.11/site-packages  PYTHON_SUFFIX=311  PYTHON_EXT_SUFFIX=.cpython-311  PYTHON_VER=3.11  PYTHON_VERSION=python3.11 PYTHON2="@comment " PYTHON3="" OSREL=15.0 PREFIX=%D LOCALBASE=/usr/local  RESETPREFIX=/usr/local LIB32DIR=lib DOCSDIR="share/doc/cling"  EXAMPLESDIR="share/examples/cling"  DATADIR="share/cling"  WWWDIR="www/cling"  ETCDIR="etc/cling"
--End PLIST_SUB--

--SUB_LIST--
LLVM_PREFIX="/usr/local/llvm50_cern-root" LLVM_SUFFIX="50_cern-root" PYTHON_INCLUDEDIR=/usr/local/include/python3.11  PYTHON_LIBDIR=/usr/local/lib/python3.11  PYTHON_PLATFORM=freebsd15  PYTHON_SITELIBDIR=/usr/local/lib/python3.11/site-packages  PYTHON_SUFFIX=311  PYTHON_EXT_SUFFIX=.cpython-311  PYTHON_VER=3.11  PYTHON_VERSION=python3.11 PYTHON2="@comment " PYTHON3="" PREFIX=/usr/local LOCALBASE=/usr/local  DATADIR=/usr/local/share/cling DOCSDIR=/usr/local/share/doc/cling EXAMPLESDIR=/usr/local/share/examples/cling  WWWDIR=/usr/local/www/cling ETCDIR=/usr/local/etc/cling
--End SUB_LIST--

---Begin make.conf---
# XXX: We really need this but cannot use it while 'make checksum' does not
# try the next mirror on checksum failure.  It currently retries the same
# failed mirror and then fails rather then trying another.  It *does*
# try the next if the size is mismatched though.
#MASTER_SITE_FREEBSD=yes
# Build ALLOW_MAKE_JOBS_PACKAGES with 3 jobs
MAKE_JOBS_NUMBER=3
USE_PACKAGE_DEPENDS=yes
BATCH=yes
WRKDIRPREFIX=/wrkdirs
PORTSDIR=/usr/ports
PACKAGES=/packages
DISTDIR=/distfiles
PACKAGE_BUILDING=yes
PACKAGE_BUILDING_FLAVORS=yes
####  ####
# XXX: We really need this but cannot use it while 'make checksum' does not
# try the next mirror on checksum failure.  It currently retries the same
# failed mirror and then fails rather then trying another.  It *does*
# try the next if the size is mismatched though.
#MASTER_SITE_FREEBSD=yes
# Build ALLOW_MAKE_JOBS_PACKAGES with 3 jobs
MAKE_JOBS_NUMBER=3
#### Misc Poudriere ####
.include "/etc/make.conf.ports_env"
GID=0
UID=0
---End make.conf---
--Resource limits--
cpu time               (seconds, -t)  unlimited
file size           (512-blocks, -f)  unlimited
data seg size           (kbytes, -d)  33554432
stack size              (kbytes, -s)  524288
core file size      (512-blocks, -c)  unlimited
max memory size         (kbytes, -m)  unlimited
locked memory           (kbytes, -l)  unlimited
max user processes              (-u)  89999
open files                      (-n)  8192
virtual mem size        (kbytes, -v)  unlimited
swap limit              (kbytes, -w)  unlimited
socket buffer size       (bytes, -b)  unlimited
pseudo-terminals                (-p)  unlimited
kqueues                         (-k)  unlimited
umtx shared locks               (-o)  unlimited
--End resource limits--
=======================<phase: check-sanity   >============================
===== env: NO_DEPENDS=yes USER=root UID=0 GID=0
===>   NOTICE:

The cling port currently does not have a maintainer. As a result, it is
more likely to have unresolved issues, not be up-to-date, or even be removed in
the future. To volunteer to maintain this port, please create an issue at:

https://bugs.freebsd.org/bugzilla

More information about port maintainership is available at:

https://docs.freebsd.org/en/articles/contributing/#ports-contributing

===>  License LLVM NCSA accepted by the user
===========================================================================
=======================<phase: pkg-depends    >============================
===== env: USE_PACKAGE_DEPENDS_ONLY=1 USER=root UID=0 GID=0
===>   cling-0.5.2018.08.13_12 depends on file: /usr/local/sbin/pkg - not found
===>   Installing existing package /packages/All/pkg-1.21.3.pkg
[main-amd64-default-job-08] Installing pkg-1.21.3...
[main-amd64-default-job-08] Extracting pkg-1.21.3: .......... done
===>   cling-0.5.2018.08.13_12 depends on file: /usr/local/sbin/pkg - found
===>   Returning to build of cling-0.5.2018.08.13_12
===========================================================================
=======================<phase: fetch-depends  >============================
===== env: USE_PACKAGE_DEPENDS_ONLY=1 USER=root UID=0 GID=0
===========================================================================
=======================<phase: fetch          >============================
===== env: NO_DEPENDS=yes USER=root UID=0 GID=0
===>   NOTICE:

The cling port currently does not have a maintainer. As a result, it is
more likely to have unresolved issues, not be up-to-date, or even be removed in
the future. To volunteer to maintain this port, please create an issue at:

https://bugs.freebsd.org/bugzilla

More information about port maintainership is available at:

https://docs.freebsd.org/en/articles/contributing/#ports-contributing

===>  License LLVM NCSA accepted by the user
===> Fetching all distfiles required by cling-0.5.2018.08.13_12 for building
===========================================================================
=======================<phase: checksum       >============================
===== env: NO_DEPENDS=yes USER=root UID=0 GID=0
===>   NOTICE:

The cling port currently does not have a maintainer. As a result, it is
more likely to have unresolved issues, not be up-to-date, or even be removed in
the future. To volunteer to maintain this port, please create an issue at:

https://bugs.freebsd.org/bugzilla

More information about port maintainership is available at:
<snip>
In file included from /wrkdirs/usr/ports/lang/cling/work/src/include/llvm/Analysis/CGSCCPassManager.h:93:
In file included from /wrkdirs/usr/ports/lang/cling/work/src/include/llvm/Analysis/LazyCallGraph.h:46:
In file included from /wrkdirs/usr/ports/lang/cling/work/src/include/llvm/Analysis/TargetLibraryInfo.h:16:
In file included from /wrkdirs/usr/ports/lang/cling/work/src/include/llvm/IR/CallSite.h:37:
/wrkdirs/usr/ports/lang/cling/work/src/include/llvm/IR/Instructions.h:4227:39: warning: 'DerefFnTy' is deprecated [-Wdeprecated-declarations]
 4227 |     return handler_iterator(op_end(), DerefFnTy(handler_helper));
      |                                       ^
/usr/include/c++/v1/__functional/pointer_to_unary_function.h:25:28: note: 'pointer_to_unary_function<llvm::Value *, llvm::BasicBlock *>' has been explicitly marked deprecated here
   25 | class _LIBCPP_TEMPLATE_VIS _LIBCPP_DEPRECATED_IN_CXX11 pointer_to_unary_function
      |                            ^
/usr/include/c++/v1/__config:992:41: note: expanded from macro '_LIBCPP_DEPRECATED_IN_CXX11'
  992 | #    define _LIBCPP_DEPRECATED_IN_CXX11 _LIBCPP_DEPRECATED
      |                                         ^
/usr/include/c++/v1/__config:977:49: note: expanded from macro '_LIBCPP_DEPRECATED'
  977 | #      define _LIBCPP_DEPRECATED __attribute__((__deprecated__))
      |                                                 ^
In file included from /wrkdirs/usr/ports/lang/cling/work/src/lib/Passes/PassBuilder.cpp:18:
In file included from /wrkdirs/usr/ports/lang/cling/work/src/include/llvm/Passes/PassBuilder.h:20:
In file included from /wrkdirs/usr/ports/lang/cling/work/src/include/llvm/Analysis/CGSCCPassManager.h:93:
In file included from /wrkdirs/usr/ports/lang/cling/work/src/include/llvm/Analysis/LazyCallGraph.h:46:
In file included from /wrkdirs/usr/ports/lang/cling/work/src/include/llvm/Analysis/TargetLibraryInfo.h:16:
In file included from /wrkdirs/usr/ports/lang/cling/work/src/include/llvm/IR/CallSite.h:37:
/wrkdirs/usr/ports/lang/cling/work/src/include/llvm/IR/Instructions.h:4233:45: warning: 'ConstDerefFnTy' is deprecated [-Wdeprecated-declarations]
 4233 |     return const_handler_iterator(op_end(), ConstDerefFnTy(handler_helper));
      |                                             ^
/usr/include/c++/v1/__functional/pointer_to_unary_function.h:25:28: note: 'pointer_to_unary_function<const llvm::Value *, const llvm::BasicBlock *>' has been explicitly marked deprecated here
   25 | class _LIBCPP_TEMPLATE_VIS _LIBCPP_DEPRECATED_IN_CXX11 pointer_to_unary_function
      |                            ^
/usr/include/c++/v1/__config:992:41: note: expanded from macro '_LIBCPP_DEPRECATED_IN_CXX11'
  992 | #    define _LIBCPP_DEPRECATED_IN_CXX11 _LIBCPP_DEPRECATED
      |                                         ^
/usr/include/c++/v1/__config:977:49: note: expanded from macro '_LIBCPP_DEPRECATED'
  977 | #      define _LIBCPP_DEPRECATED __attribute__((__deprecated__))
      |                                                 ^
In file included from /wrkdirs/usr/ports/lang/cling/work/src/lib/Passes/PassBuilder.cpp:18:
In file included from /wrkdirs/usr/ports/lang/cling/work/src/include/llvm/Passes/PassBuilder.h:20:
In file included from /wrkdirs/usr/ports/lang/cling/work/src/include/llvm/Analysis/CGSCCPassManager.h:97:
/wrkdirs/usr/ports/lang/cling/work/src/include/llvm/IR/ValueHandle.h:278:12: warning: definition of implicit copy constructor for 'AssertingVH<llvm::Value>' is deprecated because it has a user-provided copy assignment operator [-Wdeprecated-copy-with-user-provided-copy]
  278 |   ValueTy *operator=(const AssertingVH<ValueTy> &RHS) {
      |            ^
/wrkdirs/usr/ports/lang/cling/work/src/include/llvm/ADT/DenseMap.h:324:27: note: in implicit copy constructor for 'llvm::AssertingVH<llvm::Value>' first required here
  324 |     const KeyT EmptyKey = getEmptyKey();
      |                           ^
/wrkdirs/usr/ports/lang/cling/work/src/include/llvm/ADT/DenseMap.h:680:20: note: in instantiation of member function 'llvm::DenseMapBase<llvm::DenseMap<llvm::AssertingVH<llvm::Value>, unsigned int>, llvm::AssertingVH<llvm::Value>, unsigned int, llvm::DenseMapInfo<llvm::AssertingVH<llvm::Value>>, llvm::detail::DenseMapPair<llvm::AssertingVH<llvm::Value>, unsigned int>>::initEmpty' requested here
  680 |       this->BaseT::initEmpty();
      |                    ^
/wrkdirs/usr/ports/lang/cling/work/src/include/llvm/ADT/DenseMap.h:620:52: note: in instantiation of member function 'llvm::DenseMap<llvm::AssertingVH<llvm::Value>, unsigned int>::init' requested here
  620 |   explicit DenseMap(unsigned InitialReserve = 0) { init(InitialReserve); }
      |                                                    ^
/wrkdirs/usr/ports/lang/cling/work/src/include/llvm/Transforms/Scalar/Reassociate.h:58:7: note: in instantiation of member function 'llvm::DenseMap<llvm::AssertingVH<llvm::Value>, unsigned int>::DenseMap' requested here
   58 | class ReassociatePass : public PassInfoMixin<ReassociatePass> {
      |       ^
In file included from /wrkdirs/usr/ports/lang/cling/work/src/lib/Passes/PassBuilder.cpp:18:
In file included from /wrkdirs/usr/ports/lang/cling/work/src/include/llvm/Passes/PassBuilder.h:20:
In file included from /wrkdirs/usr/ports/lang/cling/work/src/include/llvm/Analysis/CGSCCPassManager.h:97:
/wrkdirs/usr/ports/lang/cling/work/src/include/llvm/IR/ValueHandle.h:278:12: warning: definition of implicit copy constructor for 'AssertingVH<llvm::Instruction>' is deprecated because it has a user-provided copy assignment operator [-Wdeprecated-copy-with-user-provided-copy]
  278 |   ValueTy *operator=(const AssertingVH<ValueTy> &RHS) {
      |            ^
/wrkdirs/usr/ports/lang/cling/work/src/include/llvm/ADT/DenseMap.h:324:27: note: in implicit copy constructor for 'llvm::AssertingVH<llvm::Instruction>' first required here
  324 |     const KeyT EmptyKey = getEmptyKey();
      |                           ^
/wrkdirs/usr/ports/lang/cling/work/src/include/llvm/ADT/DenseMap.h:680:20: note: in instantiation of member function 'llvm::DenseMapBase<llvm::DenseMap<llvm::AssertingVH<llvm::Instruction>, llvm::detail::DenseSetEmpty, llvm::DenseMapInfo<llvm::AssertingVH<llvm::Instruction>>, llvm::detail::DenseSetPair<llvm::AssertingVH<llvm::Instruction>>>, llvm::AssertingVH<llvm::Instruction>, llvm::detail::DenseSetEmpty, llvm::DenseMapInfo<llvm::AssertingVH<llvm::Instruction>>, llvm::detail::DenseSetPair<llvm::AssertingVH<llvm::Instruction>>>::initEmpty' requested here
  680 |       this->BaseT::initEmpty();
      |                    ^
/wrkdirs/usr/ports/lang/cling/work/src/include/llvm/ADT/DenseMap.h:620:52: note: in instantiation of member function 'llvm::DenseMap<llvm::AssertingVH<llvm::Instruction>, llvm::detail::DenseSetEmpty, llvm::DenseMapInfo<llvm::AssertingVH<llvm::Instruction>>, llvm::detail::DenseSetPair<llvm::AssertingVH<llvm::Instruction>>>::init' requested here
  620 |   explicit DenseMap(unsigned InitialReserve = 0) { init(InitialReserve); }
      |                                                    ^
/wrkdirs/usr/ports/lang/cling/work/src/include/llvm/ADT/DenseSet.h:67:56: note: in instantiation of member function 'llvm::DenseMap<llvm::AssertingVH<llvm::Instruction>, llvm::detail::DenseSetEmpty, llvm::DenseMapInfo<llvm::AssertingVH<llvm::Instruction>>, llvm::detail::DenseSetPair<llvm::AssertingVH<llvm::Instruction>>>::DenseMap' requested here
   67 |   explicit DenseSetImpl(unsigned InitialReserve = 0) : TheMap(InitialReserve) {}
      |                                                        ^
/wrkdirs/usr/ports/lang/cling/work/src/include/llvm/ADT/DenseSet.h:221:7: note: in instantiation of member function 'llvm::detail::DenseSetImpl<llvm::AssertingVH<llvm::Instruction>, llvm::DenseMap<llvm::AssertingVH<llvm::Instruction>, llvm::detail::DenseSetEmpty, llvm::DenseMapInfo<llvm::AssertingVH<llvm::Instruction>>, llvm::detail::DenseSetPair<llvm::AssertingVH<llvm::Instruction>>>, llvm::DenseMapInfo<llvm::AssertingVH<llvm::Instruction>>>::DenseSetImpl' requested here
  221 | class DenseSet : public detail::DenseSetImpl<
      |       ^
12 warnings generated.
[ 64% 2139/3294] : && /usr/bin/c++ -fPIC -O2 -pipe -fstack-protector-strong -isystem /usr/local/include -fno-strict-aliasing  -isystem /usr/local/include -fPIC -fvisibility-inlines-hidden -Werror=date-time -std=c++11 -Wall -W -Wno-unused-parameter -Wwrite-strings -Wcast-qual -Wmissing-field-initializers -pedantic -Wno-long-long -Wcovered-switch-default -Wnon-virtual-dtor -Wdelete-non-virtual-dtor -Wno-comment -Wstring-conversion -fcolor-diagnostics -ffunction-sections -fdata-sections -O2 -pipe -fstack-protector-strong -isystem /usr/local/include -fno-strict-aliasing  -isystem /usr/local/include  -DNDEBUG  -fstack-protector-strong -Wl,--color-diagnostics   -Wl,-z,origin  -Wl,-O3 -Wl,--gc-sections -shared -Wl,-soname,libLLVMPasses.so.5 -o lib/libLLVMPasses.so.5.0.0 lib/Passes/CMakeFiles/LLVMPasses.dir/PassBuilder.cpp.o -L/usr/local/lib -Wl,-rpath,"\$ORIGIN/../lib:/usr/local/lib"  lib/libLLVMCodeGen.so.5.0.0  lib/libLLVMipo.so.5.0.0  lib/libLLVMInstrumentation.so.5.0.0  lib/lib
LLVMScalarOpts.so.5.0.0  lib/libLLVMInstCombine.so.5.0.0  lib/libLLVMVectorize.so.5.0.0  lib/libLLVMTransformUtils.so.5.0.0  lib/libLLVMAnalysis.so.5.0.0  lib/libLLVMCore.so.5.0.0  lib/libLLVMSupport.so.5.0.0  -Wl,-rpath-link,/wrkdirs/usr/ports/lang/cling/work/.build/lib && :
[ 64% 2140/3294] /usr/local/bin/cmake -E cmake_symlink_library lib/libLLVMPasses.so.5.0.0  lib/libLLVMPasses.so.5 lib/libLLVMPasses.so && :
[ 64% 2141/3294] : && /usr/bin/c++ -fPIC -O2 -pipe -fstack-protector-strong -isystem /usr/local/include -fno-strict-aliasing  -isystem /usr/local/include -fPIC -fvisibility-inlines-hidden -Werror=date-time -std=c++11 -Wall -W -Wno-unused-parameter -Wwrite-strings -Wcast-qual -Wmissing-field-initializers -pedantic -Wno-long-long -Wcovered-switch-default -Wnon-virtual-dtor -Wdelete-non-virtual-dtor -Wno-comment -Wstring-conversion -fcolor-diagnostics -ffunction-sections -fdata-sections -O2 -pipe -fstack-protector-strong -isystem /usr/local/include -fno-strict-aliasing  -isystem /usr/local/include  -DNDEBUG  -fstack-protector-strong -Wl,--color-diagnostics   -Wl,-z,origin  -Wl,-O3 -Wl,--gc-sections -shared -Wl,-soname,libLLVMLTO.so.5 -o lib/libLLVMLTO.so.5.0.0 lib/LTO/CMakeFiles/LLVMLTO.dir/Caching.cpp.o lib/LTO/CMakeFiles/LLVMLTO.dir/LTO.cpp.o lib/LTO/CMakeFiles/LLVMLTO.dir/LTOBackend.cpp.o lib/LTO/CMakeFiles/LLVMLTO.dir/LTOModule.cpp.o lib/LTO/CMakeFiles/LLVMLTO.dir/LTOCodeGe
nerator.cpp.o lib/LTO/CMakeFiles/LLVMLTO.dir/UpdateCompilerUsed.cpp.o lib/LTO/CMakeFiles/LLVMLTO.dir/ThinLTOCodeGenerator.cpp.o -L/usr/local/lib -Wl,-rpath,"\$ORIGIN/../lib:/usr/local/lib"  lib/libLLVMObjCARCOpts.so.5.0.0  lib/libLLVMPasses.so.5.0.0  lib/libLLVMipo.so.5.0.0  lib/libLLVMCodeGen.so.5.0.0  lib/libLLVMTarget.so.5.0.0  lib/libLLVMBitWriter.so.5.0.0  lib/libLLVMLinker.so.5.0.0  lib/libLLVMScalarOpts.so.5.0.0  lib/libLLVMInstCombine.so.5.0.0  lib/libLLVMTransformUtils.so.5.0.0  lib/libLLVMAnalysis.so.5.0.0  lib/libLLVMObject.so.5.0.0  lib/libLLVMBitReader.so.5.0.0  lib/libLLVMMC.so.5.0.0  lib/libLLVMCore.so.5.0.0  lib/libLLVMSupport.so.5.0.0  -Wl,-rpath-link,/wrkdirs/usr/ports/lang/cling/work/.build/lib && :
[ 64% 2142/3294] /usr/local/bin/cmake -E cmake_symlink_library lib/libLLVMLTO.so.5.0.0  lib/libLLVMLTO.so.5 lib/libLLVMLTO.so && :
[ 64% 2143/3294] : && /usr/bin/c++ -fPIC -O2 -pipe -fstack-protector-strong -isystem /usr/local/include -fno-strict-aliasing  -isystem /usr/local/include -fPIC -fvisibility-inlines-hidden -Werror=date-time -std=c++11 -Wall -W -Wno-unused-parameter -Wwrite-strings -Wcast-qual -Wmissing-field-initializers -pedantic -Wno-long-long -Wcovered-switch-default -Wnon-virtual-dtor -Wdelete-non-virtual-dtor -Wno-comment -Wstring-conversion -fcolor-diagnostics -ffunction-sections -fdata-sections -O2 -pipe -fstack-protector-strong -isystem /usr/local/include -fno-strict-aliasing  -isystem /usr/local/include  -DNDEBUG  -fstack-protector-strong -Wl,--color-diagnostics   -Wl,-z,origin  -Wl,-O3 -Wl,--gc-sections  -Wl,--version-script,/wrkdirs/usr/ports/lang/cling/work/.build/tools/lto/LTO.exports -shared -Wl,-soname,libLTO.so.5 -o lib/libLTO.so.5.0.0 tools/lto/CMakeFiles/LTO.dir/LTODisassembler.cpp.o tools/lto/CMakeFiles/LTO.dir/lto.cpp.o -L/usr/local/lib -Wl,-rpath,"\$ORIGIN/../lib:/usr/loc
al/lib"  lib/libLLVMAArch64CodeGen.so.5.0.0  lib/libLLVMAArch64AsmParser.so.5.0.0  lib/libLLVMAArch64Disassembler.so.5.0.0  lib/libLLVMAMDGPUCodeGen.so.5.0.0  lib/libLLVMAMDGPUAsmParser.so.5.0.0  lib/libLLVMAMDGPUDisassembler.so.5.0.0  lib/libLLVMARMCodeGen.so.5.0.0  lib/libLLVMARMAsmParser.so.5.0.0  lib/libLLVMARMDisassembler.so.5.0.0  lib/libLLVMBPFCodeGen.so.5.0.0  lib/libLLVMBPFDesc.so.5.0.0  lib/libLLVMBPFDisassembler.so.5.0.0  lib/libLLVMBPFInfo.so.5.0.0  lib/libLLVMHexagonCodeGen.so.5.0.0  lib/libLLVMHexagonAsmParser.so.5.0.0  lib/libLLVMHexagonDisassembler.so.5.0.0  lib/libLLVMLanaiCodeGen.so.5.0.0  lib/libLLVMLanaiAsmParser.so.5.0.0  lib/libLLVMLanaiDisassembler.so.5.0.0  lib/libLLVMMipsCodeGen.so.5.0.0  lib/libLLVMMipsAsmParser.so.5.0.0  lib/libLLVMMipsDesc.so.5.0.0  lib/libLLVMMipsDisassembler.so.5.0.0  lib/libLLVMMipsInfo.so.5.0.0  lib/libLLVMMSP430CodeGen.so.5.0.0  lib/libLLVMMSP430Desc.so.5.0.0  lib/libLLVMMSP430Info.so.5.0.0  lib/libLLVMNVPTXCodeGen.so.5.0.0  
lib/libLLVMNVPTXDesc.so.5.0.0  lib/libLLVMNVPTXInfo.so.5.0.0  lib/libLLVMPowerPCCodeGen.so.5.0.0  lib/libLLVMPowerPCAsmParser.so.5.0.0  lib/libLLVMPowerPCDesc.so.5.0.0  lib/libLLVMPowerPCDisassembler.so.5.0.0  lib/libLLVMPowerPCInfo.so.5.0.0  lib/libLLVMSparcCodeGen.so.5.0.0  lib/libLLVMSparcAsmParser.so.5.0.0  lib/libLLVMSparcDesc.so.5.0.0  lib/libLLVMSparcDisassembler.so.5.0.0  lib/libLLVMSparcInfo.so.5.0.0  lib/libLLVMSystemZCodeGen.so.5.0.0  lib/libLLVMSystemZAsmParser.so.5.0.0  lib/libLLVMSystemZDisassembler.so.5.0.0  lib/libLLVMX86CodeGen.so.5.0.0  lib/libLLVMX86AsmParser.so.5.0.0  lib/libLLVMX86Desc.so.5.0.0  lib/libLLVMX86Disassembler.so.5.0.0  lib/libLLVMX86Info.so.5.0.0  lib/libLLVMXCoreCodeGen.so.5.0.0  lib/libLLVMXCoreDesc.so.5.0.0  lib/libLLVMXCoreDisassembler.so.5.0.0  lib/libLLVMXCoreInfo.so.5.0.0  lib/libLLVMLTO.so.5.0.0  lib/libLLVMAArch64Desc.so.5.0.0  lib/libLLVMAArch64AsmPrinter.so.5.0.0  lib/libLLVMAArch64Info.so.5.0.0  lib/libLLVMAArch64Utils.so.5.0.0  
lib/libLLVMAMDGPUDesc.so.5.0.0  lib/libLLVMAMDGPUAsmPrinter.so.5.0.0  lib/libLLVMAMDGPUInfo.so.5.0.0  lib/libLLVMAMDGPUUtils.so.5.0.0  lib/libLLVMARMDesc.so.5.0.0  lib/libLLVMARMAsmPrinter.so.5.0.0  lib/libLLVMARMInfo.so.5.0.0  lib/libLLVMBPFAsmPrinter.so.5.0.0  lib/libLLVMHexagonDesc.so.5.0.0  lib/libLLVMHexagonInfo.so.5.0.0  lib/libLLVMLanaiDesc.so.5.0.0  lib/libLLVMLanaiAsmPrinter.so.5.0.0  lib/libLLVMLanaiInfo.so.5.0.0  lib/libLLVMMipsAsmPrinter.so.5.0.0  lib/libLLVMMSP430AsmPrinter.so.5.0.0  lib/libLLVMNVPTXAsmPrinter.so.5.0.0  lib/libLLVMPowerPCAsmPrinter.so.5.0.0  lib/libLLVMSparcAsmPrinter.so.5.0.0  lib/libLLVMSystemZDesc.so.5.0.0  lib/libLLVMSystemZAsmPrinter.so.5.0.0  lib/libLLVMSystemZInfo.so.5.0.0  lib/libLLVMX86AsmPrinter.so.5.0.0  lib/libLLVMX86Utils.so.5.0.0  lib/libLLVMXCoreAsmPrinter.so.5.0.0  lib/libLLVMMCDisassembler.so.5.0.0  lib/libLLVMTarget.so.5.0.0  lib/libLLVMBitReader.so.5.0.0  lib/libLLVMMC.so.5.0.0  lib/libLLVMCore.so.5.0.0  lib/libLLVMSupport.so.
5.0.0  -Wl,-rpath-link,/wrkdirs/usr/ports/lang/cling/work/.build/lib && :
FAILED: lib/libLTO.so.5.0.0 
: && /usr/bin/c++ -fPIC -O2 -pipe -fstack-protector-strong -isystem /usr/local/include -fno-strict-aliasing  -isystem /usr/local/include -fPIC -fvisibility-inlines-hidden -Werror=date-time -std=c++11 -Wall -W -Wno-unused-parameter -Wwrite-strings -Wcast-qual -Wmissing-field-initializers -pedantic -Wno-long-long -Wcovered-switch-default -Wnon-virtual-dtor -Wdelete-non-virtual-dtor -Wno-comment -Wstring-conversion -fcolor-diagnostics -ffunction-sections -fdata-sections -O2 -pipe -fstack-protector-strong -isystem /usr/local/include -fno-strict-aliasing  -isystem /usr/local/include  -DNDEBUG  -fstack-protector-strong -Wl,--color-diagnostics   -Wl,-z,origin  -Wl,-O3 -Wl,--gc-sections  -Wl,--version-script,/wrkdirs/usr/ports/lang/cling/work/.build/tools/lto/LTO.exports -shared -Wl,-soname,libLTO.so.5 -o lib/libLTO.so.5.0.0 tools/lto/CMakeFiles/LTO.dir/LTODisassembler.cpp.o tools/lto/CMakeFiles/LTO.dir/lto.cpp.o -L/usr/local/lib -Wl,-rpath,"\$ORIGIN/../lib:/usr/local/lib"  lib/libL
LVMAArch64CodeGen.so.5.0.0  lib/libLLVMAArch64AsmParser.so.5.0.0  lib/libLLVMAArch64Disassembler.so.5.0.0  lib/libLLVMAMDGPUCodeGen.so.5.0.0  lib/libLLVMAMDGPUAsmParser.so.5.0.0  lib/libLLVMAMDGPUDisassembler.so.5.0.0  lib/libLLVMARMCodeGen.so.5.0.0  lib/libLLVMARMAsmParser.so.5.0.0  lib/libLLVMARMDisassembler.so.5.0.0  lib/libLLVMBPFCodeGen.so.5.0.0  lib/libLLVMBPFDesc.so.5.0.0  lib/libLLVMBPFDisassembler.so.5.0.0  lib/libLLVMBPFInfo.so.5.0.0  lib/libLLVMHexagonCodeGen.so.5.0.0  lib/libLLVMHexagonAsmParser.so.5.0.0  lib/libLLVMHexagonDisassembler.so.5.0.0  lib/libLLVMLanaiCodeGen.so.5.0.0  lib/libLLVMLanaiAsmParser.so.5.0.0  lib/libLLVMLanaiDisassembler.so.5.0.0  lib/libLLVMMipsCodeGen.so.5.0.0  lib/libLLVMMipsAsmParser.so.5.0.0  lib/libLLVMMipsDesc.so.5.0.0  lib/libLLVMMipsDisassembler.so.5.0.0  lib/libLLVMMipsInfo.so.5.0.0  lib/libLLVMMSP430CodeGen.so.5.0.0  lib/libLLVMMSP430Desc.so.5.0.0  lib/libLLVMMSP430Info.so.5.0.0  lib/libLLVMNVPTXCodeGen.so.5.0.0  lib/libLLVMNVPTXD
esc.so.5.0.0  lib/libLLVMNVPTXInfo.so.5.0.0  lib/libLLVMPowerPCCodeGen.so.5.0.0  lib/libLLVMPowerPCAsmParser.so.5.0.0  lib/libLLVMPowerPCDesc.so.5.0.0  lib/libLLVMPowerPCDisassembler.so.5.0.0  lib/libLLVMPowerPCInfo.so.5.0.0  lib/libLLVMSparcCodeGen.so.5.0.0  lib/libLLVMSparcAsmParser.so.5.0.0  lib/libLLVMSparcDesc.so.5.0.0  lib/libLLVMSparcDisassembler.so.5.0.0  lib/libLLVMSparcInfo.so.5.0.0  lib/libLLVMSystemZCodeGen.so.5.0.0  lib/libLLVMSystemZAsmParser.so.5.0.0  lib/libLLVMSystemZDisassembler.so.5.0.0  lib/libLLVMX86CodeGen.so.5.0.0  lib/libLLVMX86AsmParser.so.5.0.0  lib/libLLVMX86Desc.so.5.0.0  lib/libLLVMX86Disassembler.so.5.0.0  lib/libLLVMX86Info.so.5.0.0  lib/libLLVMXCoreCodeGen.so.5.0.0  lib/libLLVMXCoreDesc.so.5.0.0  lib/libLLVMXCoreDisassembler.so.5.0.0  lib/libLLVMXCoreInfo.so.5.0.0  lib/libLLVMLTO.so.5.0.0  lib/libLLVMAArch64Desc.so.5.0.0  lib/libLLVMAArch64AsmPrinter.so.5.0.0  lib/libLLVMAArch64Info.so.5.0.0  lib/libLLVMAArch64Utils.so.5.0.0  lib/libLLVMAMDGPU
Desc.so.5.0.0  lib/libLLVMAMDGPUAsmPrinter.so.5.0.0  lib/libLLVMAMDGPUInfo.so.5.0.0  lib/libLLVMAMDGPUUtils.so.5.0.0  lib/libLLVMARMDesc.so.5.0.0  lib/libLLVMARMAsmPrinter.so.5.0.0  lib/libLLVMARMInfo.so.5.0.0  lib/libLLVMBPFAsmPrinter.so.5.0.0  lib/libLLVMHexagonDesc.so.5.0.0  lib/libLLVMHexagonInfo.so.5.0.0  lib/libLLVMLanaiDesc.so.5.0.0  lib/libLLVMLanaiAsmPrinter.so.5.0.0  lib/libLLVMLanaiInfo.so.5.0.0  lib/libLLVMMipsAsmPrinter.so.5.0.0  lib/libLLVMMSP430AsmPrinter.so.5.0.0  lib/libLLVMNVPTXAsmPrinter.so.5.0.0  lib/libLLVMPowerPCAsmPrinter.so.5.0.0  lib/libLLVMSparcAsmPrinter.so.5.0.0  lib/libLLVMSystemZDesc.so.5.0.0  lib/libLLVMSystemZAsmPrinter.so.5.0.0  lib/libLLVMSystemZInfo.so.5.0.0  lib/libLLVMX86AsmPrinter.so.5.0.0  lib/libLLVMX86Utils.so.5.0.0  lib/libLLVMXCoreAsmPrinter.so.5.0.0  lib/libLLVMMCDisassembler.so.5.0.0  lib/libLLVMTarget.so.5.0.0  lib/libLLVMBitReader.so.5.0.0  lib/libLLVMMC.so.5.0.0  lib/libLLVMCore.so.5.0.0  lib/libLLVMSupport.so.5.0.0  -Wl,-rpath
-link,/wrkdirs/usr/ports/lang/cling/work/.build/lib && :
ld: error: version script assignment of 'LLVM_5.0' to symbol 'LLVMCreateDisasm' failed: symbol not defined
ld: error: version script assignment of 'LLVM_5.0' to symbol 'LLVMCreateDisasmCPU' failed: symbol not defined
ld: error: version script assignment of 'LLVM_5.0' to symbol 'LLVMDisasmDispose' failed: symbol not defined
ld: error: version script assignment of 'LLVM_5.0' to symbol 'LLVMDisasmInstruction' failed: symbol not defined
ld: error: version script assignment of 'LLVM_5.0' to symbol 'LLVMSetDisasmOptions' failed: symbol not defined
c++: error: linker command failed with exit code 1 (use -v to see invocation)
[ 65% 2143/3294] /usr/bin/c++ -DGTEST_HAS_RTTI=0 -DLLVM_BUILD_GLOBAL_ISEL -D_GNU_SOURCE -D__STDC_CONSTANT_MACROS -D__STDC_FORMAT_MACROS -D__STDC_LIMIT_MACROS -I/wrkdirs/usr/ports/lang/cling/work/.build/tools/clang/utils/TableGen -I/wrkdirs/usr/ports/lang/cling/work/src/tools/clang/utils/TableGen -I/wrkdirs/usr/ports/lang/cling/work/src/tools/clang/include -I/wrkdirs/usr/ports/lang/cling/work/.build/tools/clang/include -I/wrkdirs/usr/ports/lang/cling/work/.build/include -I/wrkdirs/usr/ports/lang/cling/work/src/include -O2 -pipe -fstack-protector-strong -isystem /usr/local/include -fno-strict-aliasing  -isystem /usr/local/include -fPIC -fvisibility-inlines-hidden -Werror=date-time -std=c++11 -Wall -W -Wno-unused-parameter -Wwrite-strings -Wcast-qual -Wmissing-field-initializers -pedantic -Wno-long-long -Wcovered-switch-default -Wnon-virtual-dtor -Wdelete-non-virtual-dtor -Wno-comment -Wstring-conversion -fcolor-diagnostics -ffunction-sections -fdata-sections -fno-common -Wover
loaded-virtual -Wno-nested-anon-types -O2 -pipe -fstack-protector-strong -isystem /usr/local/include -fno-strict-aliasing  -isystem /usr/local/include  -DNDEBUG  -fno-exceptions -fno-rtti -MD -MT tools/clang/utils/TableGen/CMakeFiles/clang-tblgen.dir/ClangCommentCommandInfoEmitter.cpp.o -MF tools/clang/utils/TableGen/CMakeFiles/clang-tblgen.dir/ClangCommentCommandInfoEmitter.cpp.o.d -o tools/clang/utils/TableGen/CMakeFiles/clang-tblgen.dir/ClangCommentCommandInfoEmitter.cpp.o -c /wrkdirs/usr/ports/lang/cling/work/src/tools/clang/utils/TableGen/ClangCommentCommandInfoEmitter.cpp
In file included from /wrkdirs/usr/ports/lang/cling/work/src/tools/clang/utils/TableGen/ClangCommentCommandInfoEmitter.cpp:15:
In file included from /wrkdirs/usr/ports/lang/cling/work/src/include/llvm/TableGen/Record.h:18:
In file included from /wrkdirs/usr/ports/lang/cling/work/src/include/llvm/ADT/ArrayRef.h:13:
In file included from /wrkdirs/usr/ports/lang/cling/work/src/include/llvm/ADT/Hashing.h:49:
In file included from /wrkdirs/usr/ports/lang/cling/work/src/include/llvm/Support/Host.h:17:
In file included from /wrkdirs/usr/ports/lang/cling/work/src/include/llvm/ADT/StringMap.h:17:
In file included from /wrkdirs/usr/ports/lang/cling/work/src/include/llvm/ADT/StringRef.h:13:
/wrkdirs/usr/ports/lang/cling/work/src/include/llvm/ADT/STLExtras.h:60:31: warning: 'unary_function<bool, bool>' is deprecated [-Wdeprecated-declarations]
   60 | struct identity : public std::unary_function<Ty, Ty> {
      |                               ^
/wrkdirs/usr/ports/lang/cling/work/src/include/llvm/ADT/STLExtras.h:453:19: note: in instantiation of template class 'llvm::identity<bool>' requested here
  453 |                   identity<bool>{});
      |                   ^
/usr/include/c++/v1/__functional/unary_function.h:23:29: note: 'unary_function<bool, bool>' has been explicitly marked deprecated here
   23 | struct _LIBCPP_TEMPLATE_VIS _LIBCPP_DEPRECATED_IN_CXX11 unary_function {
      |                             ^
/usr/include/c++/v1/__config:992:41: note: expanded from macro '_LIBCPP_DEPRECATED_IN_CXX11'
  992 | #    define _LIBCPP_DEPRECATED_IN_CXX11 _LIBCPP_DEPRECATED
      |                                         ^
/usr/include/c++/v1/__config:977:49: note: expanded from macro '_LIBCPP_DEPRECATED'
  977 | #      define _LIBCPP_DEPRECATED __attribute__((__deprecated__))
      |                                                 ^
1 warning generated.
[ 65% 2143/3294] /usr/bin/c++ -DGTEST_HAS_RTTI=0 -DLLVM_BUILD_GLOBAL_ISEL -D_GNU_SOURCE -D__STDC_CONSTANT_MACROS -D__STDC_FORMAT_MACROS -D__STDC_LIMIT_MACROS -I/wrkdirs/usr/ports/lang/cling/work/.build/tools/clang/utils/TableGen -I/wrkdirs/usr/ports/lang/cling/work/src/tools/clang/utils/TableGen -I/wrkdirs/usr/ports/lang/cling/work/src/tools/clang/include -I/wrkdirs/usr/ports/lang/cling/work/.build/tools/clang/include -I/wrkdirs/usr/ports/lang/cling/work/.build/include -I/wrkdirs/usr/ports/lang/cling/work/src/include -O2 -pipe -fstack-protector-strong -isystem /usr/local/include -fno-strict-aliasing  -isystem /usr/local/include -fPIC -fvisibility-inlines-hidden -Werror=date-time -std=c++11 -Wall -W -Wno-unused-parameter -Wwrite-strings -Wcast-qual -Wmissing-field-initializers -pedantic -Wno-long-long -Wcovered-switch-default -Wnon-virtual-dtor -Wdelete-non-virtual-dtor -Wno-comment -Wstring-conversion -fcolor-diagnostics -ffunction-sections -fdata-sections -fno-common -Wover
loaded-virtual -Wno-nested-anon-types -O2 -pipe -fstack-protector-strong -isystem /usr/local/include -fno-strict-aliasing  -isystem /usr/local/include  -DNDEBUG  -fno-exceptions -fno-rtti -MD -MT tools/clang/utils/TableGen/CMakeFiles/clang-tblgen.dir/ClangAttrEmitter.cpp.o -MF tools/clang/utils/TableGen/CMakeFiles/clang-tblgen.dir/ClangAttrEmitter.cpp.o.d -o tools/clang/utils/TableGen/CMakeFiles/clang-tblgen.dir/ClangAttrEmitter.cpp.o -c /wrkdirs/usr/ports/lang/cling/work/src/tools/clang/utils/TableGen/ClangAttrEmitter.cpp
In file included from /wrkdirs/usr/ports/lang/cling/work/src/tools/clang/utils/TableGen/ClangAttrEmitter.cpp:14:
In file included from /wrkdirs/usr/ports/lang/cling/work/src/include/llvm/ADT/ArrayRef.h:13:
In file included from /wrkdirs/usr/ports/lang/cling/work/src/include/llvm/ADT/Hashing.h:49:
In file included from /wrkdirs/usr/ports/lang/cling/work/src/include/llvm/Support/Host.h:17:
In file included from /wrkdirs/usr/ports/lang/cling/work/src/include/llvm/ADT/StringMap.h:17:
In file included from /wrkdirs/usr/ports/lang/cling/work/src/include/llvm/ADT/StringRef.h:13:
/wrkdirs/usr/ports/lang/cling/work/src/include/llvm/ADT/STLExtras.h:60:31: warning: 'unary_function<bool, bool>' is deprecated [-Wdeprecated-declarations]
   60 | struct identity : public std::unary_function<Ty, Ty> {
      |                               ^
/wrkdirs/usr/ports/lang/cling/work/src/include/llvm/ADT/STLExtras.h:453:19: note: in instantiation of template class 'llvm::identity<bool>' requested here
  453 |                   identity<bool>{});
      |                   ^
/usr/include/c++/v1/__functional/unary_function.h:23:29: note: 'unary_function<bool, bool>' has been explicitly marked deprecated here
   23 | struct _LIBCPP_TEMPLATE_VIS _LIBCPP_DEPRECATED_IN_CXX11 unary_function {
      |                             ^
/usr/include/c++/v1/__config:992:41: note: expanded from macro '_LIBCPP_DEPRECATED_IN_CXX11'
  992 | #    define _LIBCPP_DEPRECATED_IN_CXX11 _LIBCPP_DEPRECATED
      |                                         ^
/usr/include/c++/v1/__config:977:49: note: expanded from macro '_LIBCPP_DEPRECATED'
  977 | #      define _LIBCPP_DEPRECATED __attribute__((__deprecated__))
      |                                                 ^
In file included from /wrkdirs/usr/ports/lang/cling/work/src/tools/clang/utils/TableGen/ClangAttrEmitter.cpp:15:
/wrkdirs/usr/ports/lang/cling/work/src/include/llvm/ADT/DenseMap.h:110:14: warning: variable 'NumEntries' set but not used [-Wunused-but-set-variable]
  110 |     unsigned NumEntries = getNumEntries();
      |              ^
In file included from /wrkdirs/usr/ports/lang/cling/work/src/tools/clang/utils/TableGen/ClangAttrEmitter.cpp:14:
In file included from /wrkdirs/usr/ports/lang/cling/work/src/include/llvm/ADT/ArrayRef.h:13:
In file included from /wrkdirs/usr/ports/lang/cling/work/src/include/llvm/ADT/Hashing.h:49:
In file included from /wrkdirs/usr/ports/lang/cling/work/src/include/llvm/Support/Host.h:17:
In file included from /wrkdirs/usr/ports/lang/cling/work/src/include/llvm/ADT/StringMap.h:17:
In file included from /wrkdirs/usr/ports/lang/cling/work/src/include/llvm/ADT/StringRef.h:13:
/wrkdirs/usr/ports/lang/cling/work/src/include/llvm/ADT/STLExtras.h:1067:23: warning: definition of implicit copy constructor for 'enumerator_iter<std::vector<llvm::Record *> &>' is deprecated because it has a user-provided copy assignment operator [-Wdeprecated-copy-with-user-provided-copy]
 1067 |   enumerator_iter<R> &operator=(const enumerator_iter<R> &Other) {
      |                       ^
/wrkdirs/usr/ports/lang/cling/work/src/tools/clang/utils/TableGen/ClangAttrEmitter.cpp:3844:30: note: in implicit copy constructor for 'llvm::detail::enumerator_iter<std::vector<llvm::Record *> &>' first required here
 3844 |     for (const auto &Subject : llvm::enumerate(Subjects)) {
      |                              ^
In file included from /wrkdirs/usr/ports/lang/cling/work/src/tools/clang/utils/TableGen/ClangAttrEmitter.cpp:14:
In file included from /wrkdirs/usr/ports/lang/cling/work/src/include/llvm/ADT/ArrayRef.h:13:
In file included from /wrkdirs/usr/ports/lang/cling/work/src/include/llvm/ADT/Hashing.h:49:
In file included from /wrkdirs/usr/ports/lang/cling/work/src/include/llvm/Support/Host.h:17:
In file included from /wrkdirs/usr/ports/lang/cling/work/src/include/llvm/ADT/StringMap.h:17:
In file included from /wrkdirs/usr/ports/lang/cling/work/src/include/llvm/ADT/StringRef.h:13:
/wrkdirs/usr/ports/lang/cling/work/src/include/llvm/ADT/STLExtras.h:1019:19: warning: definition of implicit copy constructor for 'result_pair<std::vector<llvm::Record *> &>' is deprecated because it has a user-provided copy assignment operator [-Wdeprecated-copy-with-user-provided-copy]
 1019 |   result_pair<R> &operator=(const result_pair<R> &Other) {
      |                   ^
/wrkdirs/usr/ports/lang/cling/work/src/include/llvm/ADT/STLExtras.h:1035:7: note: in implicit copy constructor for 'llvm::detail::result_pair<std::vector<llvm::Record *> &>' first required here
 1035 | class enumerator_iter
      |       ^
/wrkdirs/usr/ports/lang/cling/work/src/tools/clang/utils/TableGen/ClangAttrEmitter.cpp:3844:30: note: in implicit copy constructor for 'llvm::detail::enumerator_iter<std::vector<llvm::Record *> &>' first required here
 3844 |     for (const auto &Subject : llvm::enumerate(Subjects)) {
      |                              ^
In file included from /wrkdirs/usr/ports/lang/cling/work/src/tools/clang/utils/TableGen/ClangAttrEmitter.cpp:14:
In file included from /wrkdirs/usr/ports/lang/cling/work/src/include/llvm/ADT/ArrayRef.h:13:
In file included from /wrkdirs/usr/ports/lang/cling/work/src/include/llvm/ADT/Hashing.h:49:
In file included from /wrkdirs/usr/ports/lang/cling/work/src/include/llvm/Support/Host.h:17:
In file included from /wrkdirs/usr/ports/lang/cling/work/src/include/llvm/ADT/StringMap.h:17:
In file included from /wrkdirs/usr/ports/lang/cling/work/src/include/llvm/ADT/StringRef.h:13:
/wrkdirs/usr/ports/lang/cling/work/src/include/llvm/ADT/STLExtras.h:1067:23: warning: definition of implicit copy constructor for 'enumerator_iter<llvm::ArrayRef<(anonymous namespace)::AttributeSubjectMatchRule>>' is deprecated because it has a user-provided copy assignment operator [-Wdeprecated-copy-with-user-provided-copy]
 1067 |   enumerator_iter<R> &operator=(const enumerator_iter<R> &Other) {
      |                       ^
/wrkdirs/usr/ports/lang/cling/work/src/tools/clang/utils/TableGen/ClangAttrEmitter.cpp:3854:29: note: in implicit copy constructor for 'llvm::detail::enumerator_iter<llvm::ArrayRef<(anonymous namespace)::AttributeSubjectMatchRule>>' first required here
 3854 |       for (const auto &Rule : llvm::enumerate(RuleSet.getAggregateRuleSet())) {
      |                             ^
In file included from /wrkdirs/usr/ports/lang/cling/work/src/tools/clang/utils/TableGen/ClangAttrEmitter.cpp:14:
In file included from /wrkdirs/usr/ports/lang/cling/work/src/include/llvm/ADT/ArrayRef.h:13:
In file included from /wrkdirs/usr/ports/lang/cling/work/src/include/llvm/ADT/Hashing.h:49:
In file included from /wrkdirs/usr/ports/lang/cling/work/src/include/llvm/Support/Host.h:17:
In file included from /wrkdirs/usr/ports/lang/cling/work/src/include/llvm/ADT/StringMap.h:17:
In file included from /wrkdirs/usr/ports/lang/cling/work/src/include/llvm/ADT/StringRef.h:13:
/wrkdirs/usr/ports/lang/cling/work/src/include/llvm/ADT/STLExtras.h:1019:19: warning: definition of implicit copy constructor for 'result_pair<llvm::ArrayRef<(anonymous namespace)::AttributeSubjectMatchRule>>' is deprecated because it has a user-provided copy assignment operator [-Wdeprecated-copy-with-user-provided-copy]
 1019 |   result_pair<R> &operator=(const result_pair<R> &Other) {
      |                   ^
/wrkdirs/usr/ports/lang/cling/work/src/include/llvm/ADT/STLExtras.h:1035:7: note: in implicit copy constructor for 'llvm::detail::result_pair<llvm::ArrayRef<(anonymous namespace)::AttributeSubjectMatchRule>>' first required here
 1035 | class enumerator_iter
      |       ^
/wrkdirs/usr/ports/lang/cling/work/src/tools/clang/utils/TableGen/ClangAttrEmitter.cpp:3854:29: note: in implicit copy constructor for 'llvm::detail::enumerator_iter<llvm::ArrayRef<(anonymous namespace)::AttributeSubjectMatchRule>>' first required here
 3854 |       for (const auto &Rule : llvm::enumerate(RuleSet.getAggregateRuleSet())) {
      |                             ^
6 warnings generated.
ninja: build stopped: subcommand failed.
===> Compilation failed unexpectedly.
Try to set MAKE_JOBS_UNSAFE=yes and rebuild before reporting the failure to
the maintainer.
*** Error code 1

Stop.
make: stopped in /usr/ports/lang/cling